{"text_format":"3","workbook":"xlsx","n_sheets":12,"sheets":["チーム表","対戦表","リーグ戦表","トーナメント表","優秀選手","DATA1","DATA","対戦表1","Sheet1","対戦表2","対戦表3","組合表"],"not_rendered":{"images":7,"macros":1,"defined_names":5},"read":"whole","date_system":"1900"}

{"sheet":"チーム表","index":0,"n_rows":45,"n_cols":6,"rows_kept":45,"merged":[[0,1,0,5],[1,1,1,4]]}
[null,"第２０回　加賀地域少年少女ドッジボール大会"]
[]
[null,"番号","ﾌﾞﾛｯｸ","チ　ー　ム　名","代表者名","県名"]
[null,1,"A1","鞍月アタッカーズ","廣岡　俊和","石川"]
[null,2,"A2","針原パイレーツ","木原　清志","富山"]
[null,3,"A3","小木クラブ","福田　陽三","石川"]
{"$rows_left_out":40}
{"sheet":"対戦表","index":1,"n_rows":164,"n_cols":34,"rows_kept":164,"merged":[[32,5,32,10],[32,15,32,20],[32,25,32,30],[33,5,33,10],[33,15,33,20],[33,25,33,30],[34,5,34,10],[34,15,34,20],[34,25,34,30],[35,5,35,10],[35,15,35,20],[35,25,35,30],[36,5,36,10],[36,15,36,20],[36,25,36,30],[37,5,37,10],[37,15,37,20],[37,25,37,30],[38,5,38,10],[38,15,38,20],[38,25,38,30],[39,5,39,10],[39,15,39,20],[40,5,40,10],[40,15,40,20],[41,5,41,10],[41,15,41,20],[41,25,41,30],[42,5,42,10],[42,15,42,20],[43,5,43,10],[43,15,43,20],[44,5,44,10],[44,15,44,20]]}
[{"$nulls":10},{"$f":"チーム表!$B$1","v":"第２０回　加賀地域少年少女ドッジボール大会"},{"$nulls":13},"予選試合数",26]
[]
["　試合スケジュール"]
[]
[null,"時間",null,null,"点","Ａコート",{"$nulls":3},"点","Ａコート",{"$nulls":3},"点","Ｂコート",{"$nulls":3},"点","Ｂコート"]
[1,"09:30:00",{"$f":"組合表!AG4","v":"D1"},{"$f":"CONCATENATE(C6,H6)","v":"D1D2"},10,{"$f":"VLOOKUP(C6,チーム表!C:D,2,FALSE)","v":"飯野マジックス"},"×",{"$f":"組合表!AH4","v":"D2"},{"$f":"CONCATENATE(H6,C6)","v":"D2D1"},7,{"$f":"VLOOKUP(H6,チーム表!C:D,2,FALSE)","v":"三馬パワフル"},null,{"$f":"組合表!AI4","v":"A1"},{"$f":"CONCATENATE(M6,R6)","v":"A1A2"},7,{"$f":"VLOOKUP(M6,チーム表!C:D,2,FALSE)","v":"鞍月アタッカーズ"},"×",{"$f":"組合表!AJ4","v":"A2"},{"$f":"CONCATENATE(R6,M6)","v":"A2A1"},9,{"$f":"VLOOKUP(R6,チーム表!C:D,2,FALSE)","v":"針原パイレーツ"},{"$nulls":11},{"$f":"D6","v":"D1D2"},{"$f":"IF(E6=\"\",\"\",E6)","v":10}]
{"$rows_left_out":159}
{"sheet":"リーグ戦表","index":2,"n_rows":100,"n_cols":35,"rows_kept":100,"merged":[[1,2,1,11],[4,0,5,0],[4,1,5,2],[4,3,5,5],[4,6,5,8],[4,9,5,11],[4,12,5,14],[4,15,5,17],[4,18,5,20],[4,21,5,23],[4,24,5,24],[4,25,5,25],[4,26,5,26],[4,27,5,27],[4,28,5,28],[4,29,5,29],[4,30,5,30],[4,31,5,31],[4,32,5,32],[6,0,7,0],[6,1,7,2],[6,3,7,5],[6,24,7,24],[6,25,7,25],[6,26,7,26],[6,27,7,27],[6,28,7,28],[6,29,7,29],[6,30,7,30],[6,31,7,31],[6,32,7,32],[8,0,9,0],[8,1,9,2],[8,6,9,8],[8,24,9,24],[8,25,9,25],[8,26,9,26],[8,27,9,27],[8,28,9,28],[8,29,9,29],[8,30,9,30],[8,31,9,31],[8,32,9,32],[10,0,11,0],[10,1,11,2],[10,9,11,11],[10,24,11,24],[10,25,11,25],[10,26,11,26],[10,27,11,27],[10,28,11,28],[10,29,11,29],[10,30,11,30],[10,31,11,31],[10,32,11,32],[12,0,13,0],[12,1,13,2],[12,12,13,14],[12,24,13,24],[12,25,13,25],[12,26,13,26],[12,27,13,27],[12,28,13,28],[12,29,13,29],[12,30,13,30],[12,31,13,31],[12,32,13,32],[16,0,17,0],[16,1,17,2],[16,3,17,5],[16,6,17,8],[16,9,17,11],[16,12,17,14],[16,15,17,17],[16,18,17,20],[16,21,17,23],[16,24,17,24],[16,25,17,25],[16,26,17,26],[16,27,17,27],[16,28,17,28],[16,29,17,29],[16,30,17,30],[16,31,17,31],[16,32,17,32],[18,0,19,0],[18,1,19,2],[18,3,19,5],[18,24,19,24],[18,25,19,25],[18,26,19,26],[18,27,19,27],[18,28,19,28],[18,29,19,29],[18,30,19,30],[18,31,19,31],[18,32,19,32],[20,0,21,0],[20,1,21,2],[20,6,21,8],[20,24,21,24],[20,25,21,25],[20,26,21,26],[20,27,21,27],[20,28,21,28],[20,29,21,29],[20,30,21,30],[20,31,21,31],[20,32,21,32],[22,0,23,0],[22,1,23,2],[22,9,23,11],[22,24,23,24],[22,25,23,25],[22,26,23,26],[22,27,23,27],[22,28,23,28],[22,29,23,29],[22,30,23,30],[22,31,23,31],[22,32,23,32],[24,0,25,0],[24,1,25,2],[24,12,25,14],[24,24,25,24],[24,25,25,25],[24,26,25,26],[24,27,25,27],[24,28,25,28],[24,29,25,29],[24,30,25,30],[24,31,25,31],[24,32,25,32],[28,0,29,0],[28,1,29,2],[28,3,29,5],[28,6,29,8],[28,9,29,11],[28,12,29,14],[28,15,29,17],[28,18,29,20],[28,21,29,23],[28,24,29,24],[28,25,29,25],[28,26,29,26],[28,27,29,27],[28,28,29,28],[28,29,29,29],[28,30,29,30],[28,31,29,31],[28,32,29,32],[30,0,31,0],[30,1,31,2],[30,3,31,5],[30,24,31,24],[30,25,31,25],[30,26,31,26],[30,27,31,27],[30,28,31,28],[30,29,31,29],[30,30,31,30],[30,31,31,31],[30,32,31,32],[32,0,33,0],[32,1,33,2],[32,6,33,8],[32,24,33,24],[32,25,33,25],[32,26,33,26],[32,27,33,27],[32,28,33,28],[32,29,33,29],[32,30,33,30],[32,31,33,31],[32,32,33,32],[34,0,35,0],[34,1,35,2],[34,9,35,11],[34,24,35,24],[34,25,35,25],[34,26,35,26],[34,27,35,27],[34,28,35,28],[34,29,35,29],[34,30,35,30],[34,31,35,31],[34,32,35,32],[36,0,37,0],[36,1,37,2],[36,12,37,14],[36,24,37,24],[36,25,37,25],[36,26,37,26],[36,27,37,27],[36,28,37,28],[36,29,37,29],[36,30,37,30],[36,31,37,31],[36,32,37,32],[40,0,41,0],[40,1,41,2],[40,3,41,5],[40,6,41,8],[40,9,41,11],[40,12,41,14],[40,15,41,17],[40,18,41,20],[40,21,41,23],[40,24,41,24],[40,25,41,25],[40,26,41,26],[40,27,41,27],[40,28,41,28],[40,29,41,29],[40,30,41,30],[40,31,41,31],[40,32,41,32],[42,0,43,0],[42,1,43,2],[42,3,43,5],[42,24,43,24],[42,25,43,25],[42,26,43,26],[42,27,43,27],[42,28,43,28],[42,29,43,29],[42,30,43,30],[42,31,43,31],[42,32,43,32],[44,0,45,0],[44,1,45,2],[44,6,45,8],[44,24,45,24],[44,25,45,25],[44,26,45,26],[44,27,45,27],[44,28,45,28],[44,29,45,29],[44,30,45,30],[44,31,45,31],[44,32,45,32],[46,0,47,0],[46,1,47,2],[46,9,47,11],[46,24,47,24],[46,25,47,25],[46,26,47,26],[46,27,47,27],[46,28,47,28],[46,29,47,29],[46,30,47,30],[46,31,47,31],[46,32,47,32],[48,0,49,0],[48,1,49,2],[48,12,49,14],[48,24,49,24],[48,25,49,25],[48,26,49,26],[48,27,49,27],[48,28,49,28],[48,29,49,29],[48,30,49,30],[48,31,49,31],[48,32,49,32],[50,0,51,0],[50,1,51,2],[50,15,51,17],[50,24,51,24],[50,25,51,25],[50,26,51,26],[50,27,51,27],[50,28,51,28],[50,29,51,29],[50,30,51,30],[50,31,51,31],[50,32,51,32],[54,0,55,0],[54,1,55,2],[54,3,55,5],[54,6,55,8],[54,9,55,11],[54,12,55,14],[54,15,55,17],[54,18,55,20],[54,21,55,23],[54,24,55,24],[54,25,55,25],[54,26,55,26],[54,27,55,27],[54,28,55,28],[54,29,55,29],[54,30,55,30],[54,31,55,31],[54,32,55,32],[56,0,57,0],[56,1,57,2],[56,3,57,5],[56,24,57,24],[56,25,57,25],[56,26,57,26],[56,27,57,27],[56,28,57,28],[56,29,57,29],[56,30,57,30],[56,31,57,31],[56,32,57,32],[58,0,59,0],[58,1,59,2],[58,6,59,8],[58,24,59,24],[58,25,59,25],[58,26,59,26],[58,27,59,27],[58,28,59,28],[58,29,59,29],[58,30,59,30],[58,31,59,31],[58,32,59,32],[60,0,61,0],[60,1,61,2],[60,9,61,11],[60,24,61,24],[60,25,61,25],[60,26,61,26],[60,27,61,27],[60,28,61,28],[60,29,61,29],[60,30,61,30],[60,31,61,31],[60,32,61,32],[62,0,63,0],[62,1,63,2],[62,12,63,14],[62,24,63,24],[62,25,63,25],[62,26,63,26],[62,27,63,27],[62,28,63,28],[62,29,63,29],[62,30,63,30],[62,31,63,31],[62,32,63,32],[66,0,67,0],[66,1,67,2],[66,3,67,5],[66,6,67,8],[66,9,67,11],[66,12,67,14],[66,15,67,17],[66,18,67,20],[66,21,67,23],[66,24,67,24],[66,25,67,25],[66,26,67,26],[66,27,67,27],[66,28,67,28],[66,29,67,29],[66,30,67,30],[66,31,67,31],[66,32,67,32],[68,0,69,0],[68,1,69,2],[68,3,69,5],[68,24,69,24],[68,25,69,25],[68,26,69,26],[68,27,69,27],[68,28,69,28],[68,29,69,29],[68,30,69,30],[68,31,69,31],[68,32,69,32],[70,0,71,0],[70,1,71,2],[70,6,71,8],[70,24,71,24],[70,25,71,25],[70,26,71,26],[70,27,71,27],[70,28,71,28],[70,29,71,29],[70,30,71,30],[70,31,71,31],[70,32,71,32],[72,0,73,0],[72,1,73,2],[72,9,73,11],[72,24,73,24],[72,25,73,25],[72,26,73,26],[72,27,73,27],[72,28,73,28],[72,29,73,29],[72,30,73,30],[72,31,73,31],[72,32,73,32],[74,0,75,0],[74,1,75,2],[74,12,75,14],[74,24,75,24],[74,25,75,25],[74,26,75,26],[74,27,75,27],[74,28,75,28],[74,29,75,29],[74,30,75,30],[74,31,75,31],[74,32,75,32],[78,0,79,0],[78,1,79,2],[78,3,79,5],[78,6,79,8],[78,9,79,11],[78,12,79,14],[78,15,79,17],[78,18,79,20],[78,21,79,23],[78,24,79,24],[78,25,79,25],[78,26,79,26],[78,27,79,27],[78,28,79,28],[78,29,79,29],[78,30,79,30],[78,31,79,31],[78,32,79,32],[80,0,81,0],[80,1,81,2],[80,3,81,5],[80,24,81,24],[80,25,81,25],[80,26,81,26],[80,27,81,27],[80,28,81,28],[80,29,81,29],[80,30,81,30],[80,31,81,31],[80,32,81,32],[82,0,83,0],[82,1,83,2],[82,6,83,8],[82,24,83,24],[82,25,83,25],[82,26,83,26],[82,27,83,27],[82,28,83,28],[82,29,83,29],[82,30,83,30],[82,31,83,31],[82,32,83,32],[84,0,85,0],[84,1,85,2],[84,9,85,11],[84,24,85,24],[84,25,85,25],[84,26,85,26],[84,27,85,27],[84,28,85,28],[84,29,85,29],[84,30,85,30],[84,31,85,31],[84,32,85,32],[86,0,87,0],[86,1,87,2],[86,12,87,14],[86,24,87,24],[86,25,87,25],[86,26,87,26],[86,27,87,27],[86,28,87,28],[86,29,87,29],[86,30,87,30],[86,31,87,31],[86,32,87,32],[90,0,91,0],[90,1,91,2],[90,3,91,5],[90,6,91,8],[90,9,91,11],[90,12,91,14],[90,15,91,17],[90,18,91,20],[90,21,91,23],[90,24,91,24],[90,25,91,25],[90,26,91,26],[90,27,91,27],[90,28,91,28],[90,29,91,29],[90,30,91,30],[90,31,91,31],[90,32,91,32],[92,0,93,0],[92,1,93,2],[92,3,93,5],[92,24,93,24],[92,25,93,25],[92,26,93,26],[92,27,93,27],[92,28,93,28],[92,29,93,29],[92,30,93,30],[92,31,93,31],[92,32,93,32],[94,0,95,0],[94,1,95,2],[94,6,95,8],[94,24,95,24],[94,25,95,25],[94,26,95,26],[94,27,95,27],[94,28,95,28],[94,29,95,29],[94,30,95,30],[94,31,95,31],[94,32,95,32],[96,0,97,0],[96,1,97,2],[96,9,97,11],[96,24,97,24],[96,25,97,25],[96,26,97,26],[96,27,97,27],[96,28,97,28],[96,29,97,29],[96,30,97,30],[96,31,97,31],[96,32,97,32],[98,0,99,0],[98,1,99,2],[98,12,99,14],[98,24,99,24],[98,25,99,25],[98,26,99,26],[98,27,99,27],[98,28,99,28],[98,29,99,29],[98,30,99,30],[98,31,99,31],[98,32,99,32]]}
[null,null,{"$f":"チーム表!$B$1","v":"第２０回　加賀地域少年少女ドッジボール大会"}]
[null,null,"リーグ戦表"]
[null,"レギュラーの部"]
[{"$nulls":4},{"$f":"CONCATENATE(A5,\"1\")","v":"A1"},null,null,{"$f":"CONCATENATE(A5,\"2\")","v":"A2"},null,null,{"$f":"CONCATENATE(A5,\"3\")","v":"A3"},null,null,{"$f":"CONCATENATE(A5,\"4\")","v":"A4"}]
["A","チーム名",null,{"$f":"B7","v":"鞍月アタッカーズ"},null,null,{"$f":"B9","v":"針原パイレーツ"},null,null,{"$f":"B11","v":"小木クラブ"},null,null,{"$f":"B13","v":"NISHIファイヤースターズ"},{"$nulls":11},"勝","負","分","点","内野","順位決定点","相手内野","順位","kaku"]
[]
{"$rows_left_out":95}
{"sheet":"トーナメント表","index":3,"n_rows":124,"n_cols":41,"rows_kept":124,"merged":[[4,0,5,0],[4,1,5,8],[8,0,9,0],[8,1,9,8],[12,0,13,0],[12,1,13,8],[15,20,16,21],[16,0,17,0],[16,1,17,8],[17,21,18,28],[20,0,21,0],[20,1,21,8],[24,0,25,0],[24,1,25,8],[28,0,29,0],[28,1,29,8],[32,0,33,0],[32,1,33,8],[36,9,37,14],[38,21,39,28],[40,9,41,14],[47,0,48,0],[47,1,48,8],[51,0,52,0],[51,1,52,8],[55,0,56,0],[55,1,56,8],[59,0,60,0],[59,1,60,8],[60,22,61,24],[63,0,64,0],[63,1,64,8],[63,22,64,29],[67,0,68,0],[67,1,68,8],[71,0,72,0],[71,1,72,8],[75,0,76,0],[75,1,76,8],[79,0,80,0],[79,1,80,8],[86,0,87,0],[86,1,87,8],[90,0,91,0],[90,1,91,8],[94,0,95,0],[94,1,95,8],[98,0,99,0],[98,1,99,8],[99,21,100,28],[102,0,103,0],[102,1,103,8],[106,0,107,0],[106,1,107,8],[110,0,111,0],[110,1,111,8],[114,0,115,0],[114,1,115,8],[118,9,119,14],[120,21,121,28],[122,9,123,14]]}
[null,"レギュラーの部",{"$nulls":5},"決勝トーナメント"]
[]
[]
[null,"A1",{"$nulls":19},"優勝","松任の大魔陣"]
["Ａ1位",{"$f":"VLOOKUP(B4,リーグ戦表!AH:AI,2,0)","v":"針原パイレーツ"},{"$nulls":7},8]
[{"$nulls":21},"準優勝","千坂ドッジファイヤーズ",{"$nulls":16},"A1",{"$f":"VLOOKUP(AN6,リーグ戦表!AH:AI,2,0)","v":"針原パイレーツ"}]
{"$rows_left_out":119}
{"sheet":"優秀選手","index":4,"n_rows":45,"n_cols":8,"rows_kept":45,"merged":[[0,1,0,7],[1,1,1,5]]}
[null,"第２０回　加賀地域少年少女ドッジボール大会優秀選手"]
[]
[null,"番号","ﾌﾞﾛｯｸ","チ　ー　ム　名","氏名","ふりがな","学年","性別"]
[null,{"$f":"チーム表!B4","v":1},{"$f":"チーム表!C4","v":"A1"},{"$f":"チーム表!D4","v":"鞍月アタッカーズ"}]
[null,{"$f":"チーム表!B5","v":2},{"$f":"チーム表!C5","v":"A2"},{"$f":"チーム表!D5","v":"針原パイレーツ"},"深井　良映","ふかいりょうえい",6,"女"]
[null,{"$f":"チーム表!B6","v":3},{"$f":"チーム表!C6","v":"A3"},{"$f":"チーム表!D6","v":"小木クラブ"},"谷口　拓矢","たにぐち　たくや",4,"男"]
{"$rows_left_out":40}
{"sheet":"DATA1","index":5,"n_rows":365,"n_cols":25,"rows_kept":365,"merged":[[3,0,4,0],[3,1,4,9],[7,0,8,0],[7,1,8,9],[11,0,12,0],[11,1,12,9],[15,0,16,0],[15,1,16,9],[19,0,20,0],[19,1,20,9],[23,0,24,0],[23,1,24,9],[27,0,28,0],[27,1,28,9],[31,0,32,0],[31,1,32,9],[35,0,36,0],[35,1,36,9],[39,0,40,0],[39,1,40,9],[43,0,44,0],[43,1,44,9],[47,0,48,0],[47,1,48,9],[51,0,52,0],[51,1,52,9],[55,0,56,0],[55,1,56,9],[59,0,60,0],[59,1,60,9],[63,0,64,0],[63,1,64,9],[71,0,72,0],[71,1,72,9],[77,0,78,0],[77,1,78,9],[81,0,82,0],[81,1,82,9],[85,0,86,0],[85,1,86,9],[89,0,90,0],[89,1,90,9],[93,0,94,0],[93,1,94,9],[97,0,98,0],[97,1,98,9],[101,0,102,0],[101,1,102,9],[105,0,106,0],[105,1,106,9],[109,0,110,0],[109,1,110,9],[113,0,114,0],[113,1,114,9],[117,0,118,0],[117,1,118,9],[121,0,122,0],[121,1,122,9],[127,0,128,0],[127,1,128,9],[139,0,140,0],[139,1,140,9],[147,0,148,0],[147,1,148,9],[153,0,154,0],[153,1,154,9],[157,0,158,0],[157,1,158,9],[161,0,162,0],[161,1,162,9],[165,0,166,0],[165,1,166,9],[169,0,170,0],[169,1,170,9],[173,0,174,0],[173,1,174,9],[177,0,178,0],[177,1,178,9],[181,0,182,0],[181,1,182,9],[187,0,188,0],[187,1,188,9],[195,0,196,0],[195,1,196,9],[211,0,212,0],[211,1,212,9],[221,0,222,0],[221,1,222,9],[225,0,226,0],[225,1,226,9],[229,0,230,0],[229,1,230,9],[233,0,234,0],[233,1,234,9],[237,0,238,0],[237,1,238,9],[241,0,242,0],[241,1,242,9],[245,0,246,0],[245,1,246,9],[249,0,250,0],[249,1,250,9],[259,0,260,0],[259,1,260,9],[275,0,276,0],[275,1,276,9],[279,0,280,0],[279,1,280,9],[283,0,284,0],[283,1,284,9],[287,0,288,0],[287,1,288,9],[291,0,292,0],[291,1,292,9],[295,0,296,0],[295,1,296,9],[299,0,300,0],[299,1,300,9],[303,0,304,0],[303,1,304,9],[310,0,311,0],[310,1,311,9],[316,0,317,0],[316,1,317,9],[320,0,321,0],[320,1,321,9],[324,0,325,0],[324,1,325,9],[328,0,329,0],[328,1,329,9],[334,0,335,0],[334,1,335,9],[343,0,344,0],[343,1,344,9],[347,0,348,0],[347,1,348,9],[351,0,352,0],[351,1,352,9],[355,0,356,0],[355,1,356,9],[360,0,361,0],[360,1,361,9],[364,0,365,0],[364,1,365,9]]}
{"$rows_empty":69}
[null,"14チーム"]
[{"$nulls":20},"A1"]
[1,{"$nulls":19},"A2"]
[{"$nulls":20},"B1",{"$f":"VLOOKUP(U71,リーグ戦表!AH:AI,2,0)","v":"針原パイレーツ"}]
[{"$nulls":20},"B2",{"$f":"VLOOKUP(U72,リーグ戦表!AH:AI,2,0)","v":"小木クラブ"}]
{"$rows_left_out":264}
{"sheet":"DATA","index":6,"n_rows":76,"n_cols":38,"rows_kept":76,"merged":[[4,0,5,0],[4,1,5,2],[4,3,5,5],[4,6,5,8],[4,9,5,11],[4,12,5,14],[4,15,5,17],[4,18,5,20],[4,21,5,23],[4,24,5,24],[4,25,5,25],[4,26,5,26],[4,27,5,27],[4,28,5,28],[4,29,5,29],[4,30,5,30],[4,31,5,31],[4,32,5,32],[6,0,7,0],[6,1,7,2],[6,3,7,5],[6,24,7,24],[6,25,7,25],[6,26,7,26],[6,27,7,27],[6,28,7,28],[6,29,7,29],[6,30,7,30],[6,31,7,31],[6,32,7,32],[8,0,9,0],[8,1,9,2],[8,6,9,8],[8,24,9,24],[8,25,9,25],[8,26,9,26],[8,27,9,27],[8,28,9,28],[8,29,9,29],[8,30,9,30],[8,31,9,31],[8,32,9,32],[10,0,11,0],[10,1,11,2],[10,9,11,11],[10,24,11,24],[10,25,11,25],[10,26,11,26],[10,27,11,27],[10,28,11,28],[10,29,11,29],[10,30,11,30],[10,31,11,31],[10,32,11,32],[12,0,13,0],[12,1,13,2],[12,12,13,14],[12,24,13,24],[12,25,13,25],[12,26,13,26],[12,27,13,27],[12,28,13,28],[12,29,13,29],[12,30,13,30],[12,31,13,31],[12,32,13,32],[14,0,15,0],[14,1,15,2],[14,15,15,17],[14,24,15,24],[14,25,15,25],[14,26,15,26],[14,27,15,27],[14,28,15,28],[14,29,15,29],[14,30,15,30],[14,31,15,31],[14,32,15,32],[16,0,17,0],[16,1,17,2],[16,18,17,20],[16,24,17,24],[16,25,17,25],[16,26,17,26],[16,27,17,27],[16,28,17,28],[16,29,17,29],[16,30,17,30],[16,31,17,31],[16,32,17,32],[18,0,19,0],[18,1,19,2],[18,21,19,23],[18,24,19,24],[18,25,19,25],[18,26,19,26],[18,27,19,27],[18,28,19,28],[18,29,19,29],[18,30,19,30],[18,31,19,31],[18,32,19,32],[23,0,24,0],[23,1,24,2],[23,3,24,5],[23,6,24,8],[23,9,24,11],[23,12,24,14],[23,15,24,17],[23,18,24,20],[23,21,24,23],[23,24,24,24],[23,25,24,25],[23,26,24,26],[23,27,24,27],[23,28,24,28],[23,29,24,29],[23,30,24,30],[23,31,24,31],[23,32,24,32],[25,0,26,0],[25,1,26,2],[25,3,26,5],[25,24,26,24],[25,25,26,25],[25,26,26,26],[25,27,26,27],[25,28,26,28],[25,29,26,29],[25,30,26,30],[25,31,26,31],[25,32,26,32],[27,0,28,0],[27,1,28,2],[27,6,28,8],[27,24,28,24],[27,25,28,25],[27,26,28,26],[27,27,28,27],[27,28,28,28],[27,29,28,29],[27,30,28,30],[27,31,28,31],[27,32,28,32],[29,0,30,0],[29,1,30,2],[29,9,30,11],[29,24,30,24],[29,25,30,25],[29,26,30,26],[29,27,30,27],[29,28,30,28],[29,29,30,29],[29,30,30,30],[29,31,30,31],[29,32,30,32],[31,0,32,0],[31,1,32,2],[31,12,32,14],[31,24,32,24],[31,25,32,25],[31,26,32,26],[31,27,32,27],[31,28,32,28],[31,29,32,29],[31,30,32,30],[31,31,32,31],[31,32,32,32],[33,0,34,0],[33,1,34,2],[33,15,34,17],[33,24,34,24],[33,25,34,25],[33,26,34,26],[33,27,34,27],[33,28,34,28],[33,29,34,29],[33,30,34,30],[33,31,34,31],[33,32,34,32],[35,0,36,0],[35,1,36,2],[35,18,36,20],[35,24,36,24],[35,25,36,25],[35,26,36,26],[35,27,36,27],[35,28,36,28],[35,29,36,29],[35,30,36,30],[35,31,36,31],[35,32,36,32],[40,0,41,0],[40,1,41,2],[40,3,41,5],[40,6,41,8],[40,9,41,11],[40,12,41,14],[40,15,41,17],[40,18,41,20],[40,21,41,23],[40,24,41,24],[40,25,41,25],[40,26,41,26],[40,27,41,27],[40,28,41,28],[40,29,41,29],[40,30,41,30],[40,31,41,31],[40,32,41,32],[42,0,43,0],[42,1,43,2],[42,3,43,5],[42,24,43,24],[42,25,43,25],[42,26,43,26],[42,27,43,27],[42,28,43,28],[42,29,43,29],[42,30,43,30],[42,31,43,31],[42,32,43,32],[44,0,45,0],[44,1,45,2],[44,6,45,8],[44,24,45,24],[44,25,45,25],[44,26,45,26],[44,27,45,27],[44,28,45,28],[44,29,45,29],[44,30,45,30],[44,31,45,31],[44,32,45,32],[46,0,47,0],[46,1,47,2],[46,9,47,11],[46,24,47,24],[46,25,47,25],[46,26,47,26],[46,27,47,27],[46,28,47,28],[46,29,47,29],[46,30,47,30],[46,31,47,31],[46,32,47,32],[48,0,49,0],[48,1,49,2],[48,12,49,14],[48,24,49,24],[48,25,49,25],[48,26,49,26],[48,27,49,27],[48,28,49,28],[48,29,49,29],[48,30,49,30],[48,31,49,31],[48,32,49,32],[50,0,51,0],[50,1,51,2],[50,15,51,17],[50,24,51,24],[50,25,51,25],[50,26,51,26],[50,27,51,27],[50,28,51,28],[50,29,51,29],[50,30,51,30],[50,31,51,31],[50,32,51,32],[55,0,56,0],[55,1,56,2],[55,3,56,5],[55,6,56,8],[55,9,56,11],[55,12,56,14],[55,15,56,17],[55,18,56,20],[55,21,56,23],[55,24,56,24],[55,25,56,25],[55,26,56,26],[55,27,56,27],[55,28,56,28],[55,29,56,29],[55,30,56,30],[55,31,56,31],[55,32,56,32],[57,0,58,0],[57,1,58,2],[57,3,58,5],[57,24,58,24],[57,25,58,25],[57,26,58,26],[57,27,58,27],[57,28,58,28],[57,29,58,29],[57,30,58,30],[57,31,58,31],[57,32,58,32],[59,0,60,0],[59,1,60,2],[59,6,60,8],[59,24,60,24],[59,25,60,25],[59,26,60,26],[59,27,60,27],[59,28,60,28],[59,29,60,29],[59,30,60,30],[59,31,60,31],[59,32,60,32],[61,0,62,0],[61,1,62,2],[61,9,62,11],[61,24,62,24],[61,25,62,25],[61,26,62,26],[61,27,62,27],[61,28,62,28],[61,29,62,29],[61,30,62,30],[61,31,62,31],[61,32,62,32],[63,0,64,0],[63,1,64,2],[63,12,64,14],[63,24,64,24],[63,25,64,25],[63,26,64,26],[63,27,64,27],[63,28,64,28],[63,29,64,29],[63,30,64,30],[63,31,64,31],[63,32,64,32],[68,0,69,0],[68,1,69,2],[68,3,69,5],[68,6,69,8],[68,9,69,11],[68,12,69,14],[68,15,69,17],[68,18,69,20],[68,21,69,23],[68,24,69,24],[68,25,69,25],[68,26,69,26],[68,27,69,27],[68,28,69,28],[68,29,69,29],[68,30,69,30],[68,31,69,31],[68,32,69,32],[70,0,71,0],[70,1,71,2],[70,3,71,5],[70,24,71,24],[70,25,71,25],[70,26,71,26],[70,27,71,27],[70,28,71,28],[70,29,71,29],[70,30,71,30],[70,31,71,31],[70,32,71,32],[72,0,73,0],[72,1,73,2],[72,6,73,8],[72,24,73,24],[72,25,73,25],[72,26,73,26],[72,27,73,27],[72,28,73,28],[72,29,73,29],[72,30,73,30],[72,31,73,31],[72,32,73,32],[74,0,75,0],[74,1,75,2],[74,9,75,11],[74,24,75,24],[74,25,75,25],[74,26,75,26],[74,27,75,27],[74,28,75,28],[74,29,75,29],[74,30,75,30],[74,31,75,31],[74,32,75,32]]}
[]
[]
[]
[]
[{"$nulls":27},"点","内野","順位決定点","相手内野","順位","kaku"]
[]
{"$rows_left_out":71}
{"sheet":"対戦表1","index":7,"n_rows":0,"n_cols":0,"rows_kept":0}

{"sheet":"Sheet1","index":8,"n_rows":0,"n_cols":0,"rows_kept":0}

{"sheet":"対戦表2","index":9,"n_rows":165,"n_cols":34,"rows_kept":165,"merged":[[45,5,45,10],[45,15,45,20],[45,25,45,30],[46,5,46,10],[46,15,46,20],[46,25,46,30],[47,5,47,10],[47,15,47,20],[47,25,47,30],[48,5,48,10],[48,15,48,20],[48,25,48,30],[49,5,49,10],[49,15,49,20],[49,25,49,30],[50,5,50,10],[50,15,50,20],[50,25,50,30],[51,5,51,10],[51,15,51,20],[51,25,51,30],[52,5,52,10],[52,15,52,20],[53,5,53,10],[53,15,53,20],[54,5,54,10],[54,15,54,20],[54,25,54,30]]}
[{"$nulls":10},{"$f":"チーム表!$B$1","v":"第２０回　加賀地域少年少女ドッジボール大会"}]
[]
["　試合スケジュール"]
[]
[null,"時間",null,null,"点","Ａコート",{"$nulls":3},"点","Ａコート",{"$nulls":3},"点","Ｂコート",{"$nulls":3},"点","Ｂコート"]
[1,null,{"$f":"組合表!AG4","v":"D1"},{"$f":"CONCATENATE(C6,H6)","v":"D1D2"},null,{"$f":"VLOOKUP(C6,チーム表!C:D,2,FALSE)","v":"飯野マジックス"},"×",{"$f":"組合表!AH4","v":"D2"},{"$f":"CONCATENATE(H6,C6)","v":"D2D1"},null,{"$f":"VLOOKUP(H6,チーム表!C:D,2,FALSE)","v":"三馬パワフル"},null,{"$f":"組合表!AI4","v":"A1"},{"$f":"CONCATENATE(M6,R6)","v":"A1A2"},null,{"$f":"VLOOKUP(M6,チーム表!C:D,2,FALSE)","v":"鞍月アタッカーズ"},"×",{"$f":"組合表!AJ4","v":"A2"},{"$f":"CONCATENATE(R6,M6)","v":"A2A1"},null,{"$f":"VLOOKUP(R6,チーム表!C:D,2,FALSE)","v":"針原パイレーツ"},{"$nulls":11},{"$f":"D6","v":"D1D2"},{"$f":"IF(E6=\"\",\"\",E6)","v":""}]
{"$rows_left_out":160}
{"sheet":"対戦表3","index":10,"n_rows":245,"n_cols":34,"rows_kept":245,"merged":[[45,5,45,10],[45,15,45,20],[45,25,45,30],[46,5,46,10],[46,15,46,20],[46,25,46,30],[47,5,47,10],[47,15,47,20],[47,25,47,30],[48,5,48,10],[48,15,48,20],[48,25,48,30],[49,5,49,10],[49,15,49,20],[49,25,49,30],[50,5,50,10],[50,15,50,20],[50,25,50,30],[51,5,51,10],[51,15,51,20],[51,25,51,30],[52,5,52,10],[52,15,52,20],[52,25,52,30],[53,5,53,10],[53,15,53,20],[53,25,53,30],[54,5,54,10],[54,15,54,20],[54,25,54,30]]}
[{"$nulls":15},{"$f":"チーム表!$B$1","v":"第２０回　加賀地域少年少女ドッジボール大会"}]
[]
["　試合スケジュール"]
[]
[null,"時間",null,null,"点","Ａコート",{"$nulls":3},"点","Ａコート",{"$nulls":3},"点","Ｂコート",{"$nulls":3},"点","Ｂコート",{"$nulls":3},"点","Ｃコート",{"$nulls":3},"点","Ｃコート"]
[1,null,{"$f":"組合表!AG4","v":"D1"},{"$f":"CONCATENATE(C6,H6)","v":"D1D2"},null,{"$f":"VLOOKUP(C6,チーム表!C:D,2,FALSE)","v":"飯野マジックス"},"×",{"$f":"組合表!AH4","v":"D2"},{"$f":"CONCATENATE(H6,C6)","v":"D2D1"},null,{"$f":"VLOOKUP(H6,チーム表!C:D,2,FALSE)","v":"三馬パワフル"},null,{"$f":"組合表!AI4","v":"A1"},{"$f":"CONCATENATE(M6,R6)","v":"A1A2"},null,{"$f":"VLOOKUP(M6,チーム表!C:D,2,FALSE)","v":"鞍月アタッカーズ"},"×",{"$f":"組合表!AJ4","v":"A2"},{"$f":"CONCATENATE(R6,M6)","v":"A2A1"},null,{"$f":"VLOOKUP(R6,チーム表!C:D,2,FALSE)","v":"針原パイレーツ"},null,{"$f":"組合表!AK4","v":""},{"$f":"CONCATENATE(W6,AB6)","v":""},null,{"$f":"VLOOKUP(W6,チーム表!C:D,2,FALSE)","v":{"$error":"#N/A"}},{"$f":"Q6","v":"×"},{"$f":"組合表!AL4","v":""},{"$f":"CONCATENATE(AB6,W6)","v":""},null,{"$f":"VLOOKUP(AB6,チーム表!C:D,2,FALSE)","v":{"$error":"#N/A"}},null,{"$f":"D6","v":"D1D2"},{"$f":"IF(E6=\"\",\"\",E6)","v":""}]
{"$rows_left_out":240}
{"sheet":"組合表","index":11,"n_rows":55,"n_cols":39,"rows_kept":55,"merged":[[2,32,2,33],[2,34,2,35],[2,36,2,37]]}
[{"$nulls":25},26]
[{"$nulls":25},52]
[1,2,3,4,5,6,7,8,9,10,11,12,13,14,15,16,17,18,19,20,21,22,23,24,25,{"$nulls":7},"Aコート",null,"Ｂコート",null,"Ｃコート"]
[null,5,"D","D1D2","D3D4","D1D5","D2D3","D4D5","D1D4","D2D5","D1D3","D2D4","D3D5",{"$nulls":13},"D1D2",null,"D1D2","A1A2",null,null,{"$f":"LEFT(AC4,2)","v":"D1"},{"$f":"RIGHT(AC4,2)","v":"D2"},{"$f":"LEFT(AD4,2)","v":"A1"},{"$f":"RIGHT(AD4,2)","v":"A2"},{"$f":"LEFT(AE4,2)","v":""},{"$f":"RIGHT(AE4,2)","v":""},1]
[null,4,"A","A1A2","A3A4","A2A3","A1A4","A1A3","A2A4",{"$nulls":17},"A1A2",null,"B1B2","C1C2",null,null,{"$f":"LEFT(AC5,2)","v":"B1"},{"$f":"RIGHT(AC5,2)","v":"B2"},{"$f":"LEFT(AD5,2)","v":"C1"},{"$f":"RIGHT(AD5,2)","v":"C2"},{"$f":"LEFT(AE5,2)","v":""},{"$f":"RIGHT(AE5,2)","v":""},2]
[null,4,"B","B1B2","B3B4","B2B3","B1B4","B1B3","B2B4",{"$nulls":17},"B1B2",null,"E1E2","F1F2",null,null,"E1","E2","F1","F2","","",3]
{"$rows_left_out":49}