{"text_format":"3","workbook":"xlsx","n_sheets":12,"sheets":["チーム表","対戦表","リーグ戦表","トーナメント表","優秀選手","DATA1","DATA","対戦表1","Sheet1","対戦表2","対戦表3","組合表"],"not_rendered":{"images":7,"macros":1,"defined_names":5},"read":"whole","date_system":"1900"}

{"sheet":"チーム表","index":0,"n_rows":45,"n_cols":6,"rows_kept":45,"merged":[[0,1,0,5],[1,1,1,4]]}
[null,"第２０回　加賀地域少年少女ドッジボール大会"]
[]
[null,"番号","ﾌﾞﾛｯｸ","チ　ー　ム　名","代表者名","県名"]
[null,1,"A1","鞍月アタッカーズ","廣岡　俊和","石川"]
[null,2,"A2","針原パイレーツ","木原　清志","富山"]
[null,3,"A3","小木クラブ","福田　陽三","石川"]
[null,4,"A4","NISHIファイヤースターズ","足滝　信雄","石川"]
[null,5,"B1","呉羽ドッジボールクラブ","久郷　巌","富山"]
[null,6,"B2","鳳至ドッジボールクラブ","中野　悟","石川"]
[null,7,"B3","千坂ドッジファイヤーズ","成瀬　章宏","石川"]
[null,8,"B4","松任の大魔陣","吉岡　正敏","石川"]
[null,9,"C1","光陽マーリンズ","上野　まどか","富山"]
[null,10,"C2","中郷ドッジボールクラブ","野崎　珠美","福井"]
[null,11,"C3","鵜川ミラクルフェニックス","新谷　信之","石川"]
[null,12,"C4","向本折クラブA","中嶋　大樹","石川"]
[null,13,"D1","飯野マジックス","村田　和孝","富山"]
[null,14,"D2","三馬パワフル","石田　一栄","石川"]
[null,15,"D3","寺井クラブ","端野　智博","石川"]
[null,16,"D4","大門ドッジボールクラブ","大橋　潤子","富山"]
[null,17,"D5","田上闘球DREAMS","盛一　純平","石川"]
[null,"Jr1","E1","鞍月アタッカーズジュニア","廣岡　俊和","石川"]
[null,"Jr2","E2","鳳至ジュニア","中野　悟","石川"]
[null,"Jr3","E3","中郷ミラクルジュニア","野崎　珠美","福井"]
[null,"Jr4","E4","ドッジの王子様","石田　一栄","石川"]
[null,"Jr5","F1","九十九クラブ","福田　陽三","石川"]
[null,"Jr6","F2","千坂ロータスルート","成瀬　章宏","石川"]
[null,"Jr7","F3","向本折クラブNew","中嶋　大樹","石川"]
[null,"Jr8","F4","寺井クラブＪｒ　A","端野　智博","石川"]
[null,"Jr9","G1","鞍月アタッカーズキッズ","廣岡　俊和","石川"]
[null,"Jr10","G2","松任の大魔陣Jr.","吉岡　正敏","石川"]
[null,"Jr11","G3","鵜川フェニックスジュニア","新谷　信之","石川"]
[null,"Jr12","G4","大門ドッジボールクラブJr","大橋　潤子","富山"]
[null,"Jr13","H1","呉羽DBCジュニア","久郷　巌","富山"]
[null,"Jr14","H2","NISHI　Jrスターズ","足滝　信雄","石川"]
[null,"Jr15","H3","寺井クラブＪｒ　B","端野　智博","石川"]
[null,"Jr16","H4","田上闘球FUTURES","盛一　純平","石川"]
[null,"一5","G5","魔陣一家","由水　伸弥"]
[null,"女１","H1","鞍月マミーズ","廣岡　俊和"]
[null,"女２","H2","NISHIヤングスターズ","足滝　信雄"]
[null,"女３","H3","山中Oba","中田　勝博"]
[null,"女４","H4","田上闘球HAPPYS","盛一　純平"]
[null,"女５","I1","チーム新米ママ","山田　ユカ子"]
[null,"女６","I2","千坂Ｍファイヤーズ","下野　高広"]
[null,"女７","I3","寺井Ｐ．P♪","山田　幸嗣"]
[null,"女８","I4","魔舞陣","由水　伸弥"]

{"sheet":"対戦表","index":1,"n_rows":164,"n_cols":34,"rows_kept":164,"merged":[[32,5,32,10],[32,15,32,20],[32,25,32,30],[33,5,33,10],[33,15,33,20],[33,25,33,30],[34,5,34,10],[34,15,34,20],[34,25,34,30],[35,5,35,10],[35,15,35,20],[35,25,35,30],[36,5,36,10],[36,15,36,20],[36,25,36,30],[37,5,37,10],[37,15,37,20],[37,25,37,30],[38,5,38,10],[38,15,38,20],[38,25,38,30],[39,5,39,10],[39,15,39,20],[40,5,40,10],[40,15,40,20],[41,5,41,10],[41,15,41,20],[41,25,41,30],[42,5,42,10],[42,15,42,20],[43,5,43,10],[43,15,43,20],[44,5,44,10],[44,15,44,20]]}
[{"$nulls":10},{"$f":"チーム表!$B$1","v":"第２０回　加賀地域少年少女ドッジボール大会"},{"$nulls":13},"予選試合数",26]
[]
["　試合スケジュール"]
[]
[null,"時間",null,null,"点","Ａコート",{"$nulls":3},"点","Ａコート",{"$nulls":3},"点","Ｂコート",{"$nulls":3},"点","Ｂコート"]
[1,"09:30:00",{"$f":"組合表!AG4","v":"D1"},{"$f":"CONCATENATE(C6,H6)","v":"D1D2"},10,{"$f":"VLOOKUP(C6,チーム表!C:D,2,FALSE)","v":"飯野マジックス"},"×",{"$f":"組合表!AH4","v":"D2"},{"$f":"CONCATENATE(H6,C6)","v":"D2D1"},7,{"$f":"VLOOKUP(H6,チーム表!C:D,2,FALSE)","v":"三馬パワフル"},null,{"$f":"組合表!AI4","v":"A1"},{"$f":"CONCATENATE(M6,R6)","v":"A1A2"},7,{"$f":"VLOOKUP(M6,チーム表!C:D,2,FALSE)","v":"鞍月アタッカーズ"},"×",{"$f":"組合表!AJ4","v":"A2"},{"$f":"CONCATENATE(R6,M6)","v":"A2A1"},9,{"$f":"VLOOKUP(R6,チーム表!C:D,2,FALSE)","v":"針原パイレーツ"},{"$nulls":11},{"$f":"D6","v":"D1D2"},{"$f":"IF(E6=\"\",\"\",E6)","v":10}]
[2,"09:40:00",{"$f":"組合表!AG5","v":"B1"},{"$f":"CONCATENATE(C7,H7)","v":"B1B2"},10,{"$f":"VLOOKUP(C7,チーム表!C:D,2,FALSE)","v":"呉羽ドッジボールクラブ"},"×",{"$f":"組合表!AH5","v":"B2"},{"$f":"CONCATENATE(H7,C7)","v":"B2B1"},9,{"$f":"VLOOKUP(H7,チーム表!C:D,2,FALSE)","v":"鳳至ドッジボールクラブ"},null,{"$f":"組合表!AI5","v":"C1"},{"$f":"CONCATENATE(M7,R7)","v":"C1C2"},11,{"$f":"VLOOKUP(M7,チーム表!C:D,2,FALSE)","v":"光陽マーリンズ"},"×",{"$f":"組合表!AJ5","v":"C2"},{"$f":"CONCATENATE(R7,M7)","v":"C2C1"},1,{"$f":"VLOOKUP(R7,チーム表!C:D,2,FALSE)","v":"中郷ドッジボールクラブ"},{"$nulls":11},"B1B2",{"$f":"IF(E7=\"\",\"\",E7)","v":10}]
[3,"09:50:00","D3","D3D4",9,{"$f":"VLOOKUP(C8,チーム表!C:D,2,FALSE)","v":"寺井クラブ"},"×","D4","D4D3",9,{"$f":"VLOOKUP(H8,チーム表!C:D,2,FALSE)","v":"大門ドッジボールクラブ"},null,"A3","A3A4",8,{"$f":"VLOOKUP(M8,チーム表!C:D,2,FALSE)","v":"小木クラブ"},"×","A4","A4A3",9,{"$f":"VLOOKUP(R8,チーム表!C:D,2,FALSE)","v":"NISHIファイヤースターズ"},{"$nulls":11},"D3D4",9]
[4,"10:00:00","B3","B3B4",6,{"$f":"VLOOKUP(C9,チーム表!C:D,2,FALSE)","v":"千坂ドッジファイヤーズ"},"×","B4","B4B3",9,{"$f":"VLOOKUP(H9,チーム表!C:D,2,FALSE)","v":"松任の大魔陣"},null,"C3","C3C4",7,{"$f":"VLOOKUP(M9,チーム表!C:D,2,FALSE)","v":"鵜川ミラクルフェニックス"},"×","C4","C4C3",7,{"$f":"VLOOKUP(R9,チーム表!C:D,2,FALSE)","v":"向本折クラブA"},{"$nulls":11},"B3B4",6]
[5,"10:10:00","D1","D1D5",2,{"$f":"VLOOKUP(C10,チーム表!C:D,2,FALSE)","v":"飯野マジックス"},"×","D5","D5D1",10,{"$f":"VLOOKUP(H10,チーム表!C:D,2,FALSE)","v":"田上闘球DREAMS"},null,"A2","A2A3",8,{"$f":"VLOOKUP(M10,チーム表!C:D,2,FALSE)","v":"針原パイレーツ"},"×","A3","A3A2",8,{"$f":"VLOOKUP(R10,チーム表!C:D,2,FALSE)","v":"小木クラブ"},{"$nulls":11},"D1D5",2]
[6,"10:20:00","B2","B2B3",5,{"$f":"VLOOKUP(C11,チーム表!C:D,2,FALSE)","v":"鳳至ドッジボールクラブ"},"×","B3","B3B2",7,{"$f":"VLOOKUP(H11,チーム表!C:D,2,FALSE)","v":"千坂ドッジファイヤーズ"},null,"C2","C2C3",6,{"$f":"VLOOKUP(M11,チーム表!C:D,2,FALSE)","v":"中郷ドッジボールクラブ"},"×","C3","C3C2",10,{"$f":"VLOOKUP(R11,チーム表!C:D,2,FALSE)","v":"鵜川ミラクルフェニックス"},{"$nulls":11},"B2B3",5]
[7,"10:30:00","D2","D2D3",0,{"$f":"VLOOKUP(C12,チーム表!C:D,2,FALSE)","v":"三馬パワフル"},"×","D3","D3D2",7,{"$f":"VLOOKUP(H12,チーム表!C:D,2,FALSE)","v":"寺井クラブ"},null,"A1","A1A4",8,{"$f":"VLOOKUP(M12,チーム表!C:D,2,FALSE)","v":"鞍月アタッカーズ"},"×","A4","A4A1",8,{"$f":"VLOOKUP(R12,チーム表!C:D,2,FALSE)","v":"NISHIファイヤースターズ"},{"$nulls":11},"D2D3","00:00:00"]
[8,"10:40:00","E1","E1E2",8,{"$f":"VLOOKUP(C13,チーム表!C:D,2,FALSE)","v":"鞍月アタッカーズジュニア"},"×","E2","E2E1",4,{"$f":"VLOOKUP(H13,チーム表!C:D,2,FALSE)","v":"鳳至ジュニア"},null,"F1","F1F2",6,{"$f":"VLOOKUP(M13,チーム表!C:D,2,FALSE)","v":"九十九クラブ"},"×","F2","F2F1",3,{"$f":"VLOOKUP(R13,チーム表!C:D,2,FALSE)","v":"千坂ロータスルート"},{"$nulls":11},"E1E2",8]
[9,"10:50:00","G1","G1G2",3,{"$f":"VLOOKUP(C14,チーム表!C:D,2,FALSE)","v":"鞍月アタッカーズキッズ"},"×","G2","G2G1",6,{"$f":"VLOOKUP(H14,チーム表!C:D,2,FALSE)","v":"松任の大魔陣Jr."},null,"H1","H1H2",3,{"$f":"VLOOKUP(M14,チーム表!C:D,2,FALSE)","v":"呉羽DBCジュニア"},"×","H2","H2H1",1,{"$f":"VLOOKUP(R14,チーム表!C:D,2,FALSE)","v":"NISHI　Jrスターズ"},{"$nulls":11},"G1G2",3]
[10,"11:00:00","E3","E3E4",5,{"$f":"VLOOKUP(C15,チーム表!C:D,2,FALSE)","v":"中郷ミラクルジュニア"},"×","E4","E4E3",9,{"$f":"VLOOKUP(H15,チーム表!C:D,2,FALSE)","v":"ドッジの王子様"},null,"F3","F3F4",5,{"$f":"VLOOKUP(M15,チーム表!C:D,2,FALSE)","v":"向本折クラブNew"},"×","F4","F4F3",1,{"$f":"VLOOKUP(R15,チーム表!C:D,2,FALSE)","v":"寺井クラブＪｒ　A"},{"$nulls":11},"E3E4",5]
[11,"11:10:00","G3","G3G4",9,{"$f":"VLOOKUP(C16,チーム表!C:D,2,FALSE)","v":"鵜川フェニックスジュニア"},"×","G4","G4G3",2,{"$f":"VLOOKUP(H16,チーム表!C:D,2,FALSE)","v":"大門ドッジボールクラブJr"},null,"H3","H3H4",2,{"$f":"VLOOKUP(M16,チーム表!C:D,2,FALSE)","v":"寺井クラブＪｒ　B"},"×","H4","H4H3",8,{"$f":"VLOOKUP(R16,チーム表!C:D,2,FALSE)","v":"田上闘球FUTURES"},{"$nulls":11},"G3G4",9]
[12,"11:20:00","E2","E2E3",8,{"$f":"VLOOKUP(C17,チーム表!C:D,2,FALSE)","v":"鳳至ジュニア"},"×","E3","E3E2",2,{"$f":"VLOOKUP(H17,チーム表!C:D,2,FALSE)","v":"中郷ミラクルジュニア"},null,"F2","F2F3",0,{"$f":"VLOOKUP(M17,チーム表!C:D,2,FALSE)","v":"千坂ロータスルート"},"×","F3","F3F2",6,{"$f":"VLOOKUP(R17,チーム表!C:D,2,FALSE)","v":"向本折クラブNew"},{"$nulls":11},"E2E3",8]
[13,"11:30:00","G2","G2G3",4,{"$f":"VLOOKUP(C18,チーム表!C:D,2,FALSE)","v":"松任の大魔陣Jr."},"×","G3","G3G2",9,{"$f":"VLOOKUP(H18,チーム表!C:D,2,FALSE)","v":"鵜川フェニックスジュニア"},null,"H2","H2H3",2,{"$f":"VLOOKUP(M18,チーム表!C:D,2,FALSE)","v":"NISHI　Jrスターズ"},"×","H3","H3H2",3,{"$f":"VLOOKUP(R18,チーム表!C:D,2,FALSE)","v":"寺井クラブＪｒ　B"},{"$nulls":11},"G2G3",4]
[14,"11:40:00","E1","E1E4",6,{"$f":"VLOOKUP(C19,チーム表!C:D,2,FALSE)","v":"鞍月アタッカーズジュニア"},"×","E4","E4E1",5,{"$f":"VLOOKUP(H19,チーム表!C:D,2,FALSE)","v":"ドッジの王子様"},null,"F1","F1F4",7,{"$f":"VLOOKUP(M19,チーム表!C:D,2,FALSE)","v":"九十九クラブ"},"×","F4","F4F1",3,{"$f":"VLOOKUP(R19,チーム表!C:D,2,FALSE)","v":"寺井クラブＪｒ　A"},{"$nulls":11},"E1E4",6]
[15,"11:50:00","G1","G1G4",3,{"$f":"VLOOKUP(C20,チーム表!C:D,2,FALSE)","v":"鞍月アタッカーズキッズ"},"×","G4","G4G1",4,{"$f":"VLOOKUP(H20,チーム表!C:D,2,FALSE)","v":"大門ドッジボールクラブJr"},null,"H1","H1H4",2,{"$f":"VLOOKUP(M20,チーム表!C:D,2,FALSE)","v":"呉羽DBCジュニア"},"×","H4","H4H1",8,{"$f":"VLOOKUP(R20,チーム表!C:D,2,FALSE)","v":"田上闘球FUTURES"},{"$nulls":11},{"$f":"D20","v":"G1G4"},{"$f":"IF(E20=\"\",\"\",E20)","v":3}]
[{"$nulls":32},{"$f":"D22","v":"B1B4"},{"$f":"IF(E22=\"\",\"\",E22)","v":9}]
[16,"12:30:00","B1","B1B4",9,{"$f":"VLOOKUP(C22,チーム表!C:D,2,FALSE)","v":"呉羽ドッジボールクラブ"},"×","B4","B4B1",9,{"$f":"VLOOKUP(H22,チーム表!C:D,2,FALSE)","v":"松任の大魔陣"},null,"C1","C1C4",4,{"$f":"VLOOKUP(M22,チーム表!C:D,2,FALSE)","v":"光陽マーリンズ"},"×","C4","C4C1",10,{"$f":"VLOOKUP(R22,チーム表!C:D,2,FALSE)","v":"向本折クラブA"},{"$nulls":11},"D4D5",4]
[17,"12:40:00","D4","D4D5",4,{"$f":"VLOOKUP(C23,チーム表!C:D,2,FALSE)","v":"大門ドッジボールクラブ"},"×","D5","D5D4",8,{"$f":"VLOOKUP(H23,チーム表!C:D,2,FALSE)","v":"田上闘球DREAMS"},null,"A1","A1A3",7,{"$f":"VLOOKUP(M23,チーム表!C:D,2,FALSE)","v":"鞍月アタッカーズ"},"×","A3","A3A1",10,{"$f":"VLOOKUP(R23,チーム表!C:D,2,FALSE)","v":"小木クラブ"},{"$nulls":11},"B1B3",7]
[18,"12:50:00","B1","B1B3",7,{"$f":"VLOOKUP(C24,チーム表!C:D,2,FALSE)","v":"呉羽ドッジボールクラブ"},"×","B3","B3B1",9,{"$f":"VLOOKUP(H24,チーム表!C:D,2,FALSE)","v":"千坂ドッジファイヤーズ"},null,"C1","C1C3",5,{"$f":"VLOOKUP(M24,チーム表!C:D,2,FALSE)","v":"光陽マーリンズ"},"×","C3","C3C1",8,{"$f":"VLOOKUP(R24,チーム表!C:D,2,FALSE)","v":"鵜川ミラクルフェニックス"},{"$nulls":11},"D2D5",2]
[19,"13:00:00","D2","D2D5",2,{"$f":"VLOOKUP(C25,チーム表!C:D,2,FALSE)","v":"三馬パワフル"},"×","D5","D5D2",11,{"$f":"VLOOKUP(H25,チーム表!C:D,2,FALSE)","v":"田上闘球DREAMS"},null,"A2","A2A4",9,{"$f":"VLOOKUP(M25,チーム表!C:D,2,FALSE)","v":"針原パイレーツ"},"×","A4","A4A2",8,{"$f":"VLOOKUP(R25,チーム表!C:D,2,FALSE)","v":"NISHIファイヤースターズ"},{"$nulls":11},"D1D4",9]
[20,"13:10:00","D1","D1D4",9,{"$f":"VLOOKUP(C26,チーム表!C:D,2,FALSE)","v":"飯野マジックス"},"×","D4","D4D1",6,{"$f":"VLOOKUP(H26,チーム表!C:D,2,FALSE)","v":"大門ドッジボールクラブ"},null,"C2","C2C4",3,{"$f":"VLOOKUP(M26,チーム表!C:D,2,FALSE)","v":"中郷ドッジボールクラブ"},"×","C4","C4C2",10,{"$f":"VLOOKUP(R26,チーム表!C:D,2,FALSE)","v":"向本折クラブA"},{"$nulls":11},"B2B4",8]
[21,"13:20:00","B2","B2B4",8,{"$f":"VLOOKUP(C27,チーム表!C:D,2,FALSE)","v":"鳳至ドッジボールクラブ"},"×","B4","B4B2",10,{"$f":"VLOOKUP(H27,チーム表!C:D,2,FALSE)","v":"松任の大魔陣"},null,"D3","D3D5",5,{"$f":"VLOOKUP(M27,チーム表!C:D,2,FALSE)","v":"寺井クラブ"},"×","D5","D5D3",9,{"$f":"VLOOKUP(R27,チーム表!C:D,2,FALSE)","v":"田上闘球DREAMS"},{"$nulls":11},"D2D4",6]
[22,"13:30:00","D2","D2D4",6,{"$f":"VLOOKUP(C28,チーム表!C:D,2,FALSE)","v":"三馬パワフル"},"×","D4","D4D2",9,{"$f":"VLOOKUP(H28,チーム表!C:D,2,FALSE)","v":"大門ドッジボールクラブ"},null,"D1","D1D3",6,{"$f":"VLOOKUP(M28,チーム表!C:D,2,FALSE)","v":"飯野マジックス"},"×","D3","D3D1",9,{"$f":"VLOOKUP(R28,チーム表!C:D,2,FALSE)","v":"寺井クラブ"},{"$nulls":11},"E1E3",8]
[23,"13:40:00","E1","E1E3",8,{"$f":"VLOOKUP(C29,チーム表!C:D,2,FALSE)","v":"鞍月アタッカーズジュニア"},"×","E3","E3E1",4,{"$f":"VLOOKUP(H29,チーム表!C:D,2,FALSE)","v":"中郷ミラクルジュニア"},null,"F1","F1F3",6,{"$f":"VLOOKUP(M29,チーム表!C:D,2,FALSE)","v":"九十九クラブ"},"×","F3","F3F1",2,{"$f":"VLOOKUP(R29,チーム表!C:D,2,FALSE)","v":"向本折クラブNew"},{"$nulls":11},"G1G3","00:00:00"]
[24,"13:50:00","G1","G1G3",0,{"$f":"VLOOKUP(C30,チーム表!C:D,2,FALSE)","v":"鞍月アタッカーズキッズ"},"×","G3","G3G1",8,{"$f":"VLOOKUP(H30,チーム表!C:D,2,FALSE)","v":"鵜川フェニックスジュニア"},null,"H1","H1H3",6,{"$f":"VLOOKUP(M30,チーム表!C:D,2,FALSE)","v":"呉羽DBCジュニア"},"×","H3","H3H1",3,{"$f":"VLOOKUP(R30,チーム表!C:D,2,FALSE)","v":"寺井クラブＪｒ　B"},{"$nulls":11},"E2E4",7]
[25,"14:00:00","E2","E2E4",7,{"$f":"VLOOKUP(C31,チーム表!C:D,2,FALSE)","v":"鳳至ジュニア"},"×","E4","E4E2",5,{"$f":"VLOOKUP(H31,チーム表!C:D,2,FALSE)","v":"ドッジの王子様"},null,"F2","F2F4",2,{"$f":"VLOOKUP(M31,チーム表!C:D,2,FALSE)","v":"千坂ロータスルート"},"×","F4","F4F2",6,{"$f":"VLOOKUP(R31,チーム表!C:D,2,FALSE)","v":"寺井クラブＪｒ　A"},{"$nulls":11},"G2G4",6]
[26,"14:10:00","G2","G2G4",6,{"$f":"VLOOKUP(C32,チーム表!C:D,2,FALSE)","v":"松任の大魔陣Jr."},"×","G4","G4G2",4,{"$f":"VLOOKUP(H32,チーム表!C:D,2,FALSE)","v":"大門ドッジボールクラブJr"},null,"H2","H2H4",2,{"$f":"VLOOKUP(M32,チーム表!C:D,2,FALSE)","v":"NISHI　Jrスターズ"},"×","H4","H4H2",4,{"$f":"VLOOKUP(R32,チーム表!C:D,2,FALSE)","v":"田上闘球FUTURES"},{"$nulls":11},{"$f":"#REF!","v":{"$error":"#REF!"}},{"$f":"IF(#REF!=\"\",\"\",#REF!)","v":{"$error":"#REF!"}}]
[27,"14:30:00",1,null,null,"決勝トーナメント　ジュニアの部　①",{"$nulls":9},"決勝トーナメント　ジュニアの部　①",{"$nulls":16},{"$f":"#REF!","v":{"$error":"#REF!"}},{"$f":"IF(#REF!=\"\",\"\",#REF!)","v":{"$error":"#REF!"}}]
[28,"14:40:00",2,null,null,"決勝トーナメント　ジュニアの部　②",{"$nulls":9},"決勝トーナメント　ジュニアの部　②",{"$nulls":16},{"$f":"#REF!","v":{"$error":"#REF!"}},{"$f":"IF(#REF!=\"\",\"\",#REF!)","v":{"$error":"#REF!"}}]
[29,"14:50:00",3,null,null,"交流トーナメント　レギュラーの部　③",{"$nulls":26},{"$f":"#REF!","v":{"$error":"#REF!"}},{"$f":"IF(#REF!=\"\",\"\",#REF!)","v":{"$error":"#REF!"}}]
[30,"15:00:00",4,null,null,"交流トーナメント　レギュラーの部　④",{"$nulls":9},"交流トーナメント　レギュラーの部　④",{"$nulls":16},{"$f":"#REF!","v":{"$error":"#REF!"}},{"$f":"IF(#REF!=\"\",\"\",#REF!)","v":{"$error":"#REF!"}}]
[31,"15:10:00",5,null,null,"交流トーナメント　レギュラーの部　⑤",{"$nulls":9},"交流トーナメント　レギュラーの部　⑤",{"$nulls":16},{"$f":"#REF!","v":{"$error":"#REF!"}},{"$f":"IF(#REF!=\"\",\"\",#REF!)","v":{"$error":"#REF!"}}]
[32,"15:20:00",6,null,null,"決勝トーナメント　ジュニアの部　準決勝　⑥",{"$nulls":9},"決勝トーナメント　ジュニアの部　準決勝　⑥",{"$nulls":16},{"$f":"#REF!","v":{"$error":"#REF!"}},{"$f":"IF(#REF!=\"\",\"\",#REF!)","v":{"$error":"#REF!"}}]
[33,"15:30:00",7,null,null,"決勝トーナメント　レギュラーの部　⑦",{"$nulls":9},"決勝トーナメント　レギュラーの部　⑦",{"$nulls":16},{"$f":"#REF!","v":{"$error":"#REF!"}},{"$f":"IF(#REF!=\"\",\"\",#REF!)","v":{"$error":"#REF!"}}]
[34,"15:40:00",8,null,null,"決勝トーナメント　レギュラーの部　⑧",{"$nulls":9},"決勝トーナメント　レギュラーの部　⑧",{"$nulls":16},{"$f":"#REF!","v":{"$error":"#REF!"}},{"$f":"IF(#REF!=\"\",\"\",#REF!)","v":{"$error":"#REF!"}}]
[35,"15:50:00",9,null,null,"交流トーナメント　レギュラーの部　準決勝　⑨",{"$nulls":9},"交流トーナメント　レギュラーの部　準決勝　⑨",{"$nulls":16},{"$f":"#REF!","v":{"$error":"#REF!"}},{"$f":"IF(#REF!=\"\",\"\",#REF!)","v":{"$error":"#REF!"}}]
[36,"16:00:00",10,null,null,"決勝トーナメント　ジュニアの部　３位決定戦　⑩",{"$nulls":9},"決勝トーナメント　ジュニアの部　決　勝　⑩",{"$nulls":16},{"$f":"#REF!","v":{"$error":"#REF!"}},{"$f":"IF(#REF!=\"\",\"\",#REF!)","v":{"$error":"#REF!"}}]
[37,"16:10:00",11,{"$nulls":12},"交流トーナメント　レギュラーの部　決　勝　⑪",{"$nulls":16},{"$f":"#REF!","v":{"$error":"#REF!"}},{"$f":"IF(#REF!=\"\",\"\",#REF!)","v":{"$error":"#REF!"}}]
[38,"16:20:00",12,null,null,"決勝トーナメント　レギュラーの部　準決勝　⑫",{"$nulls":9},"決勝トーナメント　レギュラーの部　準決勝　⑫",{"$nulls":16},{"$f":"#REF!","v":{"$error":"#REF!"}},{"$f":"IF(#REF!=\"\",\"\",#REF!)","v":{"$error":"#REF!"}}]
[39,"16:30:00",13,null,null,"決勝トーナメント　レギュラーの部　決　勝　⑬",{"$nulls":9},"決勝トーナメント　レギュラーの部　３位決定戦　⑬",{"$nulls":16},{"$f":"I6","v":"D2D1"},{"$f":"IF(J6=\"\",\"\",J6)","v":7}]
[{"$nulls":32},"B2B1",{"$f":"IF(J7=\"\",\"\",J7)","v":9}]
[{"$nulls":32},"D4D3",9]
[{"$nulls":32},"B4B3",9]
[{"$nulls":32},"D5D1",10]
[{"$nulls":32},"B3B2",7]
[{"$nulls":32},"D3D2",7]
[{"$nulls":32},"E2E1",4]
[{"$nulls":32},"G2G1",6]
[{"$nulls":32},"E4E3",9]
[{"$nulls":32},"G4G3",2]
[{"$nulls":32},"E3E2",2]
[{"$nulls":32},"G3G2",9]
[{"$nulls":32},"E4E1",5]
[{"$nulls":32},{"$f":"I20","v":"G4G1"},{"$f":"IF(J20=\"\",\"\",J20)","v":4}]
[{"$nulls":32},{"$f":"I22","v":"B4B1"},{"$f":"IF(J22=\"\",\"\",J22)","v":9}]
[{"$nulls":32},"D5D4",8]
[{"$nulls":32},"B3B1",9]
[{"$nulls":32},"D5D2",11]
[{"$nulls":32},"D4D1",6]
[{"$nulls":32},"B4B2",10]
[{"$nulls":32},"D4D2",9]
[{"$nulls":32},"E3E1",4]
[{"$nulls":32},"G3G1",8]
[{"$nulls":32},"E4E2",5]
[{"$nulls":32},"G4G2",4]
[{"$nulls":32},{"$f":"#REF!","v":{"$error":"#REF!"}},{"$f":"IF(#REF!=\"\",\"\",#REF!)","v":{"$error":"#REF!"}}]
[{"$nulls":32},{"$f":"#REF!","v":{"$error":"#REF!"}},{"$f":"IF(#REF!=\"\",\"\",#REF!)","v":{"$error":"#REF!"}}]
[{"$nulls":32},{"$f":"#REF!","v":{"$error":"#REF!"}},{"$f":"IF(#REF!=\"\",\"\",#REF!)","v":{"$error":"#REF!"}}]
[{"$nulls":32},{"$f":"#REF!","v":{"$error":"#REF!"}},{"$f":"IF(#REF!=\"\",\"\",#REF!)","v":{"$error":"#REF!"}}]
[{"$nulls":32},{"$f":"#REF!","v":{"$error":"#REF!"}},{"$f":"IF(#REF!=\"\",\"\",#REF!)","v":{"$error":"#REF!"}}]
[{"$nulls":32},{"$f":"#REF!","v":{"$error":"#REF!"}},{"$f":"IF(#REF!=\"\",\"\",#REF!)","v":{"$error":"#REF!"}}]
[{"$nulls":32},{"$f":"#REF!","v":{"$error":"#REF!"}},{"$f":"IF(#REF!=\"\",\"\",#REF!)","v":{"$error":"#REF!"}}]
[{"$nulls":32},{"$f":"#REF!","v":{"$error":"#REF!"}},{"$f":"IF(#REF!=\"\",\"\",#REF!)","v":{"$error":"#REF!"}}]
[{"$nulls":32},{"$f":"#REF!","v":{"$error":"#REF!"}},{"$f":"IF(#REF!=\"\",\"\",#REF!)","v":{"$error":"#REF!"}}]
[{"$nulls":32},{"$f":"#REF!","v":{"$error":"#REF!"}},{"$f":"IF(#REF!=\"\",\"\",#REF!)","v":{"$error":"#REF!"}}]
[{"$nulls":32},{"$f":"#REF!","v":{"$error":"#REF!"}},{"$f":"IF(#REF!=\"\",\"\",#REF!)","v":{"$error":"#REF!"}}]
[{"$nulls":32},{"$f":"#REF!","v":{"$error":"#REF!"}},{"$f":"IF(#REF!=\"\",\"\",#REF!)","v":{"$error":"#REF!"}}]
[{"$nulls":32},{"$f":"#REF!","v":{"$error":"#REF!"}},{"$f":"IF(#REF!=\"\",\"\",#REF!)","v":{"$error":"#REF!"}}]
[{"$nulls":32},{"$f":"#REF!","v":{"$error":"#REF!"}},{"$f":"IF(#REF!=\"\",\"\",#REF!)","v":{"$error":"#REF!"}}]
[{"$nulls":32},{"$f":"N6","v":"A1A2"},{"$f":"IF(O6=\"\",\"\",O6)","v":7}]
[{"$nulls":32},"C1C2",{"$f":"IF(O7=\"\",\"\",O7)","v":11}]
[{"$nulls":32},"A3A4",8]
[{"$nulls":32},"C3C4",7]
[{"$nulls":32},"A2A3",8]
[{"$nulls":32},"C2C3",6]
[{"$nulls":32},"A1A4",8]
[{"$nulls":32},"F1F2",6]
[{"$nulls":32},"H1H2",3]
[{"$nulls":32},"F3F4",5]
[{"$nulls":32},"H3H4",2]
[{"$nulls":32},"F2F3","00:00:00"]
[{"$nulls":32},"H2H3",2]
[{"$nulls":32},"F1F4",7]
[{"$nulls":32},{"$f":"N20","v":"H1H4"},{"$f":"IF(O20=\"\",\"\",O20)","v":2}]
[{"$nulls":32},{"$f":"N22","v":"C1C4"},{"$f":"IF(O22=\"\",\"\",O22)","v":4}]
[{"$nulls":32},"A1A3",7]
[{"$nulls":32},"C1C3",5]
[{"$nulls":32},"A2A4",9]
[{"$nulls":32},"C2C4",3]
[{"$nulls":32},"D3D5",5]
[{"$nulls":32},"D1D3",6]
[{"$nulls":32},"F1F3",6]
[{"$nulls":32},"H1H3",6]
[{"$nulls":32},"F2F4",2]
[{"$nulls":32},"H2H4",2]
[{"$nulls":32},{"$f":"#REF!","v":{"$error":"#REF!"}},{"$f":"IF(#REF!=\"\",\"\",#REF!)","v":{"$error":"#REF!"}}]
[{"$nulls":32},{"$f":"#REF!","v":{"$error":"#REF!"}},{"$f":"IF(#REF!=\"\",\"\",#REF!)","v":{"$error":"#REF!"}}]
[{"$nulls":32},{"$f":"#REF!","v":{"$error":"#REF!"}},{"$f":"IF(#REF!=\"\",\"\",#REF!)","v":{"$error":"#REF!"}}]
[{"$nulls":32},{"$f":"#REF!","v":{"$error":"#REF!"}},{"$f":"IF(#REF!=\"\",\"\",#REF!)","v":{"$error":"#REF!"}}]
[{"$nulls":32},{"$f":"#REF!","v":{"$error":"#REF!"}},{"$f":"IF(#REF!=\"\",\"\",#REF!)","v":{"$error":"#REF!"}}]
[{"$nulls":32},{"$f":"#REF!","v":{"$error":"#REF!"}},{"$f":"IF(#REF!=\"\",\"\",#REF!)","v":{"$error":"#REF!"}}]
[{"$nulls":32},{"$f":"#REF!","v":{"$error":"#REF!"}},{"$f":"IF(#REF!=\"\",\"\",#REF!)","v":{"$error":"#REF!"}}]
[{"$nulls":32},{"$f":"#REF!","v":{"$error":"#REF!"}},{"$f":"IF(#REF!=\"\",\"\",#REF!)","v":{"$error":"#REF!"}}]
[{"$nulls":32},{"$f":"#REF!","v":{"$error":"#REF!"}},{"$f":"IF(#REF!=\"\",\"\",#REF!)","v":{"$error":"#REF!"}}]
[{"$nulls":32},{"$f":"#REF!","v":{"$error":"#REF!"}},{"$f":"IF(#REF!=\"\",\"\",#REF!)","v":{"$error":"#REF!"}}]
[{"$nulls":32},{"$f":"#REF!","v":{"$error":"#REF!"}},{"$f":"IF(#REF!=\"\",\"\",#REF!)","v":{"$error":"#REF!"}}]
[{"$nulls":32},{"$f":"#REF!","v":{"$error":"#REF!"}},{"$f":"IF(#REF!=\"\",\"\",#REF!)","v":{"$error":"#REF!"}}]
[{"$nulls":32},{"$f":"#REF!","v":{"$error":"#REF!"}},{"$f":"IF(#REF!=\"\",\"\",#REF!)","v":{"$error":"#REF!"}}]
[{"$nulls":32},{"$f":"#REF!","v":{"$error":"#REF!"}},{"$f":"IF(#REF!=\"\",\"\",#REF!)","v":{"$error":"#REF!"}}]
[{"$nulls":32},{"$f":"S6","v":"A2A1"},{"$f":"IF(T6=\"\",\"\",T6)","v":9}]
[{"$nulls":32},"C2C1",{"$f":"IF(T7=\"\",\"\",T7)","v":1}]
[{"$nulls":32},"A4A3",9]
[{"$nulls":32},"C4C3",7]
[{"$nulls":32},"A3A2",8]
[{"$nulls":32},"C3C2",10]
[{"$nulls":32},"A4A1",8]
[{"$nulls":32},"F2F1",3]
[{"$nulls":32},"H2H1",1]
[{"$nulls":32},"F4F3",1]
[{"$nulls":32},"H4H3",8]
[{"$nulls":32},"F3F2",6]
[{"$nulls":32},"H3H2",3]
[{"$nulls":32},"F4F1",3]
[{"$nulls":32},{"$f":"S20","v":"H4H1"},{"$f":"IF(T20=\"\",\"\",T20)","v":8}]
[{"$nulls":32},{"$f":"S22","v":"C4C1"},{"$f":"IF(T22=\"\",\"\",T22)","v":10}]
[{"$nulls":32},"A3A1",10]
[{"$nulls":32},"C3C1",8]
[{"$nulls":32},"A4A2",8]
[{"$nulls":32},"C4C2",10]
[{"$nulls":32},"D5D3",9]
[{"$nulls":32},"D3D1",9]
[{"$nulls":32},"F3F1",2]
[{"$nulls":32},"H3H1",3]
[{"$nulls":32},"F4F2",6]
[{"$nulls":32},"H4H2",4]
[{"$nulls":32},{"$f":"#REF!","v":{"$error":"#REF!"}},{"$f":"IF(#REF!=\"\",\"\",#REF!)","v":{"$error":"#REF!"}}]
[{"$nulls":32},{"$f":"#REF!","v":{"$error":"#REF!"}},{"$f":"IF(#REF!=\"\",\"\",#REF!)","v":{"$error":"#REF!"}}]
[{"$nulls":32},{"$f":"#REF!","v":{"$error":"#REF!"}},{"$f":"IF(#REF!=\"\",\"\",#REF!)","v":{"$error":"#REF!"}}]
[{"$nulls":32},{"$f":"#REF!","v":{"$error":"#REF!"}},{"$f":"IF(#REF!=\"\",\"\",#REF!)","v":{"$error":"#REF!"}}]
[{"$nulls":32},{"$f":"#REF!","v":{"$error":"#REF!"}},{"$f":"IF(#REF!=\"\",\"\",#REF!)","v":{"$error":"#REF!"}}]
[{"$nulls":32},{"$f":"#REF!","v":{"$error":"#REF!"}},{"$f":"IF(#REF!=\"\",\"\",#REF!)","v":{"$error":"#REF!"}}]
[{"$nulls":32},{"$f":"#REF!","v":{"$error":"#REF!"}},{"$f":"IF(#REF!=\"\",\"\",#REF!)","v":{"$error":"#REF!"}}]
[{"$nulls":32},{"$f":"#REF!","v":{"$error":"#REF!"}},{"$f":"IF(#REF!=\"\",\"\",#REF!)","v":{"$error":"#REF!"}}]
[{"$nulls":32},{"$f":"#REF!","v":{"$error":"#REF!"}},{"$f":"IF(#REF!=\"\",\"\",#REF!)","v":{"$error":"#REF!"}}]
[{"$nulls":32},{"$f":"#REF!","v":{"$error":"#REF!"}},{"$f":"IF(#REF!=\"\",\"\",#REF!)","v":{"$error":"#REF!"}}]
[{"$nulls":32},{"$f":"#REF!","v":{"$error":"#REF!"}},{"$f":"IF(#REF!=\"\",\"\",#REF!)","v":{"$error":"#REF!"}}]
[{"$nulls":32},{"$f":"#REF!","v":{"$error":"#REF!"}},{"$f":"IF(#REF!=\"\",\"\",#REF!)","v":{"$error":"#REF!"}}]
[{"$nulls":32},{"$f":"#REF!","v":{"$error":"#REF!"}},{"$f":"IF(#REF!=\"\",\"\",#REF!)","v":{"$error":"#REF!"}}]
[{"$nulls":32},{"$f":"#REF!","v":{"$error":"#REF!"}},{"$f":"IF(#REF!=\"\",\"\",#REF!)","v":{"$error":"#REF!"}}]

{"sheet":"リーグ戦表","index":2,"n_rows":100,"n_cols":35,"rows_kept":100,"merged":[[1,2,1,11],[4,0,5,0],[4,1,5,2],[4,3,5,5],[4,6,5,8],[4,9,5,11],[4,12,5,14],[4,15,5,17],[4,18,5,20],[4,21,5,23],[4,24,5,24],[4,25,5,25],[4,26,5,26],[4,27,5,27],[4,28,5,28],[4,29,5,29],[4,30,5,30],[4,31,5,31],[4,32,5,32],[6,0,7,0],[6,1,7,2],[6,3,7,5],[6,24,7,24],[6,25,7,25],[6,26,7,26],[6,27,7,27],[6,28,7,28],[6,29,7,29],[6,30,7,30],[6,31,7,31],[6,32,7,32],[8,0,9,0],[8,1,9,2],[8,6,9,8],[8,24,9,24],[8,25,9,25],[8,26,9,26],[8,27,9,27],[8,28,9,28],[8,29,9,29],[8,30,9,30],[8,31,9,31],[8,32,9,32],[10,0,11,0],[10,1,11,2],[10,9,11,11],[10,24,11,24],[10,25,11,25],[10,26,11,26],[10,27,11,27],[10,28,11,28],[10,29,11,29],[10,30,11,30],[10,31,11,31],[10,32,11,32],[12,0,13,0],[12,1,13,2],[12,12,13,14],[12,24,13,24],[12,25,13,25],[12,26,13,26],[12,27,13,27],[12,28,13,28],[12,29,13,29],[12,30,13,30],[12,31,13,31],[12,32,13,32],[16,0,17,0],[16,1,17,2],[16,3,17,5],[16,6,17,8],[16,9,17,11],[16,12,17,14],[16,15,17,17],[16,18,17,20],[16,21,17,23],[16,24,17,24],[16,25,17,25],[16,26,17,26],[16,27,17,27],[16,28,17,28],[16,29,17,29],[16,30,17,30],[16,31,17,31],[16,32,17,32],[18,0,19,0],[18,1,19,2],[18,3,19,5],[18,24,19,24],[18,25,19,25],[18,26,19,26],[18,27,19,27],[18,28,19,28],[18,29,19,29],[18,30,19,30],[18,31,19,31],[18,32,19,32],[20,0,21,0],[20,1,21,2],[20,6,21,8],[20,24,21,24],[20,25,21,25],[20,26,21,26],[20,27,21,27],[20,28,21,28],[20,29,21,29],[20,30,21,30],[20,31,21,31],[20,32,21,32],[22,0,23,0],[22,1,23,2],[22,9,23,11],[22,24,23,24],[22,25,23,25],[22,26,23,26],[22,27,23,27],[22,28,23,28],[22,29,23,29],[22,30,23,30],[22,31,23,31],[22,32,23,32],[24,0,25,0],[24,1,25,2],[24,12,25,14],[24,24,25,24],[24,25,25,25],[24,26,25,26],[24,27,25,27],[24,28,25,28],[24,29,25,29],[24,30,25,30],[24,31,25,31],[24,32,25,32],[28,0,29,0],[28,1,29,2],[28,3,29,5],[28,6,29,8],[28,9,29,11],[28,12,29,14],[28,15,29,17],[28,18,29,20],[28,21,29,23],[28,24,29,24],[28,25,29,25],[28,26,29,26],[28,27,29,27],[28,28,29,28],[28,29,29,29],[28,30,29,30],[28,31,29,31],[28,32,29,32],[30,0,31,0],[30,1,31,2],[30,3,31,5],[30,24,31,24],[30,25,31,25],[30,26,31,26],[30,27,31,27],[30,28,31,28],[30,29,31,29],[30,30,31,30],[30,31,31,31],[30,32,31,32],[32,0,33,0],[32,1,33,2],[32,6,33,8],[32,24,33,24],[32,25,33,25],[32,26,33,26],[32,27,33,27],[32,28,33,28],[32,29,33,29],[32,30,33,30],[32,31,33,31],[32,32,33,32],[34,0,35,0],[34,1,35,2],[34,9,35,11],[34,24,35,24],[34,25,35,25],[34,26,35,26],[34,27,35,27],[34,28,35,28],[34,29,35,29],[34,30,35,30],[34,31,35,31],[34,32,35,32],[36,0,37,0],[36,1,37,2],[36,12,37,14],[36,24,37,24],[36,25,37,25],[36,26,37,26],[36,27,37,27],[36,28,37,28],[36,29,37,29],[36,30,37,30],[36,31,37,31],[36,32,37,32],[40,0,41,0],[40,1,41,2],[40,3,41,5],[40,6,41,8],[40,9,41,11],[40,12,41,14],[40,15,41,17],[40,18,41,20],[40,21,41,23],[40,24,41,24],[40,25,41,25],[40,26,41,26],[40,27,41,27],[40,28,41,28],[40,29,41,29],[40,30,41,30],[40,31,41,31],[40,32,41,32],[42,0,43,0],[42,1,43,2],[42,3,43,5],[42,24,43,24],[42,25,43,25],[42,26,43,26],[42,27,43,27],[42,28,43,28],[42,29,43,29],[42,30,43,30],[42,31,43,31],[42,32,43,32],[44,0,45,0],[44,1,45,2],[44,6,45,8],[44,24,45,24],[44,25,45,25],[44,26,45,26],[44,27,45,27],[44,28,45,28],[44,29,45,29],[44,30,45,30],[44,31,45,31],[44,32,45,32],[46,0,47,0],[46,1,47,2],[46,9,47,11],[46,24,47,24],[46,25,47,25],[46,26,47,26],[46,27,47,27],[46,28,47,28],[46,29,47,29],[46,30,47,30],[46,31,47,31],[46,32,47,32],[48,0,49,0],[48,1,49,2],[48,12,49,14],[48,24,49,24],[48,25,49,25],[48,26,49,26],[48,27,49,27],[48,28,49,28],[48,29,49,29],[48,30,49,30],[48,31,49,31],[48,32,49,32],[50,0,51,0],[50,1,51,2],[50,15,51,17],[50,24,51,24],[50,25,51,25],[50,26,51,26],[50,27,51,27],[50,28,51,28],[50,29,51,29],[50,30,51,30],[50,31,51,31],[50,32,51,32],[54,0,55,0],[54,1,55,2],[54,3,55,5],[54,6,55,8],[54,9,55,11],[54,12,55,14],[54,15,55,17],[54,18,55,20],[54,21,55,23],[54,24,55,24],[54,25,55,25],[54,26,55,26],[54,27,55,27],[54,28,55,28],[54,29,55,29],[54,30,55,30],[54,31,55,31],[54,32,55,32],[56,0,57,0],[56,1,57,2],[56,3,57,5],[56,24,57,24],[56,25,57,25],[56,26,57,26],[56,27,57,27],[56,28,57,28],[56,29,57,29],[56,30,57,30],[56,31,57,31],[56,32,57,32],[58,0,59,0],[58,1,59,2],[58,6,59,8],[58,24,59,24],[58,25,59,25],[58,26,59,26],[58,27,59,27],[58,28,59,28],[58,29,59,29],[58,30,59,30],[58,31,59,31],[58,32,59,32],[60,0,61,0],[60,1,61,2],[60,9,61,11],[60,24,61,24],[60,25,61,25],[60,26,61,26],[60,27,61,27],[60,28,61,28],[60,29,61,29],[60,30,61,30],[60,31,61,31],[60,32,61,32],[62,0,63,0],[62,1,63,2],[62,12,63,14],[62,24,63,24],[62,25,63,25],[62,26,63,26],[62,27,63,27],[62,28,63,28],[62,29,63,29],[62,30,63,30],[62,31,63,31],[62,32,63,32],[66,0,67,0],[66,1,67,2],[66,3,67,5],[66,6,67,8],[66,9,67,11],[66,12,67,14],[66,15,67,17],[66,18,67,20],[66,21,67,23],[66,24,67,24],[66,25,67,25],[66,26,67,26],[66,27,67,27],[66,28,67,28],[66,29,67,29],[66,30,67,30],[66,31,67,31],[66,32,67,32],[68,0,69,0],[68,1,69,2],[68,3,69,5],[68,24,69,24],[68,25,69,25],[68,26,69,26],[68,27,69,27],[68,28,69,28],[68,29,69,29],[68,30,69,30],[68,31,69,31],[68,32,69,32],[70,0,71,0],[70,1,71,2],[70,6,71,8],[70,24,71,24],[70,25,71,25],[70,26,71,26],[70,27,71,27],[70,28,71,28],[70,29,71,29],[70,30,71,30],[70,31,71,31],[70,32,71,32],[72,0,73,0],[72,1,73,2],[72,9,73,11],[72,24,73,24],[72,25,73,25],[72,26,73,26],[72,27,73,27],[72,28,73,28],[72,29,73,29],[72,30,73,30],[72,31,73,31],[72,32,73,32],[74,0,75,0],[74,1,75,2],[74,12,75,14],[74,24,75,24],[74,25,75,25],[74,26,75,26],[74,27,75,27],[74,28,75,28],[74,29,75,29],[74,30,75,30],[74,31,75,31],[74,32,75,32],[78,0,79,0],[78,1,79,2],[78,3,79,5],[78,6,79,8],[78,9,79,11],[78,12,79,14],[78,15,79,17],[78,18,79,20],[78,21,79,23],[78,24,79,24],[78,25,79,25],[78,26,79,26],[78,27,79,27],[78,28,79,28],[78,29,79,29],[78,30,79,30],[78,31,79,31],[78,32,79,32],[80,0,81,0],[80,1,81,2],[80,3,81,5],[80,24,81,24],[80,25,81,25],[80,26,81,26],[80,27,81,27],[80,28,81,28],[80,29,81,29],[80,30,81,30],[80,31,81,31],[80,32,81,32],[82,0,83,0],[82,1,83,2],[82,6,83,8],[82,24,83,24],[82,25,83,25],[82,26,83,26],[82,27,83,27],[82,28,83,28],[82,29,83,29],[82,30,83,30],[82,31,83,31],[82,32,83,32],[84,0,85,0],[84,1,85,2],[84,9,85,11],[84,24,85,24],[84,25,85,25],[84,26,85,26],[84,27,85,27],[84,28,85,28],[84,29,85,29],[84,30,85,30],[84,31,85,31],[84,32,85,32],[86,0,87,0],[86,1,87,2],[86,12,87,14],[86,24,87,24],[86,25,87,25],[86,26,87,26],[86,27,87,27],[86,28,87,28],[86,29,87,29],[86,30,87,30],[86,31,87,31],[86,32,87,32],[90,0,91,0],[90,1,91,2],[90,3,91,5],[90,6,91,8],[90,9,91,11],[90,12,91,14],[90,15,91,17],[90,18,91,20],[90,21,91,23],[90,24,91,24],[90,25,91,25],[90,26,91,26],[90,27,91,27],[90,28,91,28],[90,29,91,29],[90,30,91,30],[90,31,91,31],[90,32,91,32],[92,0,93,0],[92,1,93,2],[92,3,93,5],[92,24,93,24],[92,25,93,25],[92,26,93,26],[92,27,93,27],[92,28,93,28],[92,29,93,29],[92,30,93,30],[92,31,93,31],[92,32,93,32],[94,0,95,0],[94,1,95,2],[94,6,95,8],[94,24,95,24],[94,25,95,25],[94,26,95,26],[94,27,95,27],[94,28,95,28],[94,29,95,29],[94,30,95,30],[94,31,95,31],[94,32,95,32],[96,0,97,0],[96,1,97,2],[96,9,97,11],[96,24,97,24],[96,25,97,25],[96,26,97,26],[96,27,97,27],[96,28,97,28],[96,29,97,29],[96,30,97,30],[96,31,97,31],[96,32,97,32],[98,0,99,0],[98,1,99,2],[98,12,99,14],[98,24,99,24],[98,25,99,25],[98,26,99,26],[98,27,99,27],[98,28,99,28],[98,29,99,29],[98,30,99,30],[98,31,99,31],[98,32,99,32]]}
[null,null,{"$f":"チーム表!$B$1","v":"第２０回　加賀地域少年少女ドッジボール大会"}]
[null,null,"リーグ戦表"]
[null,"レギュラーの部"]
[{"$nulls":4},{"$f":"CONCATENATE(A5,\"1\")","v":"A1"},null,null,{"$f":"CONCATENATE(A5,\"2\")","v":"A2"},null,null,{"$f":"CONCATENATE(A5,\"3\")","v":"A3"},null,null,{"$f":"CONCATENATE(A5,\"4\")","v":"A4"}]
["A","チーム名",null,{"$f":"B7","v":"鞍月アタッカーズ"},null,null,{"$f":"B9","v":"針原パイレーツ"},null,null,{"$f":"B11","v":"小木クラブ"},null,null,{"$f":"B13","v":"NISHIファイヤースターズ"},{"$nulls":11},"勝","負","分","点","内野","順位決定点","相手内野","順位","kaku"]
[]
[{"$f":"CONCATENATE(A5,1)","v":"A1"},{"$f":"VLOOKUP(A7,チーム表!C:D,2,FALSE)","v":"鞍月アタッカーズ"},{"$nulls":4},{"$f":"CONCATENATE($A7,H4)","v":"A1A2"},{"$f":"IF(G8=\"\",\"\",IF(G8=I8,\"△\",IF(G8>I8,\"〇\",\"×\")))","v":"×"},{"$f":"CONCATENATE(H4,$A7)","v":"A2A1"},{"$f":"CONCATENATE($A7,K4)","v":"A1A3"},{"$f":"IF(J8=\"\",\"\",IF(J8=L8,\"△\",IF(J8>L8,\"〇\",\"×\")))","v":"×"},{"$f":"CONCATENATE(K4,$A7)","v":"A3A1"},{"$f":"CONCATENATE($A7,N4)","v":"A1A4"},{"$f":"IF(M8=\"\",\"\",IF(M8=O8,\"△\",IF(M8>O8,\"〇\",\"×\")))","v":"△"},{"$f":"CONCATENATE(N4,$A7)","v":"A4A1"},{"$nulls":9},{"$f":"COUNTIF($E7:$N7,\"〇\")","v":0},{"$f":"COUNTIF($E7:$N7,\"×\")","v":2},{"$f":"COUNTIF($E7:$N7,\"△\")","v":1},{"$f":"Y7*2+AA7","v":1},{"$f":"IF(G8=\"\",\"\",D8+G8+M8+J8)","v":22},{"$f":"IF(AC7=\"\",\"\",AB7*100+AC7)","v":122},{"$f":"IF(AC7=\"\",\"\",F8+I8+L8+O8)","v":27},{"$f":"IF(AD7=\"\",\"\",RANK(AD7,AD7:AD14,0))","v":4},null,{"$f":"CONCATENATE(A5,AF7)","v":"A4"},{"$f":"B7","v":"鞍月アタッカーズ"}]
[{"$nulls":6},{"$f":"VLOOKUP(G7,対戦表!$AG:$AH,2,0)","v":7},"-",{"$f":"VLOOKUP(I7,対戦表!$AG:$AH,2,0)","v":9},{"$f":"VLOOKUP(J7,対戦表!$AG:$AH,2,0)","v":7},"-",{"$f":"VLOOKUP(L7,対戦表!$AG:$AH,2,0)","v":10},{"$f":"VLOOKUP(M7,対戦表!$AG:$AH,2,0)","v":8},"-",{"$f":"VLOOKUP(O7,対戦表!$AG:$AH,2,0)","v":8}]
[{"$f":"CONCATENATE(A5,2)","v":"A2"},{"$f":"VLOOKUP(A9,チーム表!C:D,2,FALSE)","v":"針原パイレーツ"},null,null,{"$f":"IF(D10=\"\",\"\",IF(D10=F10,\"△\",IF(D10>F10,\"〇\",\"×\")))","v":"〇"},{"$nulls":4},{"$f":"CONCATENATE($A9,K4)","v":"A2A3"},{"$f":"IF(J10=\"\",\"\",IF(J10=L10,\"△\",IF(J10>L10,\"〇\",\"×\")))","v":"△"},{"$f":"CONCATENATE(K4,$A9)","v":"A3A2"},{"$f":"CONCATENATE($A9,N4)","v":"A2A4"},{"$f":"IF(M10=\"\",\"\",IF(M10=O10,\"△\",IF(M10>O10,\"〇\",\"×\")))","v":"〇"},{"$f":"CONCATENATE(N4,$A9)","v":"A4A2"},{"$nulls":9},{"$f":"COUNTIF($E9:$N9,\"〇\")","v":2},{"$f":"COUNTIF($E9:$N9,\"×\")","v":0},{"$f":"COUNTIF($E9:$N9,\"△\")","v":1},{"$f":"Y9*2+AA9","v":5},{"$f":"IF(D10=\"\",\"\",D10+G10+M10+J10)","v":26},{"$f":"IF(AC9=\"\",\"\",AB9*100+AC9)","v":526},{"$f":"IF(AC9=\"\",\"\",F10+I10+L10+O10)","v":23},{"$f":"IF(AD9=\"\",\"\",RANK(AD9,AD7:AD14,0))","v":1},null,{"$f":"CONCATENATE(A5,AF9)","v":"A1"},{"$f":"B9","v":"針原パイレーツ"}]
[{"$nulls":3},{"$f":"IF(I8=\"\",\"\",I8)","v":9},"-",{"$f":"IF(G8=\"\",\"\",G8)","v":7},{"$nulls":3},{"$f":"VLOOKUP(J9,対戦表!$AG:$AH,2,0)","v":8},"-",{"$f":"VLOOKUP(L9,対戦表!$AG:$AH,2,0)","v":8},{"$f":"VLOOKUP(M9,対戦表!$AG:$AH,2,0)","v":9},"-",{"$f":"VLOOKUP(O9,対戦表!$AG:$AH,2,0)","v":8}]
[{"$f":"CONCATENATE(A5,3)","v":"A3"},{"$f":"VLOOKUP(A11,チーム表!C:D,2,FALSE)","v":"小木クラブ"},null,null,{"$f":"IF(D12=\"\",\"\",IF(D12=F12,\"△\",IF(D12>F12,\"〇\",\"×\")))","v":"〇"},null,null,{"$f":"IF(G12=\"\",\"\",IF(G12=I12,\"△\",IF(G12>I12,\"〇\",\"×\")))","v":"△"},{"$nulls":4},{"$f":"CONCATENATE($A11,N4)","v":"A3A4"},{"$f":"IF(M12=\"\",\"\",IF(M12=O12,\"△\",IF(M12>O12,\"〇\",\"×\")))","v":"×"},{"$f":"CONCATENATE(N4,$A11)","v":"A4A3"},{"$nulls":9},{"$f":"COUNTIF($E11:$N11,\"〇\")","v":1},{"$f":"COUNTIF($E11:$N11,\"×\")","v":1},{"$f":"COUNTIF($E11:$N11,\"△\")","v":1},{"$f":"Y11*2+AA11","v":3},{"$f":"IF(G12=\"\",\"\",D12+G12+M12+J12)","v":26},{"$f":"IF(AC11=\"\",\"\",AB11*100+AC11)","v":326},{"$f":"IF(AC11=\"\",\"\",F12+I12+L12+O12)","v":24},{"$f":"IF(AD11=\"\",\"\",RANK(AD11,AD7:AD14,0))","v":2},null,{"$f":"CONCATENATE(A5,AF11)","v":"A2"},{"$f":"B11","v":"小木クラブ"}]
[{"$nulls":3},{"$f":"IF(L8=\"\",\"\",L8)","v":10},"-",{"$f":"IF(J8=\"\",\"\",J8)","v":7},{"$f":"IF(L10=\"\",\"\",L10)","v":8},"-",{"$f":"IF(J10=\"\",\"\",J10)","v":8},{"$nulls":3},{"$f":"VLOOKUP(M11,対戦表!$AG:$AH,2,0)","v":8},"-",{"$f":"VLOOKUP(O11,対戦表!$AG:$AH,2,0)","v":9}]
[{"$f":"CONCATENATE(A5,4)","v":"A4"},{"$f":"VLOOKUP(A13,チーム表!C:D,2,FALSE)","v":"NISHIファイヤースターズ"},null,null,{"$f":"IF(D14=\"\",\"\",IF(D14=F14,\"△\",IF(D14>F14,\"〇\",\"×\")))","v":"△"},null,null,{"$f":"IF(G14=\"\",\"\",IF(G14=I14,\"△\",IF(G14>I14,\"〇\",\"×\")))","v":"×"},null,null,{"$f":"IF(J14=\"\",\"\",IF(J14=L14,\"△\",IF(J14>L14,\"〇\",\"×\")))","v":"〇"},{"$nulls":13},{"$f":"COUNTIF($E13:$N13,\"〇\")","v":1},{"$f":"COUNTIF($E13:$N13,\"×\")","v":1},{"$f":"COUNTIF($E13:$N13,\"△\")","v":1},{"$f":"Y13*2+AA13","v":3},{"$f":"IF(G14=\"\",\"\",D14+G14+M14+J14)","v":25},{"$f":"IF(AC13=\"\",\"\",AB13*100+AC13)","v":325},{"$f":"IF(AC13=\"\",\"\",F14+I14+L14+O14)","v":25},{"$f":"IF(AD13=\"\",\"\",RANK(AD13,AD7:AD14,0))","v":3},null,{"$f":"CONCATENATE(A5,AF13)","v":"A3"},{"$f":"B13","v":"NISHIファイヤースターズ"}]
[{"$nulls":3},{"$f":"IF(O8=\"\",\"\",O8)","v":8},"-",{"$f":"IF(M8=\"\",\"\",M8)","v":8},{"$f":"IF(O10=\"\",\"\",O10)","v":8},"-",{"$f":"IF(M10=\"\",\"\",M10)","v":9},{"$f":"IF(O12=\"\",\"\",O12)","v":9},"-",{"$f":"IF(M12=\"\",\"\",M12)","v":8}]
[]
[{"$nulls":4},{"$f":"CONCATENATE(A17,\"1\")","v":"B1"},null,null,{"$f":"CONCATENATE(A17,\"2\")","v":"B2"},null,null,{"$f":"CONCATENATE(A17,\"3\")","v":"B3"},null,null,{"$f":"CONCATENATE(A17,\"4\")","v":"B4"}]
["B","チーム名",null,{"$f":"B19","v":"呉羽ドッジボールクラブ"},null,null,{"$f":"B21","v":"鳳至ドッジボールクラブ"},null,null,{"$f":"B23","v":"千坂ドッジファイヤーズ"},null,null,{"$f":"B25","v":"松任の大魔陣"},{"$nulls":11},"勝","負","分","点","内野","順位決定点","相手内野","順位","kaku"]
[]
[{"$f":"CONCATENATE(A17,1)","v":"B1"},{"$f":"VLOOKUP(A19,チーム表!C:D,2,FALSE)","v":"呉羽ドッジボールクラブ"},{"$nulls":4},{"$f":"CONCATENATE($A19,H16)","v":"B1B2"},{"$f":"IF(G20=\"\",\"\",IF(G20=I20,\"△\",IF(G20>I20,\"〇\",\"×\")))","v":"〇"},{"$f":"CONCATENATE(H16,$A19)","v":"B2B1"},{"$f":"CONCATENATE($A19,K16)","v":"B1B3"},{"$f":"IF(J20=\"\",\"\",IF(J20=L20,\"△\",IF(J20>L20,\"〇\",\"×\")))","v":"×"},{"$f":"CONCATENATE(K16,$A19)","v":"B3B1"},{"$f":"CONCATENATE($A19,N16)","v":"B1B4"},{"$f":"IF(M20=\"\",\"\",IF(M20=O20,\"△\",IF(M20>O20,\"〇\",\"×\")))","v":"△"},{"$f":"CONCATENATE(N16,$A19)","v":"B4B1"},{"$nulls":9},{"$f":"COUNTIF($E19:$N19,\"〇\")","v":1},{"$f":"COUNTIF($E19:$N19,\"×\")","v":1},{"$f":"COUNTIF($E19:$N19,\"△\")","v":1},{"$f":"Y19*2+AA19","v":3},{"$f":"IF(G20=\"\",\"\",D20+G20+M20+J20)","v":26},{"$f":"IF(AC19=\"\",\"\",AB19*100+AC19)","v":326},{"$f":"IF(AC19=\"\",\"\",F20+I20+L20+O20)","v":27},{"$f":"IF(AD19=\"\",\"\",RANK(AD19,AD19:AD26,0))","v":3},null,{"$f":"CONCATENATE(A17,AF19)","v":"B3"},{"$f":"B19","v":"呉羽ドッジボールクラブ"}]
[{"$nulls":6},{"$f":"VLOOKUP(G19,対戦表!$AG:$AH,2,0)","v":10},"-",{"$f":"VLOOKUP(I19,対戦表!$AG:$AH,2,0)","v":9},{"$f":"VLOOKUP(J19,対戦表!$AG:$AH,2,0)","v":7},"-",{"$f":"VLOOKUP(L19,対戦表!$AG:$AH,2,0)","v":9},{"$f":"VLOOKUP(M19,対戦表!$AG:$AH,2,0)","v":9},"-",{"$f":"VLOOKUP(O19,対戦表!$AG:$AH,2,0)","v":9}]
[{"$f":"CONCATENATE(A17,2)","v":"B2"},{"$f":"VLOOKUP(A21,チーム表!C:D,2,FALSE)","v":"鳳至ドッジボールクラブ"},null,null,{"$f":"IF(D22=\"\",\"\",IF(D22=F22,\"△\",IF(D22>F22,\"〇\",\"×\")))","v":"×"},{"$nulls":4},{"$f":"CONCATENATE($A21,K16)","v":"B2B3"},{"$f":"IF(J22=\"\",\"\",IF(J22=L22,\"△\",IF(J22>L22,\"〇\",\"×\")))","v":"×"},{"$f":"CONCATENATE(K16,$A21)","v":"B3B2"},{"$f":"CONCATENATE($A21,N16)","v":"B2B4"},{"$f":"IF(M22=\"\",\"\",IF(M22=O22,\"△\",IF(M22>O22,\"〇\",\"×\")))","v":"×"},{"$f":"CONCATENATE(N16,$A21)","v":"B4B2"},{"$nulls":9},{"$f":"COUNTIF($E21:$N21,\"〇\")","v":0},{"$f":"COUNTIF($E21:$N21,\"×\")","v":3},{"$f":"COUNTIF($E21:$N21,\"△\")","v":0},{"$f":"Y21*2+AA21","v":0},{"$f":"IF(D22=\"\",\"\",D22+G22+M22+J22)","v":22},{"$f":"IF(AC21=\"\",\"\",AB21*100+AC21)","v":22},{"$f":"IF(AC21=\"\",\"\",F22+I22+L22+O22)","v":27},{"$f":"IF(AD21=\"\",\"\",RANK(AD21,AD19:AD26,0))","v":4},null,{"$f":"CONCATENATE(A17,AF21)","v":"B4"},{"$f":"B21","v":"鳳至ドッジボールクラブ"}]
[{"$nulls":3},{"$f":"IF(I20=\"\",\"\",I20)","v":9},"-",{"$f":"IF(G20=\"\",\"\",G20)","v":10},{"$nulls":3},{"$f":"VLOOKUP(J21,対戦表!$AG:$AH,2,0)","v":5},"-",{"$f":"VLOOKUP(L21,対戦表!$AG:$AH,2,0)","v":7},{"$f":"VLOOKUP(M21,対戦表!$AG:$AH,2,0)","v":8},"-",{"$f":"VLOOKUP(O21,対戦表!$AG:$AH,2,0)","v":10}]
[{"$f":"CONCATENATE(A17,3)","v":"B3"},{"$f":"VLOOKUP(A23,チーム表!C:D,2,FALSE)","v":"千坂ドッジファイヤーズ"},null,null,{"$f":"IF(D24=\"\",\"\",IF(D24=F24,\"△\",IF(D24>F24,\"〇\",\"×\")))","v":"〇"},null,null,{"$f":"IF(G24=\"\",\"\",IF(G24=I24,\"△\",IF(G24>I24,\"〇\",\"×\")))","v":"〇"},{"$nulls":4},{"$f":"CONCATENATE($A23,N16)","v":"B3B4"},{"$f":"IF(M24=\"\",\"\",IF(M24=O24,\"△\",IF(M24>O24,\"〇\",\"×\")))","v":"×"},{"$f":"CONCATENATE(N16,$A23)","v":"B4B3"},{"$nulls":9},{"$f":"COUNTIF($E23:$N23,\"〇\")","v":2},{"$f":"COUNTIF($E23:$N23,\"×\")","v":1},{"$f":"COUNTIF($E23:$N23,\"△\")","v":0},{"$f":"Y23*2+AA23","v":4},{"$f":"IF(G24=\"\",\"\",D24+G24+M24+J24)","v":22},{"$f":"IF(AC23=\"\",\"\",AB23*100+AC23)","v":422},{"$f":"IF(AC23=\"\",\"\",F24+I24+L24+O24)","v":21},{"$f":"IF(AD23=\"\",\"\",RANK(AD23,AD19:AD26,0))","v":2},null,{"$f":"CONCATENATE(A17,AF23)","v":"B2"},{"$f":"B23","v":"千坂ドッジファイヤーズ"}]
[{"$nulls":3},{"$f":"IF(L20=\"\",\"\",L20)","v":9},"-",{"$f":"IF(J20=\"\",\"\",J20)","v":7},{"$f":"IF(L22=\"\",\"\",L22)","v":7},"-",{"$f":"IF(J22=\"\",\"\",J22)","v":5},{"$nulls":3},{"$f":"VLOOKUP(M23,対戦表!$AG:$AH,2,0)","v":6},"-",{"$f":"VLOOKUP(O23,対戦表!$AG:$AH,2,0)","v":9}]
[{"$f":"CONCATENATE(A17,4)","v":"B4"},{"$f":"VLOOKUP(A25,チーム表!C:D,2,FALSE)","v":"松任の大魔陣"},null,null,{"$f":"IF(D26=\"\",\"\",IF(D26=F26,\"△\",IF(D26>F26,\"〇\",\"×\")))","v":"△"},null,null,{"$f":"IF(G26=\"\",\"\",IF(G26=I26,\"△\",IF(G26>I26,\"〇\",\"×\")))","v":"〇"},null,null,{"$f":"IF(J26=\"\",\"\",IF(J26=L26,\"△\",IF(J26>L26,\"〇\",\"×\")))","v":"〇"},{"$nulls":13},{"$f":"COUNTIF($E25:$N25,\"〇\")","v":2},{"$f":"COUNTIF($E25:$N25,\"×\")","v":0},{"$f":"COUNTIF($E25:$N25,\"△\")","v":1},{"$f":"Y25*2+AA25","v":5},{"$f":"IF(G26=\"\",\"\",D26+G26+M26+J26)","v":28},{"$f":"IF(AC25=\"\",\"\",AB25*100+AC25)","v":528},{"$f":"IF(AC25=\"\",\"\",F26+I26+L26+O26)","v":23},{"$f":"IF(AD25=\"\",\"\",RANK(AD25,AD19:AD26,0))","v":1},null,{"$f":"CONCATENATE(A17,AF25)","v":"B1"},{"$f":"B25","v":"松任の大魔陣"}]
[{"$nulls":3},{"$f":"IF(O20=\"\",\"\",O20)","v":9},"-",{"$f":"IF(M20=\"\",\"\",M20)","v":9},{"$f":"IF(O22=\"\",\"\",O22)","v":10},"-",{"$f":"IF(M22=\"\",\"\",M22)","v":8},{"$f":"IF(O24=\"\",\"\",O24)","v":9},"-",{"$f":"IF(M24=\"\",\"\",M24)","v":6}]
[]
[{"$nulls":4},{"$f":"CONCATENATE(A29,\"1\")","v":"C1"},null,null,{"$f":"CONCATENATE(A29,\"2\")","v":"C2"},null,null,{"$f":"CONCATENATE(A29,\"3\")","v":"C3"},null,null,{"$f":"CONCATENATE(A29,\"4\")","v":"C4"}]
["C","チーム名",null,{"$f":"B31","v":"光陽マーリンズ"},null,null,{"$f":"B33","v":"中郷ドッジボールクラブ"},null,null,{"$f":"B35","v":"鵜川ミラクルフェニックス"},null,null,{"$f":"B37","v":"向本折クラブA"},{"$nulls":11},"勝","負","分","点","内野","順位決定点","相手内野","順位","kaku"]
[]
[{"$f":"CONCATENATE(A29,1)","v":"C1"},{"$f":"VLOOKUP(A31,チーム表!C:D,2,FALSE)","v":"光陽マーリンズ"},{"$nulls":4},{"$f":"CONCATENATE($A31,H28)","v":"C1C2"},{"$f":"IF(G32=\"\",\"\",IF(G32=I32,\"△\",IF(G32>I32,\"〇\",\"×\")))","v":"〇"},{"$f":"CONCATENATE(H28,$A31)","v":"C2C1"},{"$f":"CONCATENATE($A31,K28)","v":"C1C3"},{"$f":"IF(J32=\"\",\"\",IF(J32=L32,\"△\",IF(J32>L32,\"〇\",\"×\")))","v":"×"},{"$f":"CONCATENATE(K28,$A31)","v":"C3C1"},{"$f":"CONCATENATE($A31,N28)","v":"C1C4"},{"$f":"IF(M32=\"\",\"\",IF(M32=O32,\"△\",IF(M32>O32,\"〇\",\"×\")))","v":"×"},{"$f":"CONCATENATE(N28,$A31)","v":"C4C1"},{"$nulls":9},{"$f":"COUNTIF($E31:$N31,\"〇\")","v":1},{"$f":"COUNTIF($E31:$N31,\"×\")","v":2},{"$f":"COUNTIF($E31:$N31,\"△\")","v":0},{"$f":"Y31*2+AA31","v":2},{"$f":"IF(G32=\"\",\"\",D32+G32+M32+J32)","v":20},{"$f":"IF(AC31=\"\",\"\",AB31*100+AC31)","v":220},{"$f":"IF(AC31=\"\",\"\",F32+I32+L32+O32)","v":19},{"$f":"IF(AD31=\"\",\"\",RANK(AD31,AD31:AD38,0))","v":3},null,{"$f":"CONCATENATE(A29,AF31)","v":"C3"},{"$f":"B31","v":"光陽マーリンズ"}]
[{"$nulls":6},{"$f":"VLOOKUP(G31,対戦表!$AG:$AH,2,0)","v":11},"-",{"$f":"VLOOKUP(I31,対戦表!$AG:$AH,2,0)","v":1},{"$f":"VLOOKUP(J31,対戦表!$AG:$AH,2,0)","v":5},"-",{"$f":"VLOOKUP(L31,対戦表!$AG:$AH,2,0)","v":8},{"$f":"VLOOKUP(M31,対戦表!$AG:$AH,2,0)","v":4},"-",{"$f":"VLOOKUP(O31,対戦表!$AG:$AH,2,0)","v":10}]
[{"$f":"CONCATENATE(A29,2)","v":"C2"},{"$f":"VLOOKUP(A33,チーム表!C:D,2,FALSE)","v":"中郷ドッジボールクラブ"},null,null,{"$f":"IF(D34=\"\",\"\",IF(D34=F34,\"△\",IF(D34>F34,\"〇\",\"×\")))","v":"×"},{"$nulls":4},{"$f":"CONCATENATE($A33,K28)","v":"C2C3"},{"$f":"IF(J34=\"\",\"\",IF(J34=L34,\"△\",IF(J34>L34,\"〇\",\"×\")))","v":"×"},{"$f":"CONCATENATE(K28,$A33)","v":"C3C2"},{"$f":"CONCATENATE($A33,N28)","v":"C2C4"},{"$f":"IF(M34=\"\",\"\",IF(M34=O34,\"△\",IF(M34>O34,\"〇\",\"×\")))","v":"×"},{"$f":"CONCATENATE(N28,$A33)","v":"C4C2"},{"$nulls":9},{"$f":"COUNTIF($E33:$N33,\"〇\")","v":0},{"$f":"COUNTIF($E33:$N33,\"×\")","v":3},{"$f":"COUNTIF($E33:$N33,\"△\")","v":0},{"$f":"Y33*2+AA33","v":0},{"$f":"IF(D34=\"\",\"\",D34+G34+M34+J34)","v":10},{"$f":"IF(AC33=\"\",\"\",AB33*100+AC33)","v":10},{"$f":"IF(AC33=\"\",\"\",F34+I34+L34+O34)","v":31},{"$f":"IF(AD33=\"\",\"\",RANK(AD33,AD31:AD38,0))","v":4},null,{"$f":"CONCATENATE(A29,AF33)","v":"C4"},{"$f":"B33","v":"中郷ドッジボールクラブ"}]
[{"$nulls":3},{"$f":"IF(I32=\"\",\"\",I32)","v":1},"-",{"$f":"IF(G32=\"\",\"\",G32)","v":11},{"$nulls":3},{"$f":"VLOOKUP(J33,対戦表!$AG:$AH,2,0)","v":6},"-",{"$f":"VLOOKUP(L33,対戦表!$AG:$AH,2,0)","v":10},{"$f":"VLOOKUP(M33,対戦表!$AG:$AH,2,0)","v":3},"-",{"$f":"VLOOKUP(O33,対戦表!$AG:$AH,2,0)","v":10}]
[{"$f":"CONCATENATE(A29,3)","v":"C3"},{"$f":"VLOOKUP(A35,チーム表!C:D,2,FALSE)","v":"鵜川ミラクルフェニックス"},null,null,{"$f":"IF(D36=\"\",\"\",IF(D36=F36,\"△\",IF(D36>F36,\"〇\",\"×\")))","v":"〇"},null,null,{"$f":"IF(G36=\"\",\"\",IF(G36=I36,\"△\",IF(G36>I36,\"〇\",\"×\")))","v":"〇"},{"$nulls":4},{"$f":"CONCATENATE($A35,N28)","v":"C3C4"},{"$f":"IF(M36=\"\",\"\",IF(M36=O36,\"△\",IF(M36>O36,\"〇\",\"×\")))","v":"△"},{"$f":"CONCATENATE(N28,$A35)","v":"C4C3"},{"$nulls":9},{"$f":"COUNTIF($E35:$N35,\"〇\")","v":2},{"$f":"COUNTIF($E35:$N35,\"×\")","v":0},{"$f":"COUNTIF($E35:$N35,\"△\")","v":1},{"$f":"Y35*2+AA35","v":5},{"$f":"IF(G36=\"\",\"\",D36+G36+M36+J36)","v":25},{"$f":"IF(AC35=\"\",\"\",AB35*100+AC35)","v":525},{"$f":"IF(AC35=\"\",\"\",F36+I36+L36+O36)","v":18},{"$f":"IF(AD35=\"\",\"\",RANK(AD35,AD31:AD38,0))","v":2},null,{"$f":"CONCATENATE(A29,AF35)","v":"C2"},{"$f":"B35","v":"鵜川ミラクルフェニックス"}]
[{"$nulls":3},{"$f":"IF(L32=\"\",\"\",L32)","v":8},"-",{"$f":"IF(J32=\"\",\"\",J32)","v":5},{"$f":"IF(L34=\"\",\"\",L34)","v":10},"-",{"$f":"IF(J34=\"\",\"\",J34)","v":6},{"$nulls":3},{"$f":"VLOOKUP(M35,対戦表!$AG:$AH,2,0)","v":7},"-",{"$f":"VLOOKUP(O35,対戦表!$AG:$AH,2,0)","v":7}]
[{"$f":"CONCATENATE(A29,4)","v":"C4"},{"$f":"VLOOKUP(A37,チーム表!C:D,2,FALSE)","v":"向本折クラブA"},null,null,{"$f":"IF(D38=\"\",\"\",IF(D38=F38,\"△\",IF(D38>F38,\"〇\",\"×\")))","v":"〇"},null,null,{"$f":"IF(G38=\"\",\"\",IF(G38=I38,\"△\",IF(G38>I38,\"〇\",\"×\")))","v":"〇"},null,null,{"$f":"IF(J38=\"\",\"\",IF(J38=L38,\"△\",IF(J38>L38,\"〇\",\"×\")))","v":"△"},{"$nulls":13},{"$f":"COUNTIF($E37:$N37,\"〇\")","v":2},{"$f":"COUNTIF($E37:$N37,\"×\")","v":0},{"$f":"COUNTIF($E37:$N37,\"△\")","v":1},{"$f":"Y37*2+AA37","v":5},{"$f":"IF(G38=\"\",\"\",D38+G38+M38+J38)","v":27},{"$f":"IF(AC37=\"\",\"\",AB37*100+AC37)","v":527},{"$f":"IF(AC37=\"\",\"\",F38+I38+L38+O38)","v":14},{"$f":"IF(AD37=\"\",\"\",RANK(AD37,AD31:AD38,0))","v":1},null,{"$f":"CONCATENATE(A29,AF37)","v":"C1"},{"$f":"B37","v":"向本折クラブA"}]
[{"$nulls":3},{"$f":"IF(O32=\"\",\"\",O32)","v":10},"-",{"$f":"IF(M32=\"\",\"\",M32)","v":4},{"$f":"IF(O34=\"\",\"\",O34)","v":10},"-",{"$f":"IF(M34=\"\",\"\",M34)","v":3},{"$f":"IF(O36=\"\",\"\",O36)","v":7},"-",{"$f":"IF(M36=\"\",\"\",M36)","v":7}]
[]
[{"$nulls":4},{"$f":"CONCATENATE(A41,\"1\")","v":"D1"},null,null,{"$f":"CONCATENATE(A41,\"2\")","v":"D2"},null,null,{"$f":"CONCATENATE(A41,\"3\")","v":"D3"},null,null,{"$f":"CONCATENATE(A41,\"4\")","v":"D4"},null,null,{"$f":"CONCATENATE(A41,\"5\")","v":"D5"}]
["D","チーム名",null,{"$f":"B43","v":"飯野マジックス"},null,null,{"$f":"B45","v":"三馬パワフル"},null,null,{"$f":"B47","v":"寺井クラブ"},null,null,{"$f":"B49","v":"大門ドッジボールクラブ"},null,null,{"$f":"B51","v":"田上闘球DREAMS"},{"$nulls":8},"勝","負","分","点","内野","順位決定点","相手内野","順位","kaku"]
[]
[{"$f":"CONCATENATE(A41,1)","v":"D1"},{"$f":"VLOOKUP(A43,チーム表!C:D,2,FALSE)","v":"飯野マジックス"},{"$nulls":4},{"$f":"CONCATENATE($A43,H40)","v":"D1D2"},{"$f":"IF(G44=\"\",\"\",IF(G44=I44,\"△\",IF(G44>I44,\"〇\",\"×\")))","v":"〇"},{"$f":"CONCATENATE(H40,$A43)","v":"D2D1"},{"$f":"CONCATENATE($A43,K40)","v":"D1D3"},{"$f":"IF(J44=\"\",\"\",IF(J44=L44,\"△\",IF(J44>L44,\"〇\",\"×\")))","v":"×"},{"$f":"CONCATENATE(K40,$A43)","v":"D3D1"},{"$f":"CONCATENATE($A43,N40)","v":"D1D4"},{"$f":"IF(M44=\"\",\"\",IF(M44=O44,\"△\",IF(M44>O44,\"〇\",\"×\")))","v":"〇"},{"$f":"CONCATENATE(N40,$A43)","v":"D4D1"},{"$f":"CONCATENATE($A43,Q40)","v":"D1D5"},{"$f":"IF(P44=\"\",\"\",IF(P44=R44,\"△\",IF(P44>R44,\"〇\",\"×\")))","v":"×"},{"$f":"CONCATENATE(Q40,$A43)","v":"D5D1"},{"$nulls":6},{"$f":"COUNTIF($E43:$Q43,\"〇\")","v":2},{"$f":"COUNTIF($E43:$Q43,\"×\")","v":2},{"$f":"COUNTIF($E43:$Q43,\"△\")","v":0},{"$f":"Y43*2+AA43","v":4},{"$f":"IF(G44=\"\",\"\",D44+G44+M44+P44+J44)","v":27},{"$f":"IF(AC43=\"\",\"\",AB43*100+AC43)","v":427},{"$f":"IF(AC43=\"\",\"\",F44+I44+L44+O44+R44)","v":32},{"$f":"IF(AD43=\"\",\"\",RANK(AD43,AD43:AD52,0))","v":3},null,{"$f":"CONCATENATE(A41,AF43)","v":"D3"},{"$f":"B43","v":"飯野マジックス"}]
[{"$nulls":6},{"$f":"VLOOKUP(G43,対戦表!$AG:$AH,2,0)","v":10},"-",{"$f":"VLOOKUP(I43,対戦表!$AG:$AH,2,0)","v":7},{"$f":"VLOOKUP(J43,対戦表!$AG:$AH,2,0)","v":6},"-",{"$f":"VLOOKUP(L43,対戦表!$AG:$AH,2,0)","v":9},{"$f":"VLOOKUP(M43,対戦表!$AG:$AH,2,0)","v":9},"-",{"$f":"VLOOKUP(O43,対戦表!$AG:$AH,2,0)","v":6},{"$f":"VLOOKUP(P43,対戦表!$AG:$AH,2,0)","v":2},"-",{"$f":"VLOOKUP(R43,対戦表!$AG:$AH,2,0)","v":10}]
[{"$f":"CONCATENATE(A41,2)","v":"D2"},{"$f":"VLOOKUP(A45,チーム表!C:D,2,FALSE)","v":"三馬パワフル"},null,null,{"$f":"IF(D46=\"\",\"\",IF(D46=F46,\"△\",IF(D46>F46,\"〇\",\"×\")))","v":"×"},{"$nulls":4},{"$f":"CONCATENATE($A45,K40)","v":"D2D3"},{"$f":"IF(J46=\"\",\"\",IF(J46=L46,\"△\",IF(J46>L46,\"〇\",\"×\")))","v":"×"},{"$f":"CONCATENATE(K40,$A45)","v":"D3D2"},{"$f":"CONCATENATE($A45,N40)","v":"D2D4"},{"$f":"IF(M46=\"\",\"\",IF(M46=O46,\"△\",IF(M46>O46,\"〇\",\"×\")))","v":"×"},{"$f":"CONCATENATE(N40,$A45)","v":"D4D2"},{"$f":"CONCATENATE($A45,Q40)","v":"D2D5"},{"$f":"IF(P46=\"\",\"\",IF(P46=R46,\"△\",IF(P46>R46,\"〇\",\"×\")))","v":"×"},{"$f":"CONCATENATE(Q40,$A45)","v":"D5D2"},{"$nulls":6},{"$f":"COUNTIF($E45:$Q45,\"〇\")","v":0},{"$f":"COUNTIF($E45:$Q45,\"×\")","v":4},{"$f":"COUNTIF($E45:$Q45,\"△\")","v":0},{"$f":"Y45*2+AA45","v":0},{"$f":"IF(D46=\"\",\"\",D46+G46+M46+P46+J46)","v":15},{"$f":"IF(AC45=\"\",\"\",AB45*100+AC45)","v":15},{"$f":"IF(AC45=\"\",\"\",F46+I46+L46+O46+R46)","v":37},{"$f":"IF(AD45=\"\",\"\",RANK(AD45,AD43:AD52,0))","v":5},null,{"$f":"CONCATENATE(A41,AF45)","v":"D5"},{"$f":"B45","v":"三馬パワフル"}]
[{"$nulls":3},{"$f":"IF(I44=\"\",\"\",I44)","v":7},"-",{"$f":"IF(G44=\"\",\"\",G44)","v":10},{"$nulls":3},{"$f":"VLOOKUP(J45,対戦表!$AG:$AH,2,0)","v":0},"-",{"$f":"VLOOKUP(L45,対戦表!$AG:$AH,2,0)","v":7},{"$f":"VLOOKUP(M45,対戦表!$AG:$AH,2,0)","v":6},"-",{"$f":"VLOOKUP(O45,対戦表!$AG:$AH,2,0)","v":9},{"$f":"VLOOKUP(P45,対戦表!$AG:$AH,2,0)","v":2},"-",{"$f":"VLOOKUP(R45,対戦表!$AG:$AH,2,0)","v":11}]
[{"$f":"CONCATENATE(A41,3)","v":"D3"},{"$f":"VLOOKUP(A47,チーム表!C:D,2,FALSE)","v":"寺井クラブ"},null,null,{"$f":"IF(D48=\"\",\"\",IF(D48=F48,\"△\",IF(D48>F48,\"〇\",\"×\")))","v":"〇"},null,null,{"$f":"IF(G48=\"\",\"\",IF(G48=I48,\"△\",IF(G48>I48,\"〇\",\"×\")))","v":"〇"},{"$nulls":4},{"$f":"CONCATENATE($A47,N40)","v":"D3D4"},{"$f":"IF(M48=\"\",\"\",IF(M48=O48,\"△\",IF(M48>O48,\"〇\",\"×\")))","v":"△"},{"$f":"CONCATENATE(N40,$A47)","v":"D4D3"},{"$f":"CONCATENATE($A47,Q40)","v":"D3D5"},{"$f":"IF(P48=\"\",\"\",IF(P48=R48,\"△\",IF(P48>R48,\"〇\",\"×\")))","v":"×"},{"$f":"CONCATENATE(Q40,$A47)","v":"D5D3"},{"$nulls":6},{"$f":"COUNTIF($E47:$Q47,\"〇\")","v":2},{"$f":"COUNTIF($E47:$Q47,\"×\")","v":1},{"$f":"COUNTIF($E47:$Q47,\"△\")","v":1},{"$f":"Y47*2+AA47","v":5},{"$f":"IF(G48=\"\",\"\",D48+G48+M48+P48+J48)","v":30},{"$f":"IF(AC47=\"\",\"\",AB47*100+AC47)","v":530},{"$f":"IF(AC47=\"\",\"\",F48+I48+L48+O48+R48)","v":24},{"$f":"IF(AD47=\"\",\"\",RANK(AD47,AD43:AD52,0))","v":2},null,{"$f":"CONCATENATE(A41,AF47)","v":"D2"},{"$f":"B47","v":"寺井クラブ"}]
[{"$nulls":3},{"$f":"IF(L44=\"\",\"\",L44)","v":9},"-",{"$f":"IF(J44=\"\",\"\",J44)","v":6},{"$f":"IF(L46=\"\",\"\",L46)","v":7},"-",{"$f":"IF(J46=\"\",\"\",J46)","v":0},{"$nulls":3},{"$f":"VLOOKUP(M47,対戦表!$AG:$AH,2,0)","v":9},"-",{"$f":"VLOOKUP(O47,対戦表!$AG:$AH,2,0)","v":9},{"$f":"VLOOKUP(P47,対戦表!$AG:$AH,2,0)","v":5},"-",{"$f":"VLOOKUP(R47,対戦表!$AG:$AH,2,0)","v":9}]
[{"$f":"CONCATENATE(A41,4)","v":"D4"},{"$f":"VLOOKUP(A49,チーム表!C:D,2,FALSE)","v":"大門ドッジボールクラブ"},null,null,{"$f":"IF(D50=\"\",\"\",IF(D50=F50,\"△\",IF(D50>F50,\"〇\",\"×\")))","v":"×"},null,null,{"$f":"IF(G50=\"\",\"\",IF(G50=I50,\"△\",IF(G50>I50,\"〇\",\"×\")))","v":"〇"},null,null,{"$f":"IF(J50=\"\",\"\",IF(J50=L50,\"△\",IF(J50>L50,\"〇\",\"×\")))","v":"△"},{"$nulls":4},{"$f":"CONCATENATE($A49,Q40)","v":"D4D5"},{"$f":"IF(P50=\"\",\"\",IF(P50=R50,\"△\",IF(P50>R50,\"〇\",\"×\")))","v":"×"},{"$f":"CONCATENATE(Q40,$A49)","v":"D5D4"},{"$nulls":6},{"$f":"COUNTIF($E49:$Q49,\"〇\")","v":1},{"$f":"COUNTIF($E49:$Q49,\"×\")","v":2},{"$f":"COUNTIF($E49:$Q49,\"△\")","v":1},{"$f":"Y49*2+AA49","v":3},{"$f":"IF(G50=\"\",\"\",D50+G50+M50+P50+J50)","v":28},{"$f":"IF(AC49=\"\",\"\",AB49*100+AC49)","v":328},{"$f":"IF(AC49=\"\",\"\",F50+I50+L50+O50+R50)","v":32},{"$f":"IF(AD49=\"\",\"\",RANK(AD49,AD43:AD52,0))","v":4},null,{"$f":"CONCATENATE(A41,AF49)","v":"D4"},{"$f":"B49","v":"大門ドッジボールクラブ"}]
[{"$nulls":3},{"$f":"IF(O44=\"\",\"\",O44)","v":6},"-",{"$f":"IF(M44=\"\",\"\",M44)","v":9},{"$f":"IF(O46=\"\",\"\",O46)","v":9},"-",{"$f":"IF(M46=\"\",\"\",M46)","v":6},{"$f":"IF(O48=\"\",\"\",O48)","v":9},"-",{"$f":"IF(M48=\"\",\"\",M48)","v":9},{"$nulls":3},{"$f":"VLOOKUP(P49,対戦表!$AG:$AH,2,0)","v":4},"-",{"$f":"VLOOKUP(R49,対戦表!$AG:$AH,2,0)","v":8}]
[{"$f":"CONCATENATE(A41,5)","v":"D5"},{"$f":"VLOOKUP(A51,チーム表!C:D,2,FALSE)","v":"田上闘球DREAMS"},null,null,{"$f":"IF(D52=\"\",\"\",IF(D52=F52,\"△\",IF(D52>F52,\"〇\",\"×\")))","v":"〇"},null,null,{"$f":"IF(G52=\"\",\"\",IF(G52=I52,\"△\",IF(G52>I52,\"〇\",\"×\")))","v":"〇"},null,null,{"$f":"IF(J52=\"\",\"\",IF(J52=L52,\"△\",IF(J52>L52,\"〇\",\"×\")))","v":"〇"},null,null,{"$f":"IF(M52=\"\",\"\",IF(M52=O52,\"△\",IF(M52>O52,\"〇\",\"×\")))","v":"〇"},null,{"$f":"IF(P52=\"\",\"\",IF(P52=R52,\"△\",IF(P52>R52,\"〇\",\"×\")))","v":""},{"$nulls":8},{"$f":"COUNTIF($E51:$Q51,\"〇\")","v":4},{"$f":"COUNTIF($E51:$Q51,\"×\")","v":0},{"$f":"COUNTIF($E51:$Q51,\"△\")","v":0},{"$f":"Y51*2+AA51","v":8},{"$f":"IF(G52=\"\",\"\",D52+G52+M52+P52+J52)","v":38},{"$f":"IF(AC51=\"\",\"\",AB51*100+AC51)","v":838},{"$f":"IF(AC51=\"\",\"\",F52+I52+L52+O52+R52)","v":13},{"$f":"IF(AD51=\"\",\"\",RANK(AD51,AD43:AD52,0))","v":1},null,{"$f":"CONCATENATE(A41,AF51)","v":"D1"},{"$f":"B51","v":"田上闘球DREAMS"}]
[{"$nulls":3},{"$f":"IF($R44=\"\",\"\",$R44)","v":10},"-",{"$f":"IF($P44=\"\",\"\",$P44)","v":2},{"$f":"IF($R46=\"\",\"\",$R46)","v":11},"-",{"$f":"IF($P46=\"\",\"\",$P46)","v":2},{"$f":"IF($R48=\"\",\"\",$R48)","v":9},"-",{"$f":"IF($P48=\"\",\"\",$P48)","v":5},{"$f":"IF($R50=\"\",\"\",$R50)","v":8},"-",{"$f":"IF($P50=\"\",\"\",$P50)","v":4}]
[null,"ジュニアの部"]
[{"$nulls":4},{"$f":"CONCATENATE(A55,\"1\")","v":"E1"},null,null,{"$f":"CONCATENATE(A55,\"2\")","v":"E2"},null,null,{"$f":"CONCATENATE(A55,\"3\")","v":"E3"},null,null,{"$f":"CONCATENATE(A55,\"4\")","v":"E4"}]
["E","チーム名",null,{"$f":"B57","v":"鞍月アタッカーズジュニア"},null,null,{"$f":"B59","v":"鳳至ジュニア"},null,null,{"$f":"B61","v":"中郷ミラクルジュニア"},null,null,{"$f":"B63","v":"ドッジの王子様"},{"$nulls":11},"勝","負","分","点","内野","順位決定点","相手内野","順位","kaku"]
[]
[{"$f":"CONCATENATE(A55,1)","v":"E1"},{"$f":"VLOOKUP(A57,チーム表!C:D,2,FALSE)","v":"鞍月アタッカーズジュニア"},{"$nulls":4},{"$f":"CONCATENATE($A57,H54)","v":"E1E2"},{"$f":"IF(G58=\"\",\"\",IF(G58=I58,\"△\",IF(G58>I58,\"〇\",\"×\")))","v":"〇"},{"$f":"CONCATENATE(H54,$A57)","v":"E2E1"},{"$f":"CONCATENATE($A57,K54)","v":"E1E3"},{"$f":"IF(J58=\"\",\"\",IF(J58=L58,\"△\",IF(J58>L58,\"〇\",\"×\")))","v":"〇"},{"$f":"CONCATENATE(K54,$A57)","v":"E3E1"},{"$f":"CONCATENATE($A57,N54)","v":"E1E4"},{"$f":"IF(M58=\"\",\"\",IF(M58=O58,\"△\",IF(M58>O58,\"〇\",\"×\")))","v":"〇"},{"$f":"CONCATENATE(N54,$A57)","v":"E4E1"},{"$nulls":9},{"$f":"COUNTIF($E57:$N57,\"〇\")","v":3},{"$f":"COUNTIF($E57:$N57,\"×\")","v":0},{"$f":"COUNTIF($E57:$N57,\"△\")","v":0},{"$f":"Y57*2+AA57","v":6},{"$f":"IF(G58=\"\",\"\",D58+G58+M58+J58)","v":22},{"$f":"IF(AC57=\"\",\"\",AB57*100+AC57)","v":622},{"$f":"IF(AC57=\"\",\"\",F58+I58+L58+O58)","v":13},{"$f":"IF(AD57=\"\",\"\",RANK(AD57,AD57:AD64,0))","v":1},null,{"$f":"CONCATENATE(A55,AF57)","v":"E1"},{"$f":"B57","v":"鞍月アタッカーズジュニア"}]
[{"$nulls":6},{"$f":"VLOOKUP(G57,対戦表!$AG:$AH,2,0)","v":8},"-",{"$f":"VLOOKUP(I57,対戦表!$AG:$AH,2,0)","v":4},{"$f":"VLOOKUP(J57,対戦表!$AG:$AH,2,0)","v":8},"-",{"$f":"VLOOKUP(L57,対戦表!$AG:$AH,2,0)","v":4},{"$f":"VLOOKUP(M57,対戦表!$AG:$AH,2,0)","v":6},"-",{"$f":"VLOOKUP(O57,対戦表!$AG:$AH,2,0)","v":5}]
[{"$f":"CONCATENATE(A55,2)","v":"E2"},{"$f":"VLOOKUP(A59,チーム表!C:D,2,FALSE)","v":"鳳至ジュニア"},null,null,{"$f":"IF(D60=\"\",\"\",IF(D60=F60,\"△\",IF(D60>F60,\"〇\",\"×\")))","v":"×"},{"$nulls":4},{"$f":"CONCATENATE($A59,K54)","v":"E2E3"},{"$f":"IF(J60=\"\",\"\",IF(J60=L60,\"△\",IF(J60>L60,\"〇\",\"×\")))","v":"〇"},{"$f":"CONCATENATE(K54,$A59)","v":"E3E2"},{"$f":"CONCATENATE($A59,N54)","v":"E2E4"},{"$f":"IF(M60=\"\",\"\",IF(M60=O60,\"△\",IF(M60>O60,\"〇\",\"×\")))","v":"〇"},{"$f":"CONCATENATE(N54,$A59)","v":"E4E2"},{"$nulls":9},{"$f":"COUNTIF($E59:$N59,\"〇\")","v":2},{"$f":"COUNTIF($E59:$N59,\"×\")","v":1},{"$f":"COUNTIF($E59:$N59,\"△\")","v":0},{"$f":"Y59*2+AA59","v":4},{"$f":"IF(D60=\"\",\"\",D60+G60+M60+J60)","v":19},{"$f":"IF(AC59=\"\",\"\",AB59*100+AC59)","v":419},{"$f":"IF(AC59=\"\",\"\",F60+I60+L60+O60)","v":15},{"$f":"IF(AD59=\"\",\"\",RANK(AD59,AD57:AD64,0))","v":2},null,{"$f":"CONCATENATE(A55,AF59)","v":"E2"},{"$f":"B59","v":"鳳至ジュニア"}]
[{"$nulls":3},{"$f":"IF(I58=\"\",\"\",I58)","v":4},"-",{"$f":"IF(G58=\"\",\"\",G58)","v":8},{"$nulls":3},{"$f":"VLOOKUP(J59,対戦表!$AG:$AH,2,0)","v":8},"-",{"$f":"VLOOKUP(L59,対戦表!$AG:$AH,2,0)","v":2},{"$f":"VLOOKUP(M59,対戦表!$AG:$AH,2,0)","v":7},"-",{"$f":"VLOOKUP(O59,対戦表!$AG:$AH,2,0)","v":5}]
[{"$f":"CONCATENATE(A55,3)","v":"E3"},{"$f":"VLOOKUP(A61,チーム表!C:D,2,FALSE)","v":"中郷ミラクルジュニア"},null,null,{"$f":"IF(D62=\"\",\"\",IF(D62=F62,\"△\",IF(D62>F62,\"〇\",\"×\")))","v":"×"},null,null,{"$f":"IF(G62=\"\",\"\",IF(G62=I62,\"△\",IF(G62>I62,\"〇\",\"×\")))","v":"×"},{"$nulls":4},{"$f":"CONCATENATE($A61,N54)","v":"E3E4"},{"$f":"IF(M62=\"\",\"\",IF(M62=O62,\"△\",IF(M62>O62,\"〇\",\"×\")))","v":"×"},{"$f":"CONCATENATE(N54,$A61)","v":"E4E3"},{"$nulls":9},{"$f":"COUNTIF($E61:$N61,\"〇\")","v":0},{"$f":"COUNTIF($E61:$N61,\"×\")","v":3},{"$f":"COUNTIF($E61:$N61,\"△\")","v":0},{"$f":"Y61*2+AA61","v":0},{"$f":"IF(G62=\"\",\"\",D62+G62+M62+J62)","v":11},{"$f":"IF(AC61=\"\",\"\",AB61*100+AC61)","v":11},{"$f":"IF(AC61=\"\",\"\",F62+I62+L62+O62)","v":25},{"$f":"IF(AD61=\"\",\"\",RANK(AD61,AD57:AD64,0))","v":4},null,{"$f":"CONCATENATE(A55,AF61)","v":"E4"},{"$f":"B61","v":"中郷ミラクルジュニア"}]
[{"$nulls":3},{"$f":"IF(L58=\"\",\"\",L58)","v":4},"-",{"$f":"IF(J58=\"\",\"\",J58)","v":8},{"$f":"IF(L60=\"\",\"\",L60)","v":2},"-",{"$f":"IF(J60=\"\",\"\",J60)","v":8},{"$nulls":3},{"$f":"VLOOKUP(M61,対戦表!$AG:$AH,2,0)","v":5},"-",{"$f":"VLOOKUP(O61,対戦表!$AG:$AH,2,0)","v":9}]
[{"$f":"CONCATENATE(A55,4)","v":"E4"},{"$f":"VLOOKUP(A63,チーム表!C:D,2,FALSE)","v":"ドッジの王子様"},null,null,{"$f":"IF(D64=\"\",\"\",IF(D64=F64,\"△\",IF(D64>F64,\"〇\",\"×\")))","v":"×"},null,null,{"$f":"IF(G64=\"\",\"\",IF(G64=I64,\"△\",IF(G64>I64,\"〇\",\"×\")))","v":"×"},null,null,{"$f":"IF(J64=\"\",\"\",IF(J64=L64,\"△\",IF(J64>L64,\"〇\",\"×\")))","v":"〇"},{"$nulls":13},{"$f":"COUNTIF($E63:$N63,\"〇\")","v":1},{"$f":"COUNTIF($E63:$N63,\"×\")","v":2},{"$f":"COUNTIF($E63:$N63,\"△\")","v":0},{"$f":"Y63*2+AA63","v":2},{"$f":"IF(G64=\"\",\"\",D64+G64+M64+J64)","v":19},{"$f":"IF(AC63=\"\",\"\",AB63*100+AC63)","v":219},{"$f":"IF(AC63=\"\",\"\",F64+I64+L64+O64)","v":18},{"$f":"IF(AD63=\"\",\"\",RANK(AD63,AD57:AD64,0))","v":3},null,{"$f":"CONCATENATE(A55,AF63)","v":"E3"},{"$f":"B63","v":"ドッジの王子様"}]
[{"$nulls":3},{"$f":"IF(O58=\"\",\"\",O58)","v":5},"-",{"$f":"IF(M58=\"\",\"\",M58)","v":6},{"$f":"IF(O60=\"\",\"\",O60)","v":5},"-",{"$f":"IF(M60=\"\",\"\",M60)","v":7},{"$f":"IF(O62=\"\",\"\",O62)","v":9},"-",{"$f":"IF(M62=\"\",\"\",M62)","v":5}]
[]
[{"$nulls":4},{"$f":"CONCATENATE(A67,\"1\")","v":"F1"},null,null,{"$f":"CONCATENATE(A67,\"2\")","v":"F2"},null,null,{"$f":"CONCATENATE(A67,\"3\")","v":"F3"},null,null,{"$f":"CONCATENATE(A67,\"4\")","v":"F4"}]
["F","チーム名",null,{"$f":"B69","v":"九十九クラブ"},null,null,{"$f":"B71","v":"千坂ロータスルート"},null,null,{"$f":"B73","v":"向本折クラブNew"},null,null,{"$f":"B75","v":"寺井クラブＪｒ　A"},{"$nulls":11},"勝","負","分","点","内野","順位決定点","相手内野","順位","kaku"]
[]
[{"$f":"CONCATENATE(A67,1)","v":"F1"},{"$f":"VLOOKUP(A69,チーム表!C:D,2,FALSE)","v":"九十九クラブ"},{"$nulls":4},{"$f":"CONCATENATE($A69,H66)","v":"F1F2"},{"$f":"IF(G70=\"\",\"\",IF(G70=I70,\"△\",IF(G70>I70,\"〇\",\"×\")))","v":"〇"},{"$f":"CONCATENATE(H66,$A69)","v":"F2F1"},{"$f":"CONCATENATE($A69,K66)","v":"F1F3"},{"$f":"IF(J70=\"\",\"\",IF(J70=L70,\"△\",IF(J70>L70,\"〇\",\"×\")))","v":"〇"},{"$f":"CONCATENATE(K66,$A69)","v":"F3F1"},{"$f":"CONCATENATE($A69,N66)","v":"F1F4"},{"$f":"IF(M70=\"\",\"\",IF(M70=O70,\"△\",IF(M70>O70,\"〇\",\"×\")))","v":"〇"},{"$f":"CONCATENATE(N66,$A69)","v":"F4F1"},{"$nulls":9},{"$f":"COUNTIF($E69:$N69,\"〇\")","v":3},{"$f":"COUNTIF($E69:$N69,\"×\")","v":0},{"$f":"COUNTIF($E69:$N69,\"△\")","v":0},{"$f":"Y69*2+AA69","v":6},{"$f":"IF(G70=\"\",\"\",D70+G70+M70+J70)","v":19},{"$f":"IF(AC69=\"\",\"\",AB69*100+AC69)","v":619},{"$f":"IF(AC69=\"\",\"\",F70+I70+L70+O70)","v":8},{"$f":"IF(AD69=\"\",\"\",RANK(AD69,AD69:AD76,0))","v":1},null,{"$f":"CONCATENATE(A67,AF69)","v":"F1"},{"$f":"B69","v":"九十九クラブ"}]
[{"$nulls":6},{"$f":"VLOOKUP(G69,対戦表!$AG:$AH,2,0)","v":6},"-",{"$f":"VLOOKUP(I69,対戦表!$AG:$AH,2,0)","v":3},{"$f":"VLOOKUP(J69,対戦表!$AG:$AH,2,0)","v":6},"-",{"$f":"VLOOKUP(L69,対戦表!$AG:$AH,2,0)","v":2},{"$f":"VLOOKUP(M69,対戦表!$AG:$AH,2,0)","v":7},"-",{"$f":"VLOOKUP(O69,対戦表!$AG:$AH,2,0)","v":3}]
[{"$f":"CONCATENATE(A67,2)","v":"F2"},{"$f":"VLOOKUP(A71,チーム表!C:D,2,FALSE)","v":"千坂ロータスルート"},null,null,{"$f":"IF(D72=\"\",\"\",IF(D72=F72,\"△\",IF(D72>F72,\"〇\",\"×\")))","v":"×"},{"$nulls":4},{"$f":"CONCATENATE($A71,K66)","v":"F2F3"},{"$f":"IF(J72=\"\",\"\",IF(J72=L72,\"△\",IF(J72>L72,\"〇\",\"×\")))","v":"×"},{"$f":"CONCATENATE(K66,$A71)","v":"F3F2"},{"$f":"CONCATENATE($A71,N66)","v":"F2F4"},{"$f":"IF(M72=\"\",\"\",IF(M72=O72,\"△\",IF(M72>O72,\"〇\",\"×\")))","v":"×"},{"$f":"CONCATENATE(N66,$A71)","v":"F4F2"},{"$nulls":9},{"$f":"COUNTIF($E71:$N71,\"〇\")","v":0},{"$f":"COUNTIF($E71:$N71,\"×\")","v":3},{"$f":"COUNTIF($E71:$N71,\"△\")","v":0},{"$f":"Y71*2+AA71","v":0},{"$f":"IF(D72=\"\",\"\",D72+G72+M72+J72)","v":5},{"$f":"IF(AC71=\"\",\"\",AB71*100+AC71)","v":5},{"$f":"IF(AC71=\"\",\"\",F72+I72+L72+O72)","v":18},{"$f":"IF(AD71=\"\",\"\",RANK(AD71,AD69:AD76,0))","v":4},null,{"$f":"CONCATENATE(A67,AF71)","v":"F4"},{"$f":"B71","v":"千坂ロータスルート"}]
[{"$nulls":3},{"$f":"IF(I70=\"\",\"\",I70)","v":3},"-",{"$f":"IF(G70=\"\",\"\",G70)","v":6},{"$nulls":3},{"$f":"VLOOKUP(J71,対戦表!$AG:$AH,2,0)","v":0},"-",{"$f":"VLOOKUP(L71,対戦表!$AG:$AH,2,0)","v":6},{"$f":"VLOOKUP(M71,対戦表!$AG:$AH,2,0)","v":2},"-",{"$f":"VLOOKUP(O71,対戦表!$AG:$AH,2,0)","v":6}]
[{"$f":"CONCATENATE(A67,3)","v":"F3"},{"$f":"VLOOKUP(A73,チーム表!C:D,2,FALSE)","v":"向本折クラブNew"},null,null,{"$f":"IF(D74=\"\",\"\",IF(D74=F74,\"△\",IF(D74>F74,\"〇\",\"×\")))","v":"×"},null,null,{"$f":"IF(G74=\"\",\"\",IF(G74=I74,\"△\",IF(G74>I74,\"〇\",\"×\")))","v":"〇"},{"$nulls":4},{"$f":"CONCATENATE($A73,N66)","v":"F3F4"},{"$f":"IF(M74=\"\",\"\",IF(M74=O74,\"△\",IF(M74>O74,\"〇\",\"×\")))","v":"〇"},{"$f":"CONCATENATE(N66,$A73)","v":"F4F3"},{"$nulls":9},{"$f":"COUNTIF($E73:$N73,\"〇\")","v":2},{"$f":"COUNTIF($E73:$N73,\"×\")","v":1},{"$f":"COUNTIF($E73:$N73,\"△\")","v":0},{"$f":"Y73*2+AA73","v":4},{"$f":"IF(G74=\"\",\"\",D74+G74+M74+J74)","v":13},{"$f":"IF(AC73=\"\",\"\",AB73*100+AC73)","v":413},{"$f":"IF(AC73=\"\",\"\",F74+I74+L74+O74)","v":7},{"$f":"IF(AD73=\"\",\"\",RANK(AD73,AD69:AD76,0))","v":2},null,{"$f":"CONCATENATE(A67,AF73)","v":"F2"},{"$f":"B73","v":"向本折クラブNew"}]
[{"$nulls":3},{"$f":"IF(L70=\"\",\"\",L70)","v":2},"-",{"$f":"IF(J70=\"\",\"\",J70)","v":6},{"$f":"IF(L72=\"\",\"\",L72)","v":6},"-",{"$f":"IF(J72=\"\",\"\",J72)","v":0},{"$nulls":3},{"$f":"VLOOKUP(M73,対戦表!$AG:$AH,2,0)","v":5},"-",{"$f":"VLOOKUP(O73,対戦表!$AG:$AH,2,0)","v":1}]
[{"$f":"CONCATENATE(A67,4)","v":"F4"},{"$f":"VLOOKUP(A75,チーム表!C:D,2,FALSE)","v":"寺井クラブＪｒ　A"},null,null,{"$f":"IF(D76=\"\",\"\",IF(D76=F76,\"△\",IF(D76>F76,\"〇\",\"×\")))","v":"×"},null,null,{"$f":"IF(G76=\"\",\"\",IF(G76=I76,\"△\",IF(G76>I76,\"〇\",\"×\")))","v":"〇"},null,null,{"$f":"IF(J76=\"\",\"\",IF(J76=L76,\"△\",IF(J76>L76,\"〇\",\"×\")))","v":"×"},{"$nulls":13},{"$f":"COUNTIF($E75:$N75,\"〇\")","v":1},{"$f":"COUNTIF($E75:$N75,\"×\")","v":2},{"$f":"COUNTIF($E75:$N75,\"△\")","v":0},{"$f":"Y75*2+AA75","v":2},{"$f":"IF(G76=\"\",\"\",D76+G76+M76+J76)","v":10},{"$f":"IF(AC75=\"\",\"\",AB75*100+AC75)","v":210},{"$f":"IF(AC75=\"\",\"\",F76+I76+L76+O76)","v":14},{"$f":"IF(AD75=\"\",\"\",RANK(AD75,AD69:AD76,0))","v":3},null,{"$f":"CONCATENATE(A67,AF75)","v":"F3"},{"$f":"B75","v":"寺井クラブＪｒ　A"}]
[{"$nulls":3},{"$f":"IF(O70=\"\",\"\",O70)","v":3},"-",{"$f":"IF(M70=\"\",\"\",M70)","v":7},{"$f":"IF(O72=\"\",\"\",O72)","v":6},"-",{"$f":"IF(M72=\"\",\"\",M72)","v":2},{"$f":"IF(O74=\"\",\"\",O74)","v":1},"-",{"$f":"IF(M74=\"\",\"\",M74)","v":5}]
[]
[{"$nulls":4},{"$f":"CONCATENATE(A79,\"1\")","v":"G1"},null,null,{"$f":"CONCATENATE(A79,\"2\")","v":"G2"},null,null,{"$f":"CONCATENATE(A79,\"3\")","v":"G3"},null,null,{"$f":"CONCATENATE(A79,\"4\")","v":"G4"}]
["G","チーム名",null,{"$f":"B81","v":"鞍月アタッカーズキッズ"},null,null,{"$f":"B83","v":"松任の大魔陣Jr."},null,null,{"$f":"B85","v":"鵜川フェニックスジュニア"},null,null,{"$f":"B87","v":"大門ドッジボールクラブJr"},{"$nulls":11},"勝","負","分","点","内野","順位決定点","相手内野","順位","kaku"]
[]
[{"$f":"CONCATENATE(A79,1)","v":"G1"},{"$f":"VLOOKUP(A81,チーム表!C:D,2,FALSE)","v":"鞍月アタッカーズキッズ"},{"$nulls":4},{"$f":"CONCATENATE($A81,H78)","v":"G1G2"},{"$f":"IF(G82=\"\",\"\",IF(G82=I82,\"△\",IF(G82>I82,\"〇\",\"×\")))","v":"×"},{"$f":"CONCATENATE(H78,$A81)","v":"G2G1"},{"$f":"CONCATENATE($A81,K78)","v":"G1G3"},{"$f":"IF(J82=\"\",\"\",IF(J82=L82,\"△\",IF(J82>L82,\"〇\",\"×\")))","v":"×"},{"$f":"CONCATENATE(K78,$A81)","v":"G3G1"},{"$f":"CONCATENATE($A81,N78)","v":"G1G4"},{"$f":"IF(M82=\"\",\"\",IF(M82=O82,\"△\",IF(M82>O82,\"〇\",\"×\")))","v":"×"},{"$f":"CONCATENATE(N78,$A81)","v":"G4G1"},{"$nulls":9},{"$f":"COUNTIF($E81:$N81,\"〇\")","v":0},{"$f":"COUNTIF($E81:$N81,\"×\")","v":3},{"$f":"COUNTIF($E81:$N81,\"△\")","v":0},{"$f":"Y81*2+AA81","v":0},{"$f":"IF(G82=\"\",\"\",D82+G82+M82+J82)","v":6},{"$f":"IF(AC81=\"\",\"\",AB81*100+AC81)","v":6},{"$f":"IF(AC81=\"\",\"\",F82+I82+L82+O82)","v":18},{"$f":"IF(AD81=\"\",\"\",RANK(AD81,AD81:AD88,0))","v":4},null,{"$f":"CONCATENATE(A79,AF81)","v":"G4"},{"$f":"B81","v":"鞍月アタッカーズキッズ"}]
[{"$nulls":6},{"$f":"VLOOKUP(G81,対戦表!$AG:$AH,2,0)","v":3},"-",{"$f":"VLOOKUP(I81,対戦表!$AG:$AH,2,0)","v":6},{"$f":"VLOOKUP(J81,対戦表!$AG:$AH,2,0)","v":0},"-",{"$f":"VLOOKUP(L81,対戦表!$AG:$AH,2,0)","v":8},{"$f":"VLOOKUP(M81,対戦表!$AG:$AH,2,0)","v":3},"-",{"$f":"VLOOKUP(O81,対戦表!$AG:$AH,2,0)","v":4}]
[{"$f":"CONCATENATE(A79,2)","v":"G2"},{"$f":"VLOOKUP(A83,チーム表!C:D,2,FALSE)","v":"松任の大魔陣Jr."},null,null,{"$f":"IF(D84=\"\",\"\",IF(D84=F84,\"△\",IF(D84>F84,\"〇\",\"×\")))","v":"〇"},{"$nulls":4},{"$f":"CONCATENATE($A83,K78)","v":"G2G3"},{"$f":"IF(J84=\"\",\"\",IF(J84=L84,\"△\",IF(J84>L84,\"〇\",\"×\")))","v":"×"},{"$f":"CONCATENATE(K78,$A83)","v":"G3G2"},{"$f":"CONCATENATE($A83,N78)","v":"G2G4"},{"$f":"IF(M84=\"\",\"\",IF(M84=O84,\"△\",IF(M84>O84,\"〇\",\"×\")))","v":"〇"},{"$f":"CONCATENATE(N78,$A83)","v":"G4G2"},{"$nulls":9},{"$f":"COUNTIF($E83:$N83,\"〇\")","v":2},{"$f":"COUNTIF($E83:$N83,\"×\")","v":1},{"$f":"COUNTIF($E83:$N83,\"△\")","v":0},{"$f":"Y83*2+AA83","v":4},{"$f":"IF(D84=\"\",\"\",D84+G84+M84+J84)","v":16},{"$f":"IF(AC83=\"\",\"\",AB83*100+AC83)","v":416},{"$f":"IF(AC83=\"\",\"\",F84+I84+L84+O84)","v":16},{"$f":"IF(AD83=\"\",\"\",RANK(AD83,AD81:AD88,0))","v":2},null,{"$f":"CONCATENATE(A79,AF83)","v":"G2"},{"$f":"B83","v":"松任の大魔陣Jr."}]
[{"$nulls":3},{"$f":"IF(I82=\"\",\"\",I82)","v":6},"-",{"$f":"IF(G82=\"\",\"\",G82)","v":3},{"$nulls":3},{"$f":"VLOOKUP(J83,対戦表!$AG:$AH,2,0)","v":4},"-",{"$f":"VLOOKUP(L83,対戦表!$AG:$AH,2,0)","v":9},{"$f":"VLOOKUP(M83,対戦表!$AG:$AH,2,0)","v":6},"-",{"$f":"VLOOKUP(O83,対戦表!$AG:$AH,2,0)","v":4}]
[{"$f":"CONCATENATE(A79,3)","v":"G3"},{"$f":"VLOOKUP(A85,チーム表!C:D,2,FALSE)","v":"鵜川フェニックスジュニア"},null,null,{"$f":"IF(D86=\"\",\"\",IF(D86=F86,\"△\",IF(D86>F86,\"〇\",\"×\")))","v":"〇"},null,null,{"$f":"IF(G86=\"\",\"\",IF(G86=I86,\"△\",IF(G86>I86,\"〇\",\"×\")))","v":"〇"},{"$nulls":4},{"$f":"CONCATENATE($A85,N78)","v":"G3G4"},{"$f":"IF(M86=\"\",\"\",IF(M86=O86,\"△\",IF(M86>O86,\"〇\",\"×\")))","v":"〇"},{"$f":"CONCATENATE(N78,$A85)","v":"G4G3"},{"$nulls":9},{"$f":"COUNTIF($E85:$N85,\"〇\")","v":3},{"$f":"COUNTIF($E85:$N85,\"×\")","v":0},{"$f":"COUNTIF($E85:$N85,\"△\")","v":0},{"$f":"Y85*2+AA85","v":6},{"$f":"IF(G86=\"\",\"\",D86+G86+M86+J86)","v":26},{"$f":"IF(AC85=\"\",\"\",AB85*100+AC85)","v":626},{"$f":"IF(AC85=\"\",\"\",F86+I86+L86+O86)","v":6},{"$f":"IF(AD85=\"\",\"\",RANK(AD85,AD81:AD88,0))","v":1},null,{"$f":"CONCATENATE(A79,AF85)","v":"G1"},{"$f":"B85","v":"鵜川フェニックスジュニア"}]
[{"$nulls":3},{"$f":"IF(L82=\"\",\"\",L82)","v":8},"-",{"$f":"IF(J82=\"\",\"\",J82)","v":0},{"$f":"IF(L84=\"\",\"\",L84)","v":9},"-",{"$f":"IF(J84=\"\",\"\",J84)","v":4},{"$nulls":3},{"$f":"VLOOKUP(M85,対戦表!$AG:$AH,2,0)","v":9},"-",{"$f":"VLOOKUP(O85,対戦表!$AG:$AH,2,0)","v":2}]
[{"$f":"CONCATENATE(A79,4)","v":"G4"},{"$f":"VLOOKUP(A87,チーム表!C:D,2,FALSE)","v":"大門ドッジボールクラブJr"},null,null,{"$f":"IF(D88=\"\",\"\",IF(D88=F88,\"△\",IF(D88>F88,\"〇\",\"×\")))","v":"〇"},null,null,{"$f":"IF(G88=\"\",\"\",IF(G88=I88,\"△\",IF(G88>I88,\"〇\",\"×\")))","v":"×"},null,null,{"$f":"IF(J88=\"\",\"\",IF(J88=L88,\"△\",IF(J88>L88,\"〇\",\"×\")))","v":"×"},{"$nulls":13},{"$f":"COUNTIF($E87:$N87,\"〇\")","v":1},{"$f":"COUNTIF($E87:$N87,\"×\")","v":2},{"$f":"COUNTIF($E87:$N87,\"△\")","v":0},{"$f":"Y87*2+AA87","v":2},{"$f":"IF(G88=\"\",\"\",D88+G88+M88+J88)","v":10},{"$f":"IF(AC87=\"\",\"\",AB87*100+AC87)","v":210},{"$f":"IF(AC87=\"\",\"\",F88+I88+L88+O88)","v":18},{"$f":"IF(AD87=\"\",\"\",RANK(AD87,AD81:AD88,0))","v":3},null,{"$f":"CONCATENATE(A79,AF87)","v":"G3"},{"$f":"B87","v":"大門ドッジボールクラブJr"}]
[{"$nulls":3},{"$f":"IF(O82=\"\",\"\",O82)","v":4},"-",{"$f":"IF(M82=\"\",\"\",M82)","v":3},{"$f":"IF(O84=\"\",\"\",O84)","v":4},"-",{"$f":"IF(M84=\"\",\"\",M84)","v":6},{"$f":"IF(O86=\"\",\"\",O86)","v":2},"-",{"$f":"IF(M86=\"\",\"\",M86)","v":9}]
[]
[{"$nulls":4},{"$f":"CONCATENATE(A91,\"1\")","v":"H1"},null,null,{"$f":"CONCATENATE(A91,\"2\")","v":"H2"},null,null,{"$f":"CONCATENATE(A91,\"3\")","v":"H3"},null,null,{"$f":"CONCATENATE(A91,\"4\")","v":"H4"}]
["H","チーム名",null,{"$f":"B93","v":"呉羽DBCジュニア"},null,null,{"$f":"B95","v":"NISHI　Jrスターズ"},null,null,{"$f":"B97","v":"寺井クラブＪｒ　B"},null,null,{"$f":"B99","v":"田上闘球FUTURES"},{"$nulls":11},"勝","負","分","点","内野","順位決定点","相手内野","順位","kaku"]
[]
[{"$f":"CONCATENATE(A91,1)","v":"H1"},{"$f":"VLOOKUP(A93,チーム表!C:D,2,FALSE)","v":"呉羽DBCジュニア"},{"$nulls":4},{"$f":"CONCATENATE($A93,H90)","v":"H1H2"},{"$f":"IF(G94=\"\",\"\",IF(G94=I94,\"△\",IF(G94>I94,\"〇\",\"×\")))","v":"〇"},{"$f":"CONCATENATE(H90,$A93)","v":"H2H1"},{"$f":"CONCATENATE($A93,K90)","v":"H1H3"},{"$f":"IF(J94=\"\",\"\",IF(J94=L94,\"△\",IF(J94>L94,\"〇\",\"×\")))","v":"〇"},{"$f":"CONCATENATE(K90,$A93)","v":"H3H1"},{"$f":"CONCATENATE($A93,N90)","v":"H1H4"},{"$f":"IF(M94=\"\",\"\",IF(M94=O94,\"△\",IF(M94>O94,\"〇\",\"×\")))","v":"×"},{"$f":"CONCATENATE(N90,$A93)","v":"H4H1"},{"$nulls":9},{"$f":"COUNTIF($E93:$N93,\"〇\")","v":2},{"$f":"COUNTIF($E93:$N93,\"×\")","v":1},{"$f":"COUNTIF($E93:$N93,\"△\")","v":0},{"$f":"Y93*2+AA93","v":4},{"$f":"IF(G94=\"\",\"\",D94+G94+M94+J94)","v":11},{"$f":"IF(AC93=\"\",\"\",AB93*100+AC93)","v":411},{"$f":"IF(AC93=\"\",\"\",F94+I94+L94+O94)","v":12},{"$f":"IF(AD93=\"\",\"\",RANK(AD93,AD93:AD100,0))","v":2},null,{"$f":"CONCATENATE(A91,AF93)","v":"H2"},{"$f":"B93","v":"呉羽DBCジュニア"}]
[{"$nulls":6},{"$f":"VLOOKUP(G93,対戦表!$AG:$AH,2,0)","v":3},"-",{"$f":"VLOOKUP(I93,対戦表!$AG:$AH,2,0)","v":1},{"$f":"VLOOKUP(J93,対戦表!$AG:$AH,2,0)","v":6},"-",{"$f":"VLOOKUP(L93,対戦表!$AG:$AH,2,0)","v":3},{"$f":"VLOOKUP(M93,対戦表!$AG:$AH,2,0)","v":2},"-",{"$f":"VLOOKUP(O93,対戦表!$AG:$AH,2,0)","v":8}]
[{"$f":"CONCATENATE(A91,2)","v":"H2"},{"$f":"VLOOKUP(A95,チーム表!C:D,2,FALSE)","v":"NISHI　Jrスターズ"},null,null,{"$f":"IF(D96=\"\",\"\",IF(D96=F96,\"△\",IF(D96>F96,\"〇\",\"×\")))","v":"×"},{"$nulls":4},{"$f":"CONCATENATE($A95,K90)","v":"H2H3"},{"$f":"IF(J96=\"\",\"\",IF(J96=L96,\"△\",IF(J96>L96,\"〇\",\"×\")))","v":"×"},{"$f":"CONCATENATE(K90,$A95)","v":"H3H2"},{"$f":"CONCATENATE($A95,N90)","v":"H2H4"},{"$f":"IF(M96=\"\",\"\",IF(M96=O96,\"△\",IF(M96>O96,\"〇\",\"×\")))","v":"×"},{"$f":"CONCATENATE(N90,$A95)","v":"H4H2"},{"$nulls":9},{"$f":"COUNTIF($E95:$N95,\"〇\")","v":0},{"$f":"COUNTIF($E95:$N95,\"×\")","v":3},{"$f":"COUNTIF($E95:$N95,\"△\")","v":0},{"$f":"Y95*2+AA95","v":0},{"$f":"IF(D96=\"\",\"\",D96+G96+M96+J96)","v":5},{"$f":"IF(AC95=\"\",\"\",AB95*100+AC95)","v":5},{"$f":"IF(AC95=\"\",\"\",F96+I96+L96+O96)","v":10},{"$f":"IF(AD95=\"\",\"\",RANK(AD95,AD93:AD100,0))","v":4},null,{"$f":"CONCATENATE(A91,AF95)","v":"H4"},{"$f":"B95","v":"NISHI　Jrスターズ"}]
[{"$nulls":3},{"$f":"IF(I94=\"\",\"\",I94)","v":1},"-",{"$f":"IF(G94=\"\",\"\",G94)","v":3},{"$nulls":3},{"$f":"VLOOKUP(J95,対戦表!$AG:$AH,2,0)","v":2},"-",{"$f":"VLOOKUP(L95,対戦表!$AG:$AH,2,0)","v":3},{"$f":"VLOOKUP(M95,対戦表!$AG:$AH,2,0)","v":2},"-",{"$f":"VLOOKUP(O95,対戦表!$AG:$AH,2,0)","v":4}]
[{"$f":"CONCATENATE(A91,3)","v":"H3"},{"$f":"VLOOKUP(A97,チーム表!C:D,2,FALSE)","v":"寺井クラブＪｒ　B"},null,null,{"$f":"IF(D98=\"\",\"\",IF(D98=F98,\"△\",IF(D98>F98,\"〇\",\"×\")))","v":"×"},null,null,{"$f":"IF(G98=\"\",\"\",IF(G98=I98,\"△\",IF(G98>I98,\"〇\",\"×\")))","v":"〇"},{"$nulls":4},{"$f":"CONCATENATE($A97,N90)","v":"H3H4"},{"$f":"IF(M98=\"\",\"\",IF(M98=O98,\"△\",IF(M98>O98,\"〇\",\"×\")))","v":"×"},{"$f":"CONCATENATE(N90,$A97)","v":"H4H3"},{"$nulls":9},{"$f":"COUNTIF($E97:$N97,\"〇\")","v":1},{"$f":"COUNTIF($E97:$N97,\"×\")","v":2},{"$f":"COUNTIF($E97:$N97,\"△\")","v":0},{"$f":"Y97*2+AA97","v":2},{"$f":"IF(G98=\"\",\"\",D98+G98+M98+J98)","v":8},{"$f":"IF(AC97=\"\",\"\",AB97*100+AC97)","v":208},{"$f":"IF(AC97=\"\",\"\",F98+I98+L98+O98)","v":16},{"$f":"IF(AD97=\"\",\"\",RANK(AD97,AD93:AD100,0))","v":3},null,{"$f":"CONCATENATE(A91,AF97)","v":"H3"},{"$f":"B97","v":"寺井クラブＪｒ　B"}]
[{"$nulls":3},{"$f":"IF(L94=\"\",\"\",L94)","v":3},"-",{"$f":"IF(J94=\"\",\"\",J94)","v":6},{"$f":"IF(L96=\"\",\"\",L96)","v":3},"-",{"$f":"IF(J96=\"\",\"\",J96)","v":2},{"$nulls":3},{"$f":"VLOOKUP(M97,対戦表!$AG:$AH,2,0)","v":2},"-",{"$f":"VLOOKUP(O97,対戦表!$AG:$AH,2,0)","v":8}]
[{"$f":"CONCATENATE(A91,4)","v":"H4"},{"$f":"VLOOKUP(A99,チーム表!C:D,2,FALSE)","v":"田上闘球FUTURES"},null,null,{"$f":"IF(D100=\"\",\"\",IF(D100=F100,\"△\",IF(D100>F100,\"〇\",\"×\")))","v":"〇"},null,null,{"$f":"IF(G100=\"\",\"\",IF(G100=I100,\"△\",IF(G100>I100,\"〇\",\"×\")))","v":"〇"},null,null,{"$f":"IF(J100=\"\",\"\",IF(J100=L100,\"△\",IF(J100>L100,\"〇\",\"×\")))","v":"〇"},{"$nulls":13},{"$f":"COUNTIF($E99:$N99,\"〇\")","v":3},{"$f":"COUNTIF($E99:$N99,\"×\")","v":0},{"$f":"COUNTIF($E99:$N99,\"△\")","v":0},{"$f":"Y99*2+AA99","v":6},{"$f":"IF(G100=\"\",\"\",D100+G100+M100+J100)","v":20},{"$f":"IF(AC99=\"\",\"\",AB99*100+AC99)","v":620},{"$f":"IF(AC99=\"\",\"\",F100+I100+L100+O100)","v":6},{"$f":"IF(AD99=\"\",\"\",RANK(AD99,AD93:AD100,0))","v":1},null,{"$f":"CONCATENATE(A91,AF99)","v":"H1"},{"$f":"B99","v":"田上闘球FUTURES"}]
[{"$nulls":3},{"$f":"IF(O94=\"\",\"\",O94)","v":8},"-",{"$f":"IF(M94=\"\",\"\",M94)","v":2},{"$f":"IF(O96=\"\",\"\",O96)","v":4},"-",{"$f":"IF(M96=\"\",\"\",M96)","v":2},{"$f":"IF(O98=\"\",\"\",O98)","v":8},"-",{"$f":"IF(M98=\"\",\"\",M98)","v":2}]

{"sheet":"トーナメント表","index":3,"n_rows":124,"n_cols":41,"rows_kept":124,"merged":[[4,0,5,0],[4,1,5,8],[8,0,9,0],[8,1,9,8],[12,0,13,0],[12,1,13,8],[15,20,16,21],[16,0,17,0],[16,1,17,8],[17,21,18,28],[20,0,21,0],[20,1,21,8],[24,0,25,0],[24,1,25,8],[28,0,29,0],[28,1,29,8],[32,0,33,0],[32,1,33,8],[36,9,37,14],[38,21,39,28],[40,9,41,14],[47,0,48,0],[47,1,48,8],[51,0,52,0],[51,1,52,8],[55,0,56,0],[55,1,56,8],[59,0,60,0],[59,1,60,8],[60,22,61,24],[63,0,64,0],[63,1,64,8],[63,22,64,29],[67,0,68,0],[67,1,68,8],[71,0,72,0],[71,1,72,8],[75,0,76,0],[75,1,76,8],[79,0,80,0],[79,1,80,8],[86,0,87,0],[86,1,87,8],[90,0,91,0],[90,1,91,8],[94,0,95,0],[94,1,95,8],[98,0,99,0],[98,1,99,8],[99,21,100,28],[102,0,103,0],[102,1,103,8],[106,0,107,0],[106,1,107,8],[110,0,111,0],[110,1,111,8],[114,0,115,0],[114,1,115,8],[118,9,119,14],[120,21,121,28],[122,9,123,14]]}
[null,"レギュラーの部",{"$nulls":5},"決勝トーナメント"]
[]
[]
[null,"A1",{"$nulls":19},"優勝","松任の大魔陣"]
["Ａ1位",{"$f":"VLOOKUP(B4,リーグ戦表!AH:AI,2,0)","v":"針原パイレーツ"},{"$nulls":7},8]
[{"$nulls":21},"準優勝","千坂ドッジファイヤーズ",{"$nulls":16},"A1",{"$f":"VLOOKUP(AN6,リーグ戦表!AH:AI,2,0)","v":"針原パイレーツ"}]
[{"$nulls":10},"A⑦",{"$nulls":3},6,{"$nulls":24},"A2",{"$f":"VLOOKUP(AN7,リーグ戦表!AH:AI,2,0)","v":"小木クラブ"}]
[null,"D2",{"$nulls":19},"３位","針原パイレーツ",{"$nulls":16},"B1",{"$f":"VLOOKUP(AN8,リーグ戦表!AH:AI,2,0)","v":"松任の大魔陣"}]
["D２位",{"$f":"VLOOKUP(B8,リーグ戦表!AH:AI,2,0)","v":"寺井クラブ"},{"$nulls":37},"B2",{"$f":"VLOOKUP(AN9,リーグ戦表!AH:AI,2,0)","v":"千坂ドッジファイヤーズ"}]
[{"$nulls":9},7,{"$nulls":29},"C1",{"$f":"VLOOKUP(AN10,リーグ戦表!AH:AI,2,0)","v":"向本折クラブA"}]
[{"$nulls":13},"A⑫",null,null,5,8,{"$nulls":21},"C2",{"$f":"VLOOKUP(AN11,リーグ戦表!AH:AI,2,0)","v":"鵜川ミラクルフェニックス"}]
[null,"B2",{"$nulls":37},"D1",{"$f":"VLOOKUP(AN12,リーグ戦表!AH:AI,2,0)","v":"田上闘球DREAMS"}]
["B２位",{"$f":"VLOOKUP(B12,リーグ戦表!AH:AI,2,0)","v":"千坂ドッジファイヤーズ"},{"$nulls":7},10,{"$nulls":29},"D2",{"$f":"VLOOKUP(AN13,リーグ戦表!AH:AI,2,0)","v":"寺井クラブ"}]
[]
[{"$nulls":10},"A⑧"]
[null,"C1",{"$nulls":12},9,{"$nulls":5},"優　勝"]
["C１位",{"$f":"VLOOKUP(B16,リーグ戦表!AH:AI,2,0)","v":"向本折クラブA"}]
[{"$nulls":9},4,{"$nulls":6},"A⑬",{"$nulls":4},"松任の大魔陣"]
[]
[null,"D1"]
["D１位",{"$f":"VLOOKUP(B20,リーグ戦表!AH:AI,2,0)","v":"田上闘球DREAMS"},{"$nulls":7},8]
[]
[{"$nulls":10},"B⑦",{"$nulls":3},8]
[null,"A2"]
["A２位",{"$f":"VLOOKUP(B24,リーグ戦表!AH:AI,2,0)","v":"小木クラブ"}]
[{"$nulls":9},10]
[{"$nulls":13},"B⑫"]
[null,"C2",{"$nulls":14},10,9]
["C２位",{"$f":"VLOOKUP(B28,リーグ戦表!AH:AI,2,0)","v":"鵜川ミラクルフェニックス"},{"$nulls":7},8,7]
[]
[{"$nulls":10},"B⑧"]
[null,"B1",{"$nulls":12},9]
["Ｂ1位",{"$f":"VLOOKUP(B32,リーグ戦表!AH:AI,2,0)","v":"松任の大魔陣"}]
[{"$nulls":9},8,8]
[]
[]
[{"$nulls":9},"針原パイレーツ",{"$nulls":5},9,{"$nulls":5},"３位"]
[]
[{"$nulls":16},"B⑬",{"$nulls":4},"針原パイレーツ"]
[]
[{"$nulls":9},"小木クラブ"]
[{"$nulls":15},4]
[]
[]
[null,null,"交流トーナメント"]
[]
[null,"A3"]
["A３位",{"$f":"VLOOKUP(B47,リーグ戦表!AH:AI,2,0)","v":"NISHIファイヤースターズ"},{"$nulls":7},10]
[{"$nulls":39},"A1",{"$f":"VLOOKUP(AN49,リーグ戦表!AH:AI,2,0)","v":"針原パイレーツ"}]
[{"$nulls":12},"A④",{"$nulls":3},10,{"$nulls":4},"敢闘賞","呉羽ドッジボールクラブ",{"$nulls":16},"A2",{"$f":"VLOOKUP(AN50,リーグ戦表!AH:AI,2,0)","v":"小木クラブ"}]
[null,"D4",{"$nulls":37},"B1",{"$f":"VLOOKUP(AN51,リーグ戦表!AH:AI,2,0)","v":"松任の大魔陣"}]
["D４位",{"$f":"VLOOKUP(B51,リーグ戦表!AH:AI,2,0)","v":"大門ドッジボールクラブ"},{"$nulls":37},"B2",{"$f":"VLOOKUP(AN52,リーグ戦表!AH:AI,2,0)","v":"千坂ドッジファイヤーズ"}]
[{"$nulls":9},5,{"$nulls":29},"C1",{"$f":"VLOOKUP(AN53,リーグ戦表!AH:AI,2,0)","v":"向本折クラブA"}]
[{"$nulls":39},"C2",{"$f":"VLOOKUP(AN54,リーグ戦表!AH:AI,2,0)","v":"鵜川ミラクルフェニックス"}]
[null,"C3",{"$nulls":13},"A⑨",{"$nulls":3},5,{"$nulls":19},"D1",{"$f":"VLOOKUP(AN55,リーグ戦表!AH:AI,2,0)","v":"田上闘球DREAMS"}]
["C3位",{"$f":"VLOOKUP(B55,リーグ戦表!AH:AI,2,0)","v":"光陽マーリンズ"},{"$nulls":11},5,{"$nulls":25},"D2",{"$f":"VLOOKUP(AN56,リーグ戦表!AH:AI,2,0)","v":"寺井クラブ"}]
[]
[]
[null,"B4",{"$nulls":10},"A⑤"]
["B4位",{"$f":"VLOOKUP(B59,リーグ戦表!AH:AI,2,0)","v":"鳳至ドッジボールクラブ"},{"$nulls":7},10,{"$nulls":6},4]
[{"$nulls":22},"敢闘賞"]
[{"$nulls":9},"A③"]
[null,"D5",{"$nulls":11},7]
["D５位",{"$f":"VLOOKUP(B63,リーグ戦表!AH:AI,2,0)","v":"三馬パワフル"},{"$nulls":16},"B⑪",{"$nulls":3},"呉羽ドッジボールクラブ"]
[{"$nulls":9},3]
[]
[null,"D3"]
["D３位",{"$f":"VLOOKUP(B67,リーグ戦表!AH:AI,2,0)","v":"飯野マジックス"},{"$nulls":7},8]
[]
[{"$nulls":12},"B④",{"$nulls":3},8]
[null,"A4"]
["A４位",{"$f":"VLOOKUP(B71,リーグ戦表!AH:AI,2,0)","v":"鞍月アタッカーズ"}]
[{"$nulls":9},9]
[{"$nulls":15},"B⑨"]
[null,"C4",{"$nulls":17},9]
["C４位",{"$f":"VLOOKUP(B75,リーグ戦表!AH:AI,2,0)","v":"中郷ドッジボールクラブ"},{"$nulls":7},1]
[]
[{"$nulls":12},"B⑤"]
[null,"B3",{"$nulls":14},9]
["B３位",{"$f":"VLOOKUP(B79,リーグ戦表!AH:AI,2,0)","v":"呉羽ドッジボールクラブ"}]
[{"$nulls":9},9]
[]
[]
[]
[null,null,"ジュニアの部　決勝トーナメント"]
[null,"E1",{"$nulls":19},"優勝","鵜川フェニックスジュニア"]
["E１位",{"$f":"VLOOKUP(B86,リーグ戦表!AH:AI,2,0)","v":"鞍月アタッカーズジュニア"},{"$nulls":7},7]
[{"$nulls":21},"準優勝","松任の大魔陣Jr.",{"$nulls":16},"A1",{"$f":"VLOOKUP(AN88,リーグ戦表!AH:AI,2,0)","v":"針原パイレーツ"}]
[{"$nulls":10},"A①",null,null,6,5,{"$nulls":24},"A2",{"$f":"VLOOKUP(AN89,リーグ戦表!AH:AI,2,0)","v":"小木クラブ"}]
[null,"H2",{"$nulls":19},"３位","鞍月アタッカーズジュニア",{"$nulls":16},"B1",{"$f":"VLOOKUP(AN90,リーグ戦表!AH:AI,2,0)","v":"松任の大魔陣"}]
["H２位",{"$f":"VLOOKUP(B90,リーグ戦表!AH:AI,2,0)","v":"呉羽DBCジュニア"},{"$nulls":37},"B2",{"$f":"VLOOKUP(AN91,リーグ戦表!AH:AI,2,0)","v":"千坂ドッジファイヤーズ"}]
[{"$nulls":9},0,{"$nulls":29},"C1",{"$f":"VLOOKUP(AN92,リーグ戦表!AH:AI,2,0)","v":"向本折クラブA"}]
[{"$nulls":13},"A⑥",{"$nulls":3},9,{"$nulls":21},"C2",{"$f":"VLOOKUP(AN93,リーグ戦表!AH:AI,2,0)","v":"鵜川ミラクルフェニックス"}]
[null,"F2",{"$nulls":37},"D1",{"$f":"VLOOKUP(AN94,リーグ戦表!AH:AI,2,0)","v":"田上闘球DREAMS"}]
["F２位",{"$f":"VLOOKUP(B94,リーグ戦表!AH:AI,2,0)","v":"向本折クラブNew"},{"$nulls":7},0,{"$nulls":29},"D2",{"$f":"VLOOKUP(AN95,リーグ戦表!AH:AI,2,0)","v":"寺井クラブ"}]
[]
[{"$nulls":10},"A②"]
[null,"G1",{"$nulls":11},6,6,{"$nulls":6},"優　勝"]
["G１位",{"$f":"VLOOKUP(B98,リーグ戦表!AH:AI,2,0)","v":"鵜川フェニックスジュニア"}]
[{"$nulls":9},9,{"$nulls":6},"B⑩",{"$nulls":4},"鵜川フェニックスジュニア"]
[]
[null,"H1"]
["H１位",{"$f":"VLOOKUP(B102,リーグ戦表!AH:AI,2,0)","v":"田上闘球FUTURES"},{"$nulls":7},5]
[]
[{"$nulls":10},"B①",{"$nulls":3},4]
[null,"E2"]
["E２位",{"$f":"VLOOKUP(B106,リーグ戦表!AH:AI,2,0)","v":"鳳至ジュニア"}]
[{"$nulls":9},1]
[{"$nulls":13},"B⑥"]
[null,"G2",{"$nulls":15},3]
["G２位",{"$f":"VLOOKUP(B110,リーグ戦表!AH:AI,2,0)","v":"松任の大魔陣Jr."},{"$nulls":7},7]
[]
[{"$nulls":10},"B②"]
[null,"F1",{"$nulls":12},5]
["F１位",{"$f":"VLOOKUP(B114,リーグ戦表!AH:AI,2,0)","v":"九十九クラブ"}]
[{"$nulls":9},4]
[]
[]
[{"$nulls":9},"鞍月アタッカーズジュニア",{"$nulls":5},6,{"$nulls":5},"３　位"]
[]
[{"$nulls":16},"A⑩",{"$nulls":4},"鞍月アタッカーズジュニア"]
[]
[{"$nulls":9},"田上闘球FUTURES"]
[{"$nulls":15},1]

{"sheet":"優秀選手","index":4,"n_rows":45,"n_cols":8,"rows_kept":45,"merged":[[0,1,0,7],[1,1,1,5]]}
[null,"第２０回　加賀地域少年少女ドッジボール大会優秀選手"]
[]
[null,"番号","ﾌﾞﾛｯｸ","チ　ー　ム　名","氏名","ふりがな","学年","性別"]
[null,{"$f":"チーム表!B4","v":1},{"$f":"チーム表!C4","v":"A1"},{"$f":"チーム表!D4","v":"鞍月アタッカーズ"}]
[null,{"$f":"チーム表!B5","v":2},{"$f":"チーム表!C5","v":"A2"},{"$f":"チーム表!D5","v":"針原パイレーツ"},"深井　良映","ふかいりょうえい",6,"女"]
[null,{"$f":"チーム表!B6","v":3},{"$f":"チーム表!C6","v":"A3"},{"$f":"チーム表!D6","v":"小木クラブ"},"谷口　拓矢","たにぐち　たくや",4,"男"]
[null,{"$f":"チーム表!B7","v":4},{"$f":"チーム表!C7","v":"A4"},{"$f":"チーム表!D7","v":"NISHIファイヤースターズ"}]
[null,{"$f":"チーム表!B8","v":5},{"$f":"チーム表!C8","v":"B1"},{"$f":"チーム表!D8","v":"呉羽ドッジボールクラブ"}]
[null,{"$f":"チーム表!B9","v":6},{"$f":"チーム表!C9","v":"B2"},{"$f":"チーム表!D9","v":"鳳至ドッジボールクラブ"}]
[null,{"$f":"チーム表!B10","v":7},{"$f":"チーム表!C10","v":"B3"},{"$f":"チーム表!D10","v":"千坂ドッジファイヤーズ"},"森田　陸斗","もりた　りくと",6,"男"]
[null,{"$f":"チーム表!B11","v":8},{"$f":"チーム表!C11","v":"B4"},{"$f":"チーム表!D11","v":"松任の大魔陣"},"佐藤　圭太","さとう　けいた",5,"男"]
[null,{"$f":"チーム表!B12","v":9},{"$f":"チーム表!C12","v":"C1"},{"$f":"チーム表!D12","v":"光陽マーリンズ"}]
[null,{"$f":"チーム表!B13","v":10},{"$f":"チーム表!C13","v":"C2"},{"$f":"チーム表!D13","v":"中郷ドッジボールクラブ"}]
[null,{"$f":"チーム表!B14","v":11},{"$f":"チーム表!C14","v":"C3"},{"$f":"チーム表!D14","v":"鵜川ミラクルフェニックス"}]
[null,{"$f":"チーム表!B15","v":12},{"$f":"チーム表!C15","v":"C4"},{"$f":"チーム表!D15","v":"向本折クラブA"}]
[null,{"$f":"チーム表!B16","v":13},{"$f":"チーム表!C16","v":"D1"},{"$f":"チーム表!D16","v":"飯野マジックス"}]
[null,{"$f":"チーム表!B17","v":14},{"$f":"チーム表!C17","v":"D2"},{"$f":"チーム表!D17","v":"三馬パワフル"}]
[null,{"$f":"チーム表!B18","v":15},{"$f":"チーム表!C18","v":"D3"},{"$f":"チーム表!D18","v":"寺井クラブ"}]
[null,{"$f":"チーム表!B19","v":16},{"$f":"チーム表!C19","v":"D4"},{"$f":"チーム表!D19","v":"大門ドッジボールクラブ"}]
[null,{"$f":"チーム表!B20","v":17},{"$f":"チーム表!C20","v":"D5"},{"$f":"チーム表!D20","v":"田上闘球DREAMS"}]
[null,{"$f":"チーム表!B21","v":"Jr1"},{"$f":"チーム表!C21","v":"E1"},{"$f":"チーム表!D21","v":"鞍月アタッカーズジュニア"},"竹松　蓮介","たけまつれんすけ",2,"男"]
[null,{"$f":"チーム表!B22","v":"Jr2"},{"$f":"チーム表!C22","v":"E2"},{"$f":"チーム表!D22","v":"鳳至ジュニア"}]
[null,{"$f":"チーム表!B23","v":"Jr3"},{"$f":"チーム表!C23","v":"E3"},{"$f":"チーム表!D23","v":"中郷ミラクルジュニア"}]
[null,{"$f":"チーム表!B24","v":"Jr4"},{"$f":"チーム表!C24","v":"E4"},{"$f":"チーム表!D24","v":"ドッジの王子様"}]
[null,{"$f":"チーム表!B25","v":"Jr5"},{"$f":"チーム表!C25","v":"F1"},{"$f":"チーム表!D25","v":"九十九クラブ"}]
[null,{"$f":"チーム表!B26","v":"Jr6"},{"$f":"チーム表!C26","v":"F2"},{"$f":"チーム表!D26","v":"千坂ロータスルート"}]
[null,{"$f":"チーム表!B27","v":"Jr7"},{"$f":"チーム表!C27","v":"F3"},{"$f":"チーム表!D27","v":"向本折クラブNew"}]
[null,{"$f":"チーム表!B28","v":"Jr8"},{"$f":"チーム表!C28","v":"F4"},{"$f":"チーム表!D28","v":"寺井クラブＪｒ　A"}]
[null,{"$f":"チーム表!B29","v":"Jr9"},{"$f":"チーム表!C29","v":"G1"},{"$f":"チーム表!D29","v":"鞍月アタッカーズキッズ"}]
[null,{"$f":"チーム表!B30","v":"Jr10"},{"$f":"チーム表!C30","v":"G2"},{"$f":"チーム表!D30","v":"松任の大魔陣Jr."},"類家　楓","るいけ　かえで",3,"男"]
[null,{"$f":"チーム表!B31","v":"Jr11"},{"$f":"チーム表!C31","v":"G3"},{"$f":"チーム表!D31","v":"鵜川フェニックスジュニア"},"崎山　伊吹","さきやま　いぶき",4,"男"]
[null,{"$f":"チーム表!B32","v":"Jr12"},{"$f":"チーム表!C32","v":"G4"},{"$f":"チーム表!D32","v":"大門ドッジボールクラブJr"}]
[null,{"$f":"チーム表!B33","v":"Jr13"},{"$f":"チーム表!C33","v":"H1"},{"$f":"チーム表!D33","v":"呉羽DBCジュニア"}]
[null,{"$f":"チーム表!B34","v":"Jr14"},{"$f":"チーム表!C34","v":"H2"},{"$f":"チーム表!D34","v":"NISHI　Jrスターズ"}]
[null,{"$f":"チーム表!B35","v":"Jr15"},{"$f":"チーム表!C35","v":"H3"},{"$f":"チーム表!D35","v":"寺井クラブＪｒ　B"}]
[null,{"$f":"チーム表!B36","v":"Jr16"},{"$f":"チーム表!C36","v":"H4"},{"$f":"チーム表!D36","v":"田上闘球FUTURES"},"関野　伽音","せきの　かおん",4,"男"]
[null,"一5","G5","魔陣一家",null,"由水　伸弥"]
[null,"女１","H1","鞍月マミーズ",null,"廣岡　俊和"]
[null,"女２","H2","NISHIヤングスターズ",null,"足滝　信雄"]
[null,"女３","H3","山中Oba",null,"中田　勝博"]
[null,"女４","H4","田上闘球HAPPYS",null,"盛一　純平"]
[null,"女５","I1","チーム新米ママ",null,"山田　ユカ子"]
[null,"女６","I2","千坂Ｍファイヤーズ",null,"下野　高広"]
[null,"女７","I3","寺井Ｐ．P♪",null,"山田　幸嗣"]
[null,"女８","I4","魔舞陣",null,"由水　伸弥"]

{"sheet":"DATA1","index":5,"n_rows":365,"n_cols":25,"rows_kept":365,"merged":[[3,0,4,0],[3,1,4,9],[7,0,8,0],[7,1,8,9],[11,0,12,0],[11,1,12,9],[15,0,16,0],[15,1,16,9],[19,0,20,0],[19,1,20,9],[23,0,24,0],[23,1,24,9],[27,0,28,0],[27,1,28,9],[31,0,32,0],[31,1,32,9],[35,0,36,0],[35,1,36,9],[39,0,40,0],[39,1,40,9],[43,0,44,0],[43,1,44,9],[47,0,48,0],[47,1,48,9],[51,0,52,0],[51,1,52,9],[55,0,56,0],[55,1,56,9],[59,0,60,0],[59,1,60,9],[63,0,64,0],[63,1,64,9],[71,0,72,0],[71,1,72,9],[77,0,78,0],[77,1,78,9],[81,0,82,0],[81,1,82,9],[85,0,86,0],[85,1,86,9],[89,0,90,0],[89,1,90,9],[93,0,94,0],[93,1,94,9],[97,0,98,0],[97,1,98,9],[101,0,102,0],[101,1,102,9],[105,0,106,0],[105,1,106,9],[109,0,110,0],[109,1,110,9],[113,0,114,0],[113,1,114,9],[117,0,118,0],[117,1,118,9],[121,0,122,0],[121,1,122,9],[127,0,128,0],[127,1,128,9],[139,0,140,0],[139,1,140,9],[147,0,148,0],[147,1,148,9],[153,0,154,0],[153,1,154,9],[157,0,158,0],[157,1,158,9],[161,0,162,0],[161,1,162,9],[165,0,166,0],[165,1,166,9],[169,0,170,0],[169,1,170,9],[173,0,174,0],[173,1,174,9],[177,0,178,0],[177,1,178,9],[181,0,182,0],[181,1,182,9],[187,0,188,0],[187,1,188,9],[195,0,196,0],[195,1,196,9],[211,0,212,0],[211,1,212,9],[221,0,222,0],[221,1,222,9],[225,0,226,0],[225,1,226,9],[229,0,230,0],[229,1,230,9],[233,0,234,0],[233,1,234,9],[237,0,238,0],[237,1,238,9],[241,0,242,0],[241,1,242,9],[245,0,246,0],[245,1,246,9],[249,0,250,0],[249,1,250,9],[259,0,260,0],[259,1,260,9],[275,0,276,0],[275,1,276,9],[279,0,280,0],[279,1,280,9],[283,0,284,0],[283,1,284,9],[287,0,288,0],[287,1,288,9],[291,0,292,0],[291,1,292,9],[295,0,296,0],[295,1,296,9],[299,0,300,0],[299,1,300,9],[303,0,304,0],[303,1,304,9],[310,0,311,0],[310,1,311,9],[316,0,317,0],[316,1,317,9],[320,0,321,0],[320,1,321,9],[324,0,325,0],[324,1,325,9],[328,0,329,0],[328,1,329,9],[334,0,335,0],[334,1,335,9],[343,0,344,0],[343,1,344,9],[347,0,348,0],[347,1,348,9],[351,0,352,0],[351,1,352,9],[355,0,356,0],[355,1,356,9],[360,0,361,0],[360,1,361,9],[364,0,365,0],[364,1,365,9]]}
{"$rows_empty":69}
[null,"14チーム"]
[{"$nulls":20},"A1"]
[1,{"$nulls":19},"A2"]
[{"$nulls":20},"B1",{"$f":"VLOOKUP(U71,リーグ戦表!AH:AI,2,0)","v":"針原パイレーツ"}]
[{"$nulls":20},"B2",{"$f":"VLOOKUP(U72,リーグ戦表!AH:AI,2,0)","v":"小木クラブ"}]
[{"$nulls":20},"C1",{"$f":"VLOOKUP(U73,リーグ戦表!AH:AI,2,0)","v":"松任の大魔陣"}]
[{"$nulls":20},"C2",{"$f":"VLOOKUP(U74,リーグ戦表!AH:AI,2,0)","v":"千坂ドッジファイヤーズ"}]
[{"$nulls":20},"D1",{"$f":"VLOOKUP(U75,リーグ戦表!AH:AI,2,0)","v":"向本折クラブA"}]
[2,{"$nulls":19},"D2",{"$f":"VLOOKUP(U76,リーグ戦表!AH:AI,2,0)","v":"鵜川ミラクルフェニックス"}]
[{"$nulls":21},{"$f":"VLOOKUP(U77,リーグ戦表!AH:AI,2,0)","v":"田上闘球DREAMS"}]
[{"$nulls":21},{"$f":"VLOOKUP(U78,リーグ戦表!AH:AI,2,0)","v":"寺井クラブ"}]
[]
[3]
[]
[]
[]
[4]
[]
[]
[]
[5]
[]
[]
[]
[6]
[]
[]
[]
[7]
[{"$nulls":24},"優勝"]
[]
[]
[8]
[]
[]
[]
[9]
[]
[]
[]
[10]
[]
[]
[]
[11]
[]
[{"$nulls":20},"E1"]
[{"$nulls":20},"E2"]
[12,{"$nulls":19},"F1",{"$f":"VLOOKUP(U116,リーグ戦表!AH:AI,2,0)","v":"鞍月アタッカーズジュニア"}]
[{"$nulls":20},"F2",{"$f":"VLOOKUP(U117,リーグ戦表!AH:AI,2,0)","v":"鳳至ジュニア"}]
[{"$nulls":20},"G1",{"$f":"VLOOKUP(U118,リーグ戦表!AH:AI,2,0)","v":"九十九クラブ"}]
[{"$nulls":20},"G2",{"$f":"VLOOKUP(U119,リーグ戦表!AH:AI,2,0)","v":"向本折クラブNew"}]
[13,{"$nulls":20},{"$f":"VLOOKUP(U120,リーグ戦表!AH:AI,2,0)","v":"鵜川フェニックスジュニア"}]
[{"$nulls":21},{"$f":"VLOOKUP(U121,リーグ戦表!AH:AI,2,0)","v":"松任の大魔陣Jr."}]
[]
[]
[]
[]
[14]
{"$rows_empty":9}
[null,"12チーム"]
[{"$nulls":20},"A1"]
[1,{"$nulls":19},"A2"]
[{"$nulls":20},"B1",{"$f":"VLOOKUP(U139,リーグ戦表!AH:AI,2,0)","v":"針原パイレーツ"}]
[{"$nulls":20},"B2",{"$f":"VLOOKUP(U140,リーグ戦表!AH:AI,2,0)","v":"小木クラブ"}]
[{"$nulls":20},"C1",{"$f":"VLOOKUP(U141,リーグ戦表!AH:AI,2,0)","v":"松任の大魔陣"}]
[{"$nulls":20},"C2",{"$f":"VLOOKUP(U142,リーグ戦表!AH:AI,2,0)","v":"千坂ドッジファイヤーズ"}]
[{"$nulls":20},"D1",{"$f":"VLOOKUP(U143,リーグ戦表!AH:AI,2,0)","v":"向本折クラブA"}]
[{"$nulls":20},"D2",{"$f":"VLOOKUP(U144,リーグ戦表!AH:AI,2,0)","v":"鵜川ミラクルフェニックス"}]
[{"$nulls":21},{"$f":"VLOOKUP(U145,リーグ戦表!AH:AI,2,0)","v":"田上闘球DREAMS"}]
[2,{"$nulls":20},{"$f":"VLOOKUP(U146,リーグ戦表!AH:AI,2,0)","v":"寺井クラブ"}]
[]
[]
[]
[]
[]
[3]
[]
[]
[]
[4]
[]
[]
[]
[5]
[]
[]
[]
[6]
[{"$nulls":24},"優勝"]
[]
[]
[7]
[]
[]
[]
[8]
[]
[]
[]
[9]
[]
[]
[]
[10]
[]
[{"$nulls":20},"E1"]
[{"$nulls":20},"E2"]
[{"$nulls":20},"F1",{"$f":"VLOOKUP(U184,リーグ戦表!AH:AI,2,0)","v":"鞍月アタッカーズジュニア"}]
[{"$nulls":20},"F2",{"$f":"VLOOKUP(U185,リーグ戦表!AH:AI,2,0)","v":"鳳至ジュニア"}]
[11,{"$nulls":20},{"$f":"VLOOKUP(U186,リーグ戦表!AH:AI,2,0)","v":"九十九クラブ"}]
[{"$nulls":21},{"$f":"VLOOKUP(U187,リーグ戦表!AH:AI,2,0)","v":"向本折クラブNew"}]
[]
[]
[]
[]
[]
[]
[12]
{"$rows_empty":9}
[null,"10チーム"]
[]
[]
[]
[]
[{"$nulls":20},"A1"]
[1,{"$nulls":19},"A2"]
[{"$nulls":20},"B1",{"$f":"VLOOKUP(U211,リーグ戦表!AH:AI,2,0)","v":"針原パイレーツ"}]
[{"$nulls":20},"B2",{"$f":"VLOOKUP(U212,リーグ戦表!AH:AI,2,0)","v":"小木クラブ"}]
[{"$nulls":21},{"$f":"VLOOKUP(U213,リーグ戦表!AH:AI,2,0)","v":"松任の大魔陣"}]
[{"$nulls":21},{"$f":"VLOOKUP(U214,リーグ戦表!AH:AI,2,0)","v":"千坂ドッジファイヤーズ"}]
[]
[]
[]
[]
[]
[2]
[]
[]
[]
[3]
[]
[]
[]
[4]
[]
[]
[]
[5]
[{"$nulls":24},"優勝"]
[]
[]
[6]
[]
[]
[]
[7]
[]
[]
[]
[8]
[]
[]
[]
[9]
[]
[{"$nulls":20},"C1"]
[{"$nulls":20},"C2"]
[{"$nulls":20},"D1",{"$f":"VLOOKUP(U252,リーグ戦表!AH:AI,2,0)","v":"向本折クラブA"}]
[{"$nulls":20},"D2",{"$f":"VLOOKUP(U253,リーグ戦表!AH:AI,2,0)","v":"鵜川ミラクルフェニックス"}]
[{"$nulls":20},"E1",{"$f":"VLOOKUP(U254,リーグ戦表!AH:AI,2,0)","v":"田上闘球DREAMS"}]
[{"$nulls":20},"E2",{"$f":"VLOOKUP(U255,リーグ戦表!AH:AI,2,0)","v":"寺井クラブ"}]
[{"$nulls":21},{"$f":"VLOOKUP(U256,リーグ戦表!AH:AI,2,0)","v":"鞍月アタッカーズジュニア"}]
[{"$nulls":21},{"$f":"VLOOKUP(U257,リーグ戦表!AH:AI,2,0)","v":"鳳至ジュニア"}]
[10]
{"$rows_empty":13}
[null,"8チーム"]
[{"$nulls":20},"A1"]
[1,{"$nulls":19},"A2"]
[{"$nulls":20},"B1",{"$f":"VLOOKUP(U275,リーグ戦表!AH:AI,2,0)","v":"針原パイレーツ"}]
[{"$nulls":20},"B2",{"$f":"VLOOKUP(U276,リーグ戦表!AH:AI,2,0)","v":"小木クラブ"}]
[{"$nulls":20},"C1",{"$f":"VLOOKUP(U277,リーグ戦表!AH:AI,2,0)","v":"松任の大魔陣"}]
[2,{"$nulls":19},"C2",{"$f":"VLOOKUP(U278,リーグ戦表!AH:AI,2,0)","v":"千坂ドッジファイヤーズ"}]
[{"$nulls":20},"D1",{"$f":"VLOOKUP(U279,リーグ戦表!AH:AI,2,0)","v":"向本折クラブA"}]
[{"$nulls":20},"D2",{"$f":"VLOOKUP(U280,リーグ戦表!AH:AI,2,0)","v":"鵜川ミラクルフェニックス"}]
[{"$nulls":21},{"$f":"VLOOKUP(U281,リーグ戦表!AH:AI,2,0)","v":"田上闘球DREAMS"}]
[3,{"$nulls":20},{"$f":"VLOOKUP(U282,リーグ戦表!AH:AI,2,0)","v":"寺井クラブ"}]
[]
[]
[]
[4,{"$nulls":20},"優勝"]
[]
[]
[]
[5]
[]
[]
[]
[6]
[]
[]
[]
[7]
[]
[]
[]
[8]
[]
[]
[]
[]
[null,"6チーム"]
[{"$nulls":20},"A1"]
[1,{"$nulls":19},"A2"]
[{"$nulls":20},"B1",{"$f":"VLOOKUP(U310,リーグ戦表!AH:AI,2,0)","v":"針原パイレーツ"}]
[{"$nulls":20},"B2",{"$f":"VLOOKUP(U311,リーグ戦表!AH:AI,2,0)","v":"小木クラブ"}]
[{"$nulls":20},"C1",{"$f":"VLOOKUP(U312,リーグ戦表!AH:AI,2,0)","v":"松任の大魔陣"}]
[{"$nulls":20},"C2",{"$f":"VLOOKUP(U313,リーグ戦表!AH:AI,2,0)","v":"千坂ドッジファイヤーズ"}]
[{"$nulls":21},{"$f":"VLOOKUP(U314,リーグ戦表!AH:AI,2,0)","v":"向本折クラブA"}]
[2,{"$nulls":20},{"$f":"VLOOKUP(U315,リーグ戦表!AH:AI,2,0)","v":"鵜川ミラクルフェニックス"}]
[]
[]
[]
[3,{"$nulls":20},"優勝"]
[]
[]
[]
[4]
[]
[]
[]
[5]
[]
[]
[]
[]
[]
[6]
[]
[]
[]
[]
[]
[]
[null,"4チーム"]
[]
[1]
[]
[]
[]
[2,{"$nulls":17},"優勝"]
[]
[]
[]
[3]
[]
[]
[]
[4]
[]
[]
[null,"2チーム"]
[]
[1]
[{"$nulls":16},"優勝"]
[]
[]
[2]

{"sheet":"DATA","index":6,"n_rows":76,"n_cols":38,"rows_kept":76,"merged":[[4,0,5,0],[4,1,5,2],[4,3,5,5],[4,6,5,8],[4,9,5,11],[4,12,5,14],[4,15,5,17],[4,18,5,20],[4,21,5,23],[4,24,5,24],[4,25,5,25],[4,26,5,26],[4,27,5,27],[4,28,5,28],[4,29,5,29],[4,30,5,30],[4,31,5,31],[4,32,5,32],[6,0,7,0],[6,1,7,2],[6,3,7,5],[6,24,7,24],[6,25,7,25],[6,26,7,26],[6,27,7,27],[6,28,7,28],[6,29,7,29],[6,30,7,30],[6,31,7,31],[6,32,7,32],[8,0,9,0],[8,1,9,2],[8,6,9,8],[8,24,9,24],[8,25,9,25],[8,26,9,26],[8,27,9,27],[8,28,9,28],[8,29,9,29],[8,30,9,30],[8,31,9,31],[8,32,9,32],[10,0,11,0],[10,1,11,2],[10,9,11,11],[10,24,11,24],[10,25,11,25],[10,26,11,26],[10,27,11,27],[10,28,11,28],[10,29,11,29],[10,30,11,30],[10,31,11,31],[10,32,11,32],[12,0,13,0],[12,1,13,2],[12,12,13,14],[12,24,13,24],[12,25,13,25],[12,26,13,26],[12,27,13,27],[12,28,13,28],[12,29,13,29],[12,30,13,30],[12,31,13,31],[12,32,13,32],[14,0,15,0],[14,1,15,2],[14,15,15,17],[14,24,15,24],[14,25,15,25],[14,26,15,26],[14,27,15,27],[14,28,15,28],[14,29,15,29],[14,30,15,30],[14,31,15,31],[14,32,15,32],[16,0,17,0],[16,1,17,2],[16,18,17,20],[16,24,17,24],[16,25,17,25],[16,26,17,26],[16,27,17,27],[16,28,17,28],[16,29,17,29],[16,30,17,30],[16,31,17,31],[16,32,17,32],[18,0,19,0],[18,1,19,2],[18,21,19,23],[18,24,19,24],[18,25,19,25],[18,26,19,26],[18,27,19,27],[18,28,19,28],[18,29,19,29],[18,30,19,30],[18,31,19,31],[18,32,19,32],[23,0,24,0],[23,1,24,2],[23,3,24,5],[23,6,24,8],[23,9,24,11],[23,12,24,14],[23,15,24,17],[23,18,24,20],[23,21,24,23],[23,24,24,24],[23,25,24,25],[23,26,24,26],[23,27,24,27],[23,28,24,28],[23,29,24,29],[23,30,24,30],[23,31,24,31],[23,32,24,32],[25,0,26,0],[25,1,26,2],[25,3,26,5],[25,24,26,24],[25,25,26,25],[25,26,26,26],[25,27,26,27],[25,28,26,28],[25,29,26,29],[25,30,26,30],[25,31,26,31],[25,32,26,32],[27,0,28,0],[27,1,28,2],[27,6,28,8],[27,24,28,24],[27,25,28,25],[27,26,28,26],[27,27,28,27],[27,28,28,28],[27,29,28,29],[27,30,28,30],[27,31,28,31],[27,32,28,32],[29,0,30,0],[29,1,30,2],[29,9,30,11],[29,24,30,24],[29,25,30,25],[29,26,30,26],[29,27,30,27],[29,28,30,28],[29,29,30,29],[29,30,30,30],[29,31,30,31],[29,32,30,32],[31,0,32,0],[31,1,32,2],[31,12,32,14],[31,24,32,24],[31,25,32,25],[31,26,32,26],[31,27,32,27],[31,28,32,28],[31,29,32,29],[31,30,32,30],[31,31,32,31],[31,32,32,32],[33,0,34,0],[33,1,34,2],[33,15,34,17],[33,24,34,24],[33,25,34,25],[33,26,34,26],[33,27,34,27],[33,28,34,28],[33,29,34,29],[33,30,34,30],[33,31,34,31],[33,32,34,32],[35,0,36,0],[35,1,36,2],[35,18,36,20],[35,24,36,24],[35,25,36,25],[35,26,36,26],[35,27,36,27],[35,28,36,28],[35,29,36,29],[35,30,36,30],[35,31,36,31],[35,32,36,32],[40,0,41,0],[40,1,41,2],[40,3,41,5],[40,6,41,8],[40,9,41,11],[40,12,41,14],[40,15,41,17],[40,18,41,20],[40,21,41,23],[40,24,41,24],[40,25,41,25],[40,26,41,26],[40,27,41,27],[40,28,41,28],[40,29,41,29],[40,30,41,30],[40,31,41,31],[40,32,41,32],[42,0,43,0],[42,1,43,2],[42,3,43,5],[42,24,43,24],[42,25,43,25],[42,26,43,26],[42,27,43,27],[42,28,43,28],[42,29,43,29],[42,30,43,30],[42,31,43,31],[42,32,43,32],[44,0,45,0],[44,1,45,2],[44,6,45,8],[44,24,45,24],[44,25,45,25],[44,26,45,26],[44,27,45,27],[44,28,45,28],[44,29,45,29],[44,30,45,30],[44,31,45,31],[44,32,45,32],[46,0,47,0],[46,1,47,2],[46,9,47,11],[46,24,47,24],[46,25,47,25],[46,26,47,26],[46,27,47,27],[46,28,47,28],[46,29,47,29],[46,30,47,30],[46,31,47,31],[46,32,47,32],[48,0,49,0],[48,1,49,2],[48,12,49,14],[48,24,49,24],[48,25,49,25],[48,26,49,26],[48,27,49,27],[48,28,49,28],[48,29,49,29],[48,30,49,30],[48,31,49,31],[48,32,49,32],[50,0,51,0],[50,1,51,2],[50,15,51,17],[50,24,51,24],[50,25,51,25],[50,26,51,26],[50,27,51,27],[50,28,51,28],[50,29,51,29],[50,30,51,30],[50,31,51,31],[50,32,51,32],[55,0,56,0],[55,1,56,2],[55,3,56,5],[55,6,56,8],[55,9,56,11],[55,12,56,14],[55,15,56,17],[55,18,56,20],[55,21,56,23],[55,24,56,24],[55,25,56,25],[55,26,56,26],[55,27,56,27],[55,28,56,28],[55,29,56,29],[55,30,56,30],[55,31,56,31],[55,32,56,32],[57,0,58,0],[57,1,58,2],[57,3,58,5],[57,24,58,24],[57,25,58,25],[57,26,58,26],[57,27,58,27],[57,28,58,28],[57,29,58,29],[57,30,58,30],[57,31,58,31],[57,32,58,32],[59,0,60,0],[59,1,60,2],[59,6,60,8],[59,24,60,24],[59,25,60,25],[59,26,60,26],[59,27,60,27],[59,28,60,28],[59,29,60,29],[59,30,60,30],[59,31,60,31],[59,32,60,32],[61,0,62,0],[61,1,62,2],[61,9,62,11],[61,24,62,24],[61,25,62,25],[61,26,62,26],[61,27,62,27],[61,28,62,28],[61,29,62,29],[61,30,62,30],[61,31,62,31],[61,32,62,32],[63,0,64,0],[63,1,64,2],[63,12,64,14],[63,24,64,24],[63,25,64,25],[63,26,64,26],[63,27,64,27],[63,28,64,28],[63,29,64,29],[63,30,64,30],[63,31,64,31],[63,32,64,32],[68,0,69,0],[68,1,69,2],[68,3,69,5],[68,6,69,8],[68,9,69,11],[68,12,69,14],[68,15,69,17],[68,18,69,20],[68,21,69,23],[68,24,69,24],[68,25,69,25],[68,26,69,26],[68,27,69,27],[68,28,69,28],[68,29,69,29],[68,30,69,30],[68,31,69,31],[68,32,69,32],[70,0,71,0],[70,1,71,2],[70,3,71,5],[70,24,71,24],[70,25,71,25],[70,26,71,26],[70,27,71,27],[70,28,71,28],[70,29,71,29],[70,30,71,30],[70,31,71,31],[70,32,71,32],[72,0,73,0],[72,1,73,2],[72,6,73,8],[72,24,73,24],[72,25,73,25],[72,26,73,26],[72,27,73,27],[72,28,73,28],[72,29,73,29],[72,30,73,30],[72,31,73,31],[72,32,73,32],[74,0,75,0],[74,1,75,2],[74,9,75,11],[74,24,75,24],[74,25,75,25],[74,26,75,26],[74,27,75,27],[74,28,75,28],[74,29,75,29],[74,30,75,30],[74,31,75,31],[74,32,75,32]]}
[]
[]
[]
[]
[{"$nulls":27},"点","内野","順位決定点","相手内野","順位","kaku"]
[]
[{"$nulls":27},{"$f":"Y7*2+AA7","v":0},{"$f":"IF(G8=\"\",\"\",D8+G8+M8+P8+J8+S8+V8)","v":""},{"$f":"IF(AC7=\"\",\"\",AB7*100+AC7)","v":""},{"$f":"IF(AC7=\"\",\"\",F8+I8+L8+O8+R8+U8+X8)","v":""},{"$f":"IF(AD7=\"\",\"\",RANK(AD7,AD7:AD20,0))","v":""},null,{"$f":"CONCATENATE(A5,AF7)","v":""},{"$f":"B7","v":0},null,{"$f":"CONCATENATE(A$5,AF7)","v":""},{"$f":"$B7","v":0}]
[{"$nulls":36},{"$f":"CONCATENATE(A$5,AF8)","v":""},{"$f":"$B8","v":0}]
[{"$nulls":27},{"$f":"Y9*2+AA9","v":0},{"$f":"IF(D10=\"\",\"\",D10+G10+M10+P10+J10+S10+V10)","v":""},{"$f":"IF(AC9=\"\",\"\",AB9*100+AC9)","v":""},{"$f":"IF(AC9=\"\",\"\",F10+I10+L10+O10+R10+U10+X10)","v":""},{"$f":"IF(AD9=\"\",\"\",RANK(AD9,AD7:AD20,0))","v":""},null,{"$f":"CONCATENATE(A5,AF9)","v":""},{"$f":"B9","v":0},null,"",0]
[{"$nulls":36},"",0]
[{"$nulls":27},{"$f":"Y11*2+AA11","v":0},{"$f":"IF(D12=\"\",\"\",D12+G12+M12+P12+J12+S12+V12)","v":""},{"$f":"IF(AC11=\"\",\"\",AB11*100+AC11)","v":""},{"$f":"IF(AC11=\"\",\"\",F12+I12+L12+O12+R12+U12+X12)","v":""},{"$f":"IF(AD11=\"\",\"\",RANK(AD11,AD7:AD20,0))","v":""},null,{"$f":"CONCATENATE(A5,AF11)","v":""},{"$f":"B11","v":0},null,"",0]
[{"$nulls":36},"",0]
[{"$nulls":27},{"$f":"Y13*2+AA13","v":0},{"$f":"IF(D14=\"\",\"\",D14+G14+M14+P14+J14+S14+V14)","v":""},{"$f":"IF(AC13=\"\",\"\",AB13*100+AC13)","v":""},{"$f":"IF(AC13=\"\",\"\",F14+I14+L14+O14+R14+U14+X14)","v":""},{"$f":"IF(AD13=\"\",\"\",RANK(AD13,AD7:AD20,0))","v":""},null,{"$f":"CONCATENATE(A5,AF13)","v":""},{"$f":"B13","v":0},null,"",0]
[{"$nulls":36},"",0]
[{"$nulls":27},{"$f":"Y15*2+AA15","v":0},{"$f":"IF(D16=\"\",\"\",D16+G16+M16+P16+J16+S16+V16)","v":""},{"$f":"IF(AC15=\"\",\"\",AB15*100+AC15)","v":""},{"$f":"IF(AC15=\"\",\"\",F16+I16+L16+O16+R16+U16+X16)","v":""},{"$f":"IF(AD15=\"\",\"\",RANK(AD15,AD7:AD20,0))","v":""},null,{"$f":"CONCATENATE(A5,AF15)","v":""},{"$f":"B15","v":0},null,"",0]
[{"$nulls":36},"",0]
[{"$nulls":27},{"$f":"Y17*2+AA17","v":0},{"$f":"IF(D18=\"\",\"\",D18+G18+M18+P18+J18+S18+V18)","v":""},{"$f":"IF(AC17=\"\",\"\",AB17*100+AC17)","v":""},{"$f":"IF(AC17=\"\",\"\",F18+I18+L18+O18+R18+U18+X18)","v":""},{"$f":"IF(AD17=\"\",\"\",RANK(AD17,AD7:AD20,0))","v":""},null,{"$f":"CONCATENATE(A5,AF17)","v":""},{"$f":"B17","v":0},null,"",0]
[{"$nulls":36},"",0]
[{"$nulls":27},{"$f":"Y19*2+AA19","v":0},{"$f":"IF(D20=\"\",\"\",D20+G20+M20+P20+J20+S20+V20)","v":""},{"$f":"IF(AC19=\"\",\"\",AB19*100+AC19)","v":""},{"$f":"IF(AC19=\"\",\"\",F20+I20+L20+O20+R20+U20+X20)","v":""},{"$f":"IF(AD19=\"\",\"\",RANK(AD19,AD7:AD20,0))","v":""},null,{"$f":"CONCATENATE(A5,AF19)","v":""},{"$f":"B19","v":0},null,"",0]
[{"$nulls":36},"",0]
[]
[]
[]
[{"$nulls":27},"点","内野","順位決定点","相手内野","順位","kaku"]
[]
[{"$nulls":27},{"$f":"Y26*2+AA26","v":0},{"$f":"IF(G27=\"\",\"\",D27+G27+M27+P27+J27+S27)","v":""},{"$f":"IF(AC26=\"\",\"\",AB26*100+AC26)","v":""},{"$f":"IF(AC26=\"\",\"\",F27+I27+L27+O27+R27+U27)","v":""},{"$f":"IF(AD26=\"\",\"\",RANK(AD26,AD26:AD37,0))","v":""},null,{"$f":"CONCATENATE(A24,AF26)","v":""},{"$f":"B26","v":0},null,{"$f":"CONCATENATE(A$5,AF26)","v":""},{"$f":"$B26","v":0}]
[{"$nulls":36},{"$f":"CONCATENATE(A$5,AF27)","v":""},{"$f":"$B27","v":0}]
[{"$nulls":27},{"$f":"Y28*2+AA28","v":0},{"$f":"IF(D29=\"\",\"\",D29+G29+M29+P29+J29+S29)","v":""},{"$f":"IF(AC28=\"\",\"\",AB28*100+AC28)","v":""},{"$f":"IF(AC28=\"\",\"\",F29+I29+L29+O29+R29+U29)","v":""},{"$f":"IF(AD28=\"\",\"\",RANK(AD28,AD26:AD37,0))","v":""},null,{"$f":"CONCATENATE(A24,AF28)","v":""},{"$f":"B28","v":0},null,"",0]
[{"$nulls":36},"",0]
[{"$nulls":27},{"$f":"Y30*2+AA30","v":0},{"$f":"IF(G31=\"\",\"\",D31+G31+M31+P31+J31+S31)","v":""},{"$f":"IF(AC30=\"\",\"\",AB30*100+AC30)","v":""},{"$f":"IF(AC30=\"\",\"\",F31+I31+L31+O31+R31+U31)","v":""},{"$f":"IF(AD30=\"\",\"\",RANK(AD30,AD26:AD37,0))","v":""},null,{"$f":"CONCATENATE(A24,AF30)","v":""},{"$f":"B30","v":0},null,"",0]
[{"$nulls":36},"",0]
[{"$nulls":27},{"$f":"Y32*2+AA32","v":0},{"$f":"IF(G33=\"\",\"\",D33+G33+M33+P33+J33+S33)","v":""},{"$f":"IF(AC32=\"\",\"\",AB32*100+AC32)","v":""},{"$f":"IF(AC32=\"\",\"\",F33+I33+L33+O33+R33+U33)","v":""},{"$f":"IF(AD32=\"\",\"\",RANK(AD32,AD26:AD37,0))","v":""},null,{"$f":"CONCATENATE(A24,AF32)","v":""},{"$f":"B32","v":0},null,"",0]
[{"$nulls":36},"",0]
[{"$nulls":27},{"$f":"Y34*2+AA34","v":0},{"$f":"IF(G35=\"\",\"\",D35+G35+M35+P35+J35+S35)","v":""},{"$f":"IF(AC34=\"\",\"\",AB34*100+AC34)","v":""},{"$f":"IF(AC34=\"\",\"\",F35+I35+L35+O35+R35+U35)","v":""},{"$f":"IF(AD34=\"\",\"\",RANK(AD34,AD26:AD37,0))","v":""},null,{"$f":"CONCATENATE(A24,AF34)","v":""},{"$f":"B34","v":0},null,"",0]
[{"$nulls":33},{"$f":"CONCATENATE($A$5,AF35)","v":""},null,null,"",0]
[{"$nulls":27},{"$f":"Y36*2+AA36","v":0},{"$f":"IF(G37=\"\",\"\",D37+G37+M37+P37+J37+S37)","v":""},{"$f":"IF(AC36=\"\",\"\",AB36*100+AC36)","v":""},{"$f":"IF(AC36=\"\",\"\",F37+I37+L37+O37+R37+U37)","v":""},{"$f":"IF(AD36=\"\",\"\",RANK(AD36,AD26:AD37,0))","v":""},null,{"$f":"CONCATENATE(A24,AF36)","v":""},{"$f":"B36","v":0},null,"",0]
[{"$nulls":36},"",0]
[]
[]
[]
[{"$nulls":27},"点","内野","順位決定点","相手内野","順位","kaku"]
[]
[{"$nulls":27},{"$f":"Y43*2+AA43","v":0},{"$f":"IF(G44=\"\",\"\",D44+G44+M44+P44+J44)","v":""},{"$f":"IF(AC43=\"\",\"\",AB43*100+AC43)","v":""},{"$f":"IF(AC43=\"\",\"\",F44+I44+L44+O44+R44)","v":""},{"$f":"IF(AD43=\"\",\"\",RANK(AD43,AD43:AD52,0))","v":""},null,{"$f":"CONCATENATE(A41,AF43)","v":""},{"$f":"B43","v":0},null,{"$f":"CONCATENATE(A$5,AF43)","v":""},{"$f":"$B43","v":0}]
[{"$nulls":36},{"$f":"CONCATENATE(A$5,AF44)","v":""},{"$f":"$B44","v":0}]
[{"$nulls":27},{"$f":"Y45*2+AA45","v":0},{"$f":"IF(D46=\"\",\"\",D46+G46+M46+P46+J46)","v":""},{"$f":"IF(AC45=\"\",\"\",AB45*100+AC45)","v":""},{"$f":"IF(AC45=\"\",\"\",F46+I46+L46+O46+R46)","v":""},{"$f":"IF(AD45=\"\",\"\",RANK(AD45,AD43:AD52,0))","v":""},null,{"$f":"CONCATENATE(A41,AF45)","v":""},{"$f":"B45","v":0},null,"",0]
[{"$nulls":36},"",0]
[{"$nulls":27},{"$f":"Y47*2+AA47","v":0},{"$f":"IF(G48=\"\",\"\",D48+G48+M48+P48+J48)","v":""},{"$f":"IF(AC47=\"\",\"\",AB47*100+AC47)","v":""},{"$f":"IF(AC47=\"\",\"\",F48+I48+L48+O48+R48)","v":""},{"$f":"IF(AD47=\"\",\"\",RANK(AD47,AD43:AD52,0))","v":""},null,{"$f":"CONCATENATE(A41,AF47)","v":""},{"$f":"B47","v":0},null,"",0]
[{"$nulls":36},"",0]
[{"$nulls":27},{"$f":"Y49*2+AA49","v":0},{"$f":"IF(G50=\"\",\"\",D50+G50+M50+P50+J50)","v":""},{"$f":"IF(AC49=\"\",\"\",AB49*100+AC49)","v":""},{"$f":"IF(AC49=\"\",\"\",F50+I50+L50+O50+R50)","v":""},{"$f":"IF(AD49=\"\",\"\",RANK(AD49,AD43:AD52,0))","v":""},null,{"$f":"CONCATENATE(A41,AF49)","v":""},{"$f":"B49","v":0},null,"",0]
[{"$nulls":36},"",0]
[{"$nulls":27},{"$f":"Y51*2+AA51","v":0},{"$f":"IF(G52=\"\",\"\",D52+G52+M52+P52+J52)","v":""},{"$f":"IF(AC51=\"\",\"\",AB51*100+AC51)","v":""},{"$f":"IF(AC51=\"\",\"\",F52+I52+L52+O52+R52)","v":""},{"$f":"IF(AD51=\"\",\"\",RANK(AD51,AD43:AD52,0))","v":""},null,{"$f":"CONCATENATE(A41,AF51)","v":""},{"$f":"B51","v":0},null,"",0]
[{"$nulls":36},"",0]
[]
[]
[]
[{"$nulls":27},"点","内野","順位決定点","相手内野","順位","kaku"]
[]
[{"$nulls":27},{"$f":"Y58*2+AA58","v":0},{"$f":"IF(G59=\"\",\"\",D59+G59+M59+J59)","v":""},{"$f":"IF(AC58=\"\",\"\",AB58*100+AC58)","v":""},{"$f":"IF(AC58=\"\",\"\",F59+I59+L59+O59)","v":""},{"$f":"IF(AD58=\"\",\"\",RANK(AD58,AD58:AD65,0))","v":""},null,{"$f":"CONCATENATE(A56,AF58)","v":""},{"$f":"B58","v":0},null,{"$f":"CONCATENATE(A$5,AF58)","v":""},{"$f":"$B58","v":0}]
[{"$nulls":36},{"$f":"CONCATENATE(A$5,AF59)","v":""},{"$f":"$B59","v":0}]
[{"$nulls":27},{"$f":"Y60*2+AA60","v":0},{"$f":"IF(D61=\"\",\"\",D61+G61+M61+J61)","v":""},{"$f":"IF(AC60=\"\",\"\",AB60*100+AC60)","v":""},{"$f":"IF(AC60=\"\",\"\",F61+I61+L61+O61)","v":""},{"$f":"IF(AD60=\"\",\"\",RANK(AD60,AD58:AD65,0))","v":""},null,{"$f":"CONCATENATE(A56,AF60)","v":""},{"$f":"B60","v":0},null,"",0]
[{"$nulls":36},"",0]
[{"$nulls":27},{"$f":"Y62*2+AA62","v":0},{"$f":"IF(G63=\"\",\"\",D63+G63+M63+J63)","v":""},{"$f":"IF(AC62=\"\",\"\",AB62*100+AC62)","v":""},{"$f":"IF(AC62=\"\",\"\",F63+I63+L63+O63)","v":""},{"$f":"IF(AD62=\"\",\"\",RANK(AD62,AD58:AD65,0))","v":""},null,{"$f":"CONCATENATE(A56,AF62)","v":""},{"$f":"B62","v":0},null,"",0]
[{"$nulls":36},"",0]
[{"$nulls":27},{"$f":"Y64*2+AA64","v":0},{"$f":"IF(G65=\"\",\"\",D65+G65+M65+J65)","v":""},{"$f":"IF(AC64=\"\",\"\",AB64*100+AC64)","v":""},{"$f":"IF(AC64=\"\",\"\",F65+I65+L65+O65)","v":""},{"$f":"IF(AD64=\"\",\"\",RANK(AD64,AD58:AD65,0))","v":""},null,{"$f":"CONCATENATE(A56,AF64)","v":""},{"$f":"B64","v":0},null,"",0]
[{"$nulls":36},"",0]
[]
[]
[]
[{"$nulls":27},"点","内野","順位決定点","相手内野","順位","kaku"]
[]
[{"$nulls":27},{"$f":"Y71*2+AA71","v":0},{"$f":"IF(G72=\"\",\"\",D72+G72+J72)","v":""},{"$f":"IF(AC71=\"\",\"\",AB71*100+AC71)","v":""},{"$f":"IF(AC71=\"\",\"\",F72+I72+L72)","v":""},{"$f":"IF(AD71=\"\",\"\",RANK(AD71,AD71:AD76,0))","v":""},null,{"$f":"CONCATENATE(A69,AF71)","v":""},{"$f":"B71","v":0},null,{"$f":"CONCATENATE(A$5,AF71)","v":""},{"$f":"$B71","v":0}]
[{"$nulls":36},"",0]
[{"$nulls":27},{"$f":"Y73*2+AA73","v":0},{"$f":"IF(D74=\"\",\"\",D74+G74+J74)","v":""},{"$f":"IF(AC73=\"\",\"\",AB73*100+AC73)","v":""},{"$f":"IF(AC73=\"\",\"\",F74+I74+L74)","v":""},{"$f":"IF(AD73=\"\",\"\",RANK(AD73,AD71:AD76,0))","v":""},null,{"$f":"CONCATENATE(A69,AF73)","v":""},{"$f":"B73","v":0},null,"",0]
[{"$nulls":36},"",0]
[{"$nulls":27},{"$f":"Y75*2+AA75","v":0},{"$f":"IF(G76=\"\",\"\",D76+G76+J76)","v":""},{"$f":"IF(AC75=\"\",\"\",AB75*100+AC75)","v":""},{"$f":"IF(AC75=\"\",\"\",F76+I76+L76)","v":""},{"$f":"IF(AD75=\"\",\"\",RANK(AD75,AD71:AD76,0))","v":""},null,{"$f":"CONCATENATE(A69,AF75)","v":""},{"$f":"B75","v":0},null,"",0]
[{"$nulls":36},"",0]

{"sheet":"対戦表1","index":7,"n_rows":0,"n_cols":0,"rows_kept":0}

{"sheet":"Sheet1","index":8,"n_rows":0,"n_cols":0,"rows_kept":0}

{"sheet":"対戦表2","index":9,"n_rows":165,"n_cols":34,"rows_kept":165,"merged":[[45,5,45,10],[45,15,45,20],[45,25,45,30],[46,5,46,10],[46,15,46,20],[46,25,46,30],[47,5,47,10],[47,15,47,20],[47,25,47,30],[48,5,48,10],[48,15,48,20],[48,25,48,30],[49,5,49,10],[49,15,49,20],[49,25,49,30],[50,5,50,10],[50,15,50,20],[50,25,50,30],[51,5,51,10],[51,15,51,20],[51,25,51,30],[52,5,52,10],[52,15,52,20],[53,5,53,10],[53,15,53,20],[54,5,54,10],[54,15,54,20],[54,25,54,30]]}
[{"$nulls":10},{"$f":"チーム表!$B$1","v":"第２０回　加賀地域少年少女ドッジボール大会"}]
[]
["　試合スケジュール"]
[]
[null,"時間",null,null,"点","Ａコート",{"$nulls":3},"点","Ａコート",{"$nulls":3},"点","Ｂコート",{"$nulls":3},"点","Ｂコート"]
[1,null,{"$f":"組合表!AG4","v":"D1"},{"$f":"CONCATENATE(C6,H6)","v":"D1D2"},null,{"$f":"VLOOKUP(C6,チーム表!C:D,2,FALSE)","v":"飯野マジックス"},"×",{"$f":"組合表!AH4","v":"D2"},{"$f":"CONCATENATE(H6,C6)","v":"D2D1"},null,{"$f":"VLOOKUP(H6,チーム表!C:D,2,FALSE)","v":"三馬パワフル"},null,{"$f":"組合表!AI4","v":"A1"},{"$f":"CONCATENATE(M6,R6)","v":"A1A2"},null,{"$f":"VLOOKUP(M6,チーム表!C:D,2,FALSE)","v":"鞍月アタッカーズ"},"×",{"$f":"組合表!AJ4","v":"A2"},{"$f":"CONCATENATE(R6,M6)","v":"A2A1"},null,{"$f":"VLOOKUP(R6,チーム表!C:D,2,FALSE)","v":"針原パイレーツ"},{"$nulls":11},{"$f":"D6","v":"D1D2"},{"$f":"IF(E6=\"\",\"\",E6)","v":""}]
[2,null,{"$f":"組合表!AG5","v":"B1"},{"$f":"CONCATENATE(C7,H7)","v":"B1B2"},null,{"$f":"VLOOKUP(C7,チーム表!C:D,2,FALSE)","v":"呉羽ドッジボールクラブ"},"×",{"$f":"組合表!AH5","v":"B2"},{"$f":"CONCATENATE(H7,C7)","v":"B2B1"},null,{"$f":"VLOOKUP(H7,チーム表!C:D,2,FALSE)","v":"鳳至ドッジボールクラブ"},null,{"$f":"組合表!AI5","v":"C1"},{"$f":"CONCATENATE(M7,R7)","v":"C1C2"},null,{"$f":"VLOOKUP(M7,チーム表!C:D,2,FALSE)","v":"光陽マーリンズ"},"×",{"$f":"組合表!AJ5","v":"C2"},{"$f":"CONCATENATE(R7,M7)","v":"C2C1"},null,{"$f":"VLOOKUP(R7,チーム表!C:D,2,FALSE)","v":"中郷ドッジボールクラブ"},{"$nulls":11},"B1B2",{"$f":"IF(E7=\"\",\"\",E7)","v":""}]
[3,null,{"$f":"組合表!AG6","v":"E1"},"E1E2",null,{"$f":"VLOOKUP(C8,チーム表!C:D,2,FALSE)","v":"鞍月アタッカーズジュニア"},"×",{"$f":"組合表!AH6","v":"E2"},"E2E1",null,{"$f":"VLOOKUP(H8,チーム表!C:D,2,FALSE)","v":"鳳至ジュニア"},null,{"$f":"組合表!AI6","v":"F1"},"F1F2",null,{"$f":"VLOOKUP(M8,チーム表!C:D,2,FALSE)","v":"九十九クラブ"},"×",{"$f":"組合表!AJ6","v":"F2"},"F2F1",null,{"$f":"VLOOKUP(R8,チーム表!C:D,2,FALSE)","v":"千坂ロータスルート"},{"$nulls":11},"E1E2",""]
[4,null,{"$f":"組合表!AG7","v":"G1"},"G1G2",null,{"$f":"VLOOKUP(C9,チーム表!C:D,2,FALSE)","v":"鞍月アタッカーズキッズ"},"×",{"$f":"組合表!AH7","v":"G2"},"G2G1",null,{"$f":"VLOOKUP(H9,チーム表!C:D,2,FALSE)","v":"松任の大魔陣Jr."},null,{"$f":"組合表!AI7","v":"H1"},"H1H2",null,{"$f":"VLOOKUP(M9,チーム表!C:D,2,FALSE)","v":"呉羽DBCジュニア"},"×",{"$f":"組合表!AJ7","v":"H2"},"H2H1",null,{"$f":"VLOOKUP(R9,チーム表!C:D,2,FALSE)","v":"NISHI　Jrスターズ"},{"$nulls":11},"G1G2",""]
[5,null,{"$f":"組合表!AG8","v":"D3"},"D3D4",null,{"$f":"VLOOKUP(C10,チーム表!C:D,2,FALSE)","v":"寺井クラブ"},"×",{"$f":"組合表!AH8","v":"D4"},"D4D3",null,{"$f":"VLOOKUP(H10,チーム表!C:D,2,FALSE)","v":"大門ドッジボールクラブ"},null,{"$f":"組合表!AI8","v":"A3"},"A3A4",null,{"$f":"VLOOKUP(M10,チーム表!C:D,2,FALSE)","v":"小木クラブ"},"×",{"$f":"組合表!AJ8","v":"A4"},"A4A3",null,{"$f":"VLOOKUP(R10,チーム表!C:D,2,FALSE)","v":"NISHIファイヤースターズ"},{"$nulls":11},"D3D4",""]
[6,null,{"$f":"組合表!AG9","v":"B3"},"B3B4",null,{"$f":"VLOOKUP(C11,チーム表!C:D,2,FALSE)","v":"千坂ドッジファイヤーズ"},"×",{"$f":"組合表!AH9","v":"B4"},"B4B3",null,{"$f":"VLOOKUP(H11,チーム表!C:D,2,FALSE)","v":"松任の大魔陣"},null,{"$f":"組合表!AI9","v":"C3"},"C3C4",null,{"$f":"VLOOKUP(M11,チーム表!C:D,2,FALSE)","v":"鵜川ミラクルフェニックス"},"×",{"$f":"組合表!AJ9","v":"C4"},"C4C3",null,{"$f":"VLOOKUP(R11,チーム表!C:D,2,FALSE)","v":"向本折クラブA"},{"$nulls":11},"B3B4",""]
[7,null,{"$f":"組合表!AG10","v":"E3"},"E3E4",null,{"$f":"VLOOKUP(C12,チーム表!C:D,2,FALSE)","v":"中郷ミラクルジュニア"},"×",{"$f":"組合表!AH10","v":"E4"},"E4E3",null,{"$f":"VLOOKUP(H12,チーム表!C:D,2,FALSE)","v":"ドッジの王子様"},null,{"$f":"組合表!AI10","v":"F3"},"F3F4",null,{"$f":"VLOOKUP(M12,チーム表!C:D,2,FALSE)","v":"向本折クラブNew"},"×",{"$f":"組合表!AJ10","v":"F4"},"F4F3",null,{"$f":"VLOOKUP(R12,チーム表!C:D,2,FALSE)","v":"寺井クラブＪｒ　A"},{"$nulls":11},"E3E4",""]
[8,null,{"$f":"組合表!AG11","v":"G3"},"G3G4",null,{"$f":"VLOOKUP(C13,チーム表!C:D,2,FALSE)","v":"鵜川フェニックスジュニア"},"×",{"$f":"組合表!AH11","v":"G4"},"G4G3",null,{"$f":"VLOOKUP(H13,チーム表!C:D,2,FALSE)","v":"大門ドッジボールクラブJr"},null,{"$f":"組合表!AI11","v":"H3"},"H3H4",null,{"$f":"VLOOKUP(M13,チーム表!C:D,2,FALSE)","v":"寺井クラブＪｒ　B"},"×",{"$f":"組合表!AJ11","v":"H4"},"H4H3",null,{"$f":"VLOOKUP(R13,チーム表!C:D,2,FALSE)","v":"田上闘球FUTURES"},{"$nulls":11},"G3G4",""]
[9,null,{"$f":"組合表!AG12","v":"D1"},"D1D5",null,{"$f":"VLOOKUP(C14,チーム表!C:D,2,FALSE)","v":"飯野マジックス"},"×",{"$f":"組合表!AH12","v":"D5"},"D5D1",null,{"$f":"VLOOKUP(H14,チーム表!C:D,2,FALSE)","v":"田上闘球DREAMS"},null,{"$f":"組合表!AI12","v":"A2"},"A2A3",null,{"$f":"VLOOKUP(M14,チーム表!C:D,2,FALSE)","v":"針原パイレーツ"},"×",{"$f":"組合表!AJ12","v":"A3"},"A3A2",null,{"$f":"VLOOKUP(R14,チーム表!C:D,2,FALSE)","v":"小木クラブ"},{"$nulls":11},"D1D5",""]
[10,null,{"$f":"組合表!AG13","v":"B2"},"B2B3",null,{"$f":"VLOOKUP(C15,チーム表!C:D,2,FALSE)","v":"鳳至ドッジボールクラブ"},"×",{"$f":"組合表!AH13","v":"B3"},"B3B2",null,{"$f":"VLOOKUP(H15,チーム表!C:D,2,FALSE)","v":"千坂ドッジファイヤーズ"},null,{"$f":"組合表!AI13","v":"C2"},"C2C3",null,{"$f":"VLOOKUP(M15,チーム表!C:D,2,FALSE)","v":"中郷ドッジボールクラブ"},"×",{"$f":"組合表!AJ13","v":"C3"},"C3C2",null,{"$f":"VLOOKUP(R15,チーム表!C:D,2,FALSE)","v":"鵜川ミラクルフェニックス"},{"$nulls":11},"B2B3",""]
[11,null,{"$f":"組合表!AG14","v":"E2"},"E2E3",null,{"$f":"VLOOKUP(C16,チーム表!C:D,2,FALSE)","v":"鳳至ジュニア"},"×",{"$f":"組合表!AH14","v":"E3"},"E3E2",null,{"$f":"VLOOKUP(H16,チーム表!C:D,2,FALSE)","v":"中郷ミラクルジュニア"},null,{"$f":"組合表!AI14","v":"F2"},"F2F3",null,{"$f":"VLOOKUP(M16,チーム表!C:D,2,FALSE)","v":"千坂ロータスルート"},"×",{"$f":"組合表!AJ14","v":"F3"},"F3F2",null,{"$f":"VLOOKUP(R16,チーム表!C:D,2,FALSE)","v":"向本折クラブNew"},{"$nulls":11},"E2E3",""]
[12,null,{"$f":"組合表!AG15","v":"G2"},"G2G3",null,{"$f":"VLOOKUP(C17,チーム表!C:D,2,FALSE)","v":"松任の大魔陣Jr."},"×",{"$f":"組合表!AH15","v":"G3"},"G3G2",null,{"$f":"VLOOKUP(H17,チーム表!C:D,2,FALSE)","v":"鵜川フェニックスジュニア"},null,{"$f":"組合表!AI15","v":"H2"},"H2H3",null,{"$f":"VLOOKUP(M17,チーム表!C:D,2,FALSE)","v":"NISHI　Jrスターズ"},"×",{"$f":"組合表!AJ15","v":"H3"},"H3H2",null,{"$f":"VLOOKUP(R17,チーム表!C:D,2,FALSE)","v":"寺井クラブＪｒ　B"},{"$nulls":11},"G2G3",""]
[13,null,{"$f":"組合表!AG16","v":"D2"},"D2D3",null,{"$f":"VLOOKUP(C18,チーム表!C:D,2,FALSE)","v":"三馬パワフル"},"×",{"$f":"組合表!AH16","v":"D3"},"D3D2",null,{"$f":"VLOOKUP(H18,チーム表!C:D,2,FALSE)","v":"寺井クラブ"},null,{"$f":"組合表!AI16","v":"A1"},"A1A4",null,{"$f":"VLOOKUP(M18,チーム表!C:D,2,FALSE)","v":"鞍月アタッカーズ"},"×",{"$f":"組合表!AJ16","v":"A4"},"A4A1",null,{"$f":"VLOOKUP(R18,チーム表!C:D,2,FALSE)","v":"NISHIファイヤースターズ"},{"$nulls":11},"D2D3",""]
[14,null,{"$f":"組合表!AG17","v":"B1"},"B1B4",null,{"$f":"VLOOKUP(C19,チーム表!C:D,2,FALSE)","v":"呉羽ドッジボールクラブ"},"×",{"$f":"組合表!AH17","v":"B4"},"B4B1",null,{"$f":"VLOOKUP(H19,チーム表!C:D,2,FALSE)","v":"松任の大魔陣"},null,{"$f":"組合表!AI17","v":"C1"},"C1C4",null,{"$f":"VLOOKUP(M19,チーム表!C:D,2,FALSE)","v":"光陽マーリンズ"},"×",{"$f":"組合表!AJ17","v":"C4"},"C4C1",null,{"$f":"VLOOKUP(R19,チーム表!C:D,2,FALSE)","v":"向本折クラブA"},{"$nulls":11},"B1B4",""]
[15,null,{"$f":"組合表!AG18","v":"E1"},"E1E4",null,{"$f":"VLOOKUP(C20,チーム表!C:D,2,FALSE)","v":"鞍月アタッカーズジュニア"},"×",{"$f":"組合表!AH18","v":"E4"},"E4E1",null,{"$f":"VLOOKUP(H20,チーム表!C:D,2,FALSE)","v":"ドッジの王子様"},null,{"$f":"組合表!AI18","v":"F1"},"F1F4",null,{"$f":"VLOOKUP(M20,チーム表!C:D,2,FALSE)","v":"九十九クラブ"},"×",{"$f":"組合表!AJ18","v":"F4"},"F4F1",null,{"$f":"VLOOKUP(R20,チーム表!C:D,2,FALSE)","v":"寺井クラブＪｒ　A"},{"$nulls":11},"E1E4",""]
[16,null,{"$f":"組合表!AG19","v":"G1"},"G1G4",null,{"$f":"VLOOKUP(C21,チーム表!C:D,2,FALSE)","v":"鞍月アタッカーズキッズ"},"×",{"$f":"組合表!AH19","v":"G4"},"G4G1",null,{"$f":"VLOOKUP(H21,チーム表!C:D,2,FALSE)","v":"大門ドッジボールクラブJr"},null,{"$f":"組合表!AI19","v":"H1"},"H1H4",null,{"$f":"VLOOKUP(M21,チーム表!C:D,2,FALSE)","v":"呉羽DBCジュニア"},"×",{"$f":"組合表!AJ19","v":"H4"},"H4H1",null,{"$f":"VLOOKUP(R21,チーム表!C:D,2,FALSE)","v":"田上闘球FUTURES"},{"$nulls":11},"G1G4",""]
[17,null,{"$f":"組合表!AG20","v":"D4"},"D4D5",null,{"$f":"VLOOKUP(C22,チーム表!C:D,2,FALSE)","v":"大門ドッジボールクラブ"},"×",{"$f":"組合表!AH20","v":"D5"},"D5D4",null,{"$f":"VLOOKUP(H22,チーム表!C:D,2,FALSE)","v":"田上闘球DREAMS"},null,{"$f":"組合表!AI20","v":"A1"},"A1A3",null,{"$f":"VLOOKUP(M22,チーム表!C:D,2,FALSE)","v":"鞍月アタッカーズ"},"×",{"$f":"組合表!AJ20","v":"A3"},"A3A1",null,{"$f":"VLOOKUP(R22,チーム表!C:D,2,FALSE)","v":"小木クラブ"},{"$nulls":11},"D4D5",""]
[18,null,{"$f":"組合表!AG21","v":"B1"},"B1B3",null,{"$f":"VLOOKUP(C23,チーム表!C:D,2,FALSE)","v":"呉羽ドッジボールクラブ"},"×",{"$f":"組合表!AH21","v":"B3"},"B3B1",null,{"$f":"VLOOKUP(H23,チーム表!C:D,2,FALSE)","v":"千坂ドッジファイヤーズ"},null,{"$f":"組合表!AI21","v":"C1"},"C1C3",null,{"$f":"VLOOKUP(M23,チーム表!C:D,2,FALSE)","v":"光陽マーリンズ"},"×",{"$f":"組合表!AJ21","v":"C3"},"C3C1",null,{"$f":"VLOOKUP(R23,チーム表!C:D,2,FALSE)","v":"鵜川ミラクルフェニックス"},{"$nulls":11},"B1B3",""]
[19,null,{"$f":"組合表!AG22","v":"E1"},"E1E3",null,{"$f":"VLOOKUP(C24,チーム表!C:D,2,FALSE)","v":"鞍月アタッカーズジュニア"},"×",{"$f":"組合表!AH22","v":"E3"},"E3E1",null,{"$f":"VLOOKUP(H24,チーム表!C:D,2,FALSE)","v":"中郷ミラクルジュニア"},null,{"$f":"組合表!AI22","v":"F1"},"F1F3",null,{"$f":"VLOOKUP(M24,チーム表!C:D,2,FALSE)","v":"九十九クラブ"},"×",{"$f":"組合表!AJ22","v":"F3"},"F3F1",null,{"$f":"VLOOKUP(R24,チーム表!C:D,2,FALSE)","v":"向本折クラブNew"},{"$nulls":11},"E1E3",""]
[20,null,{"$f":"組合表!AG23","v":"G1"},"G1G3",null,{"$f":"VLOOKUP(C25,チーム表!C:D,2,FALSE)","v":"鞍月アタッカーズキッズ"},"×",{"$f":"組合表!AH23","v":"G3"},"G3G1",null,{"$f":"VLOOKUP(H25,チーム表!C:D,2,FALSE)","v":"鵜川フェニックスジュニア"},null,{"$f":"組合表!AI23","v":"H1"},"H1H3",null,{"$f":"VLOOKUP(M25,チーム表!C:D,2,FALSE)","v":"呉羽DBCジュニア"},"×",{"$f":"組合表!AJ23","v":"H3"},"H3H1",null,{"$f":"VLOOKUP(R25,チーム表!C:D,2,FALSE)","v":"寺井クラブＪｒ　B"},{"$nulls":11},"G1G3",""]
[21,null,{"$f":"組合表!AG24","v":"D1"},"D1D4",null,{"$f":"VLOOKUP(C26,チーム表!C:D,2,FALSE)","v":"飯野マジックス"},"×",{"$f":"組合表!AH24","v":"D4"},"D4D1",null,{"$f":"VLOOKUP(H26,チーム表!C:D,2,FALSE)","v":"大門ドッジボールクラブ"},null,{"$f":"組合表!AI24","v":"A2"},"A2A4",null,{"$f":"VLOOKUP(M26,チーム表!C:D,2,FALSE)","v":"針原パイレーツ"},"×",{"$f":"組合表!AJ24","v":"A4"},"A4A2",null,{"$f":"VLOOKUP(R26,チーム表!C:D,2,FALSE)","v":"NISHIファイヤースターズ"},{"$nulls":11},"D1D4",""]
[22,null,{"$f":"組合表!AG25","v":"B2"},"B2B4",null,{"$f":"VLOOKUP(C27,チーム表!C:D,2,FALSE)","v":"鳳至ドッジボールクラブ"},"×",{"$f":"組合表!AH25","v":"B4"},"B4B2",null,{"$f":"VLOOKUP(H27,チーム表!C:D,2,FALSE)","v":"松任の大魔陣"},null,{"$f":"組合表!AI25","v":"C2"},"C2C4",null,{"$f":"VLOOKUP(M27,チーム表!C:D,2,FALSE)","v":"中郷ドッジボールクラブ"},"×",{"$f":"組合表!AJ25","v":"C4"},"C4C2",null,{"$f":"VLOOKUP(R27,チーム表!C:D,2,FALSE)","v":"向本折クラブA"},{"$nulls":11},"B2B4",""]
[23,null,{"$f":"組合表!AG26","v":"E2"},"E2E4",null,{"$f":"VLOOKUP(C28,チーム表!C:D,2,FALSE)","v":"鳳至ジュニア"},"×",{"$f":"組合表!AH26","v":"E4"},"E4E2",null,{"$f":"VLOOKUP(H28,チーム表!C:D,2,FALSE)","v":"ドッジの王子様"},null,{"$f":"組合表!AI26","v":"F2"},"F2F4",null,{"$f":"VLOOKUP(M28,チーム表!C:D,2,FALSE)","v":"千坂ロータスルート"},"×",{"$f":"組合表!AJ26","v":"F4"},"F4F2",null,{"$f":"VLOOKUP(R28,チーム表!C:D,2,FALSE)","v":"寺井クラブＪｒ　A"},{"$nulls":11},"E2E4",""]
[24,null,{"$f":"組合表!AG27","v":"G2"},"G2G4",null,{"$f":"VLOOKUP(C29,チーム表!C:D,2,FALSE)","v":"松任の大魔陣Jr."},"×",{"$f":"組合表!AH27","v":"G4"},"G4G2",null,{"$f":"VLOOKUP(H29,チーム表!C:D,2,FALSE)","v":"大門ドッジボールクラブJr"},null,{"$f":"組合表!AI27","v":"H2"},"H2H4",null,{"$f":"VLOOKUP(M29,チーム表!C:D,2,FALSE)","v":"NISHI　Jrスターズ"},"×",{"$f":"組合表!AJ27","v":"H4"},"H4H2",null,{"$f":"VLOOKUP(R29,チーム表!C:D,2,FALSE)","v":"田上闘球FUTURES"},{"$nulls":11},"G2G4",""]
[25,null,{"$f":"組合表!AG28","v":"D2"},"D2D5",null,{"$f":"VLOOKUP(C30,チーム表!C:D,2,FALSE)","v":"三馬パワフル"},"×",{"$f":"組合表!AH28","v":"D5"},"D5D2",null,{"$f":"VLOOKUP(H30,チーム表!C:D,2,FALSE)","v":"田上闘球DREAMS"},null,{"$f":"組合表!AI28","v":"D1"},"D1D3",null,{"$f":"VLOOKUP(M30,チーム表!C:D,2,FALSE)","v":"飯野マジックス"},"×",{"$f":"組合表!AJ28","v":"D3"},"D3D1",null,{"$f":"VLOOKUP(R30,チーム表!C:D,2,FALSE)","v":"寺井クラブ"},{"$nulls":11},"D2D5",""]
[26,null,{"$f":"組合表!AG29","v":"D2"},"D2D4",null,{"$f":"VLOOKUP(C31,チーム表!C:D,2,FALSE)","v":"三馬パワフル"},"×",{"$f":"組合表!AH29","v":"D4"},"D4D2",null,{"$f":"VLOOKUP(H31,チーム表!C:D,2,FALSE)","v":"大門ドッジボールクラブ"},null,{"$f":"組合表!AI29","v":"D3"},"D3D5",null,{"$f":"VLOOKUP(M31,チーム表!C:D,2,FALSE)","v":"寺井クラブ"},"×",{"$f":"組合表!AJ29","v":"D5"},"D5D3",null,{"$f":"VLOOKUP(R31,チーム表!C:D,2,FALSE)","v":"田上闘球DREAMS"},{"$nulls":11},"D2D4",""]
[27,null,{"$f":"組合表!AG30","v":""},"",null,{"$f":"VLOOKUP(C32,チーム表!C:D,2,FALSE)","v":{"$error":"#N/A"}},"×",{"$f":"組合表!AH30","v":""},"",null,{"$f":"VLOOKUP(H32,チーム表!C:D,2,FALSE)","v":{"$error":"#N/A"}},null,{"$f":"組合表!AI30","v":""},"",null,{"$f":"VLOOKUP(M32,チーム表!C:D,2,FALSE)","v":{"$error":"#N/A"}},"×",{"$f":"組合表!AJ30","v":""},"",null,{"$f":"VLOOKUP(R32,チーム表!C:D,2,FALSE)","v":{"$error":"#N/A"}},{"$nulls":11},"",""]
[28,null,{"$f":"組合表!AG31","v":""},"",null,{"$f":"VLOOKUP(C33,チーム表!C:D,2,FALSE)","v":{"$error":"#N/A"}},"×",{"$f":"組合表!AH31","v":""},"",null,{"$f":"VLOOKUP(H33,チーム表!C:D,2,FALSE)","v":{"$error":"#N/A"}},null,{"$f":"組合表!AI31","v":""},"",null,{"$f":"VLOOKUP(M33,チーム表!C:D,2,FALSE)","v":{"$error":"#N/A"}},"×",{"$f":"組合表!AJ31","v":""},"",null,{"$f":"VLOOKUP(R33,チーム表!C:D,2,FALSE)","v":{"$error":"#N/A"}},{"$nulls":11},"",""]
[29,null,{"$f":"組合表!AG32","v":""},"",null,{"$f":"VLOOKUP(C34,チーム表!C:D,2,FALSE)","v":{"$error":"#N/A"}},"×",{"$f":"組合表!AH32","v":""},"",null,{"$f":"VLOOKUP(H34,チーム表!C:D,2,FALSE)","v":{"$error":"#N/A"}},null,{"$f":"組合表!AI32","v":""},"",null,{"$f":"VLOOKUP(M34,チーム表!C:D,2,FALSE)","v":{"$error":"#N/A"}},"×",{"$f":"組合表!AJ32","v":""},"",null,{"$f":"VLOOKUP(R34,チーム表!C:D,2,FALSE)","v":{"$error":"#N/A"}},{"$nulls":11},"",""]
[30,null,{"$f":"組合表!AG33","v":""},"",null,{"$f":"VLOOKUP(C35,チーム表!C:D,2,FALSE)","v":{"$error":"#N/A"}},"×",{"$f":"組合表!AH33","v":""},"",null,{"$f":"VLOOKUP(H35,チーム表!C:D,2,FALSE)","v":{"$error":"#N/A"}},null,{"$f":"組合表!AI33","v":""},"",null,{"$f":"VLOOKUP(M35,チーム表!C:D,2,FALSE)","v":{"$error":"#N/A"}},"×",{"$f":"組合表!AJ33","v":""},"",null,{"$f":"VLOOKUP(R35,チーム表!C:D,2,FALSE)","v":{"$error":"#N/A"}},{"$nulls":11},"",""]
[31,null,{"$f":"組合表!AG34","v":""},"",null,{"$f":"VLOOKUP(C36,チーム表!C:D,2,FALSE)","v":{"$error":"#N/A"}},"×",{"$f":"組合表!AH34","v":""},"",null,{"$f":"VLOOKUP(H36,チーム表!C:D,2,FALSE)","v":{"$error":"#N/A"}},null,{"$f":"組合表!AI34","v":""},"",null,{"$f":"VLOOKUP(M36,チーム表!C:D,2,FALSE)","v":{"$error":"#N/A"}},"×",{"$f":"組合表!AJ34","v":""},"",null,{"$f":"VLOOKUP(R36,チーム表!C:D,2,FALSE)","v":{"$error":"#N/A"}},{"$nulls":11},"",""]
[32,null,{"$f":"組合表!AG35","v":""},"",null,{"$f":"VLOOKUP(C37,チーム表!C:D,2,FALSE)","v":{"$error":"#N/A"}},"×",{"$f":"組合表!AH35","v":""},"",null,{"$f":"VLOOKUP(H37,チーム表!C:D,2,FALSE)","v":{"$error":"#N/A"}},null,{"$f":"組合表!AI35","v":""},"",null,{"$f":"VLOOKUP(M37,チーム表!C:D,2,FALSE)","v":{"$error":"#N/A"}},"×",{"$f":"組合表!AJ35","v":""},"",null,{"$f":"VLOOKUP(R37,チーム表!C:D,2,FALSE)","v":{"$error":"#N/A"}},{"$nulls":11},"",""]
[33,null,{"$f":"組合表!AG36","v":""},"",null,{"$f":"VLOOKUP(C38,チーム表!C:D,2,FALSE)","v":{"$error":"#N/A"}},"×",{"$f":"組合表!AH36","v":""},"",null,{"$f":"VLOOKUP(H38,チーム表!C:D,2,FALSE)","v":{"$error":"#N/A"}},null,{"$f":"組合表!AI36","v":""},"",null,{"$f":"VLOOKUP(M38,チーム表!C:D,2,FALSE)","v":{"$error":"#N/A"}},"×",{"$f":"組合表!AJ36","v":""},"",null,{"$f":"VLOOKUP(R38,チーム表!C:D,2,FALSE)","v":{"$error":"#N/A"}},{"$nulls":11},"",""]
[34,null,{"$f":"組合表!AG37","v":""},{"$f":"CONCATENATE(C39,H39)","v":""},null,{"$f":"VLOOKUP(C39,チーム表!C:D,2,FALSE)","v":{"$error":"#N/A"}},"×",{"$f":"組合表!AH37","v":""},{"$f":"CONCATENATE(H39,C39)","v":""},null,{"$f":"VLOOKUP(H39,チーム表!C:D,2,FALSE)","v":{"$error":"#N/A"}},null,{"$f":"組合表!AI37","v":""},{"$f":"CONCATENATE(M39,R39)","v":""},null,{"$f":"VLOOKUP(M39,チーム表!C:D,2,FALSE)","v":{"$error":"#N/A"}},"×",{"$f":"組合表!AJ37","v":""},{"$f":"CONCATENATE(R39,M39)","v":""},null,{"$f":"VLOOKUP(R39,チーム表!C:D,2,FALSE)","v":{"$error":"#N/A"}},{"$nulls":11},"",""]
[35,null,{"$f":"組合表!AG38","v":""},{"$f":"CONCATENATE(C40,H40)","v":""},null,{"$f":"VLOOKUP(C40,チーム表!C:D,2,FALSE)","v":{"$error":"#N/A"}},"×",{"$f":"組合表!AH38","v":""},{"$f":"CONCATENATE(H40,C40)","v":""},null,{"$f":"VLOOKUP(H40,チーム表!C:D,2,FALSE)","v":{"$error":"#N/A"}},null,{"$f":"組合表!AI38","v":""},{"$f":"CONCATENATE(M40,R40)","v":""},null,{"$f":"VLOOKUP(M40,チーム表!C:D,2,FALSE)","v":{"$error":"#N/A"}},"×",{"$f":"組合表!AJ38","v":""},{"$f":"CONCATENATE(R40,M40)","v":""},null,{"$f":"VLOOKUP(R40,チーム表!C:D,2,FALSE)","v":{"$error":"#N/A"}},{"$nulls":11},"",""]
[36,null,{"$f":"組合表!AG39","v":""},{"$f":"CONCATENATE(C41,H41)","v":""},null,{"$f":"VLOOKUP(C41,チーム表!C:D,2,FALSE)","v":{"$error":"#N/A"}},"×",{"$f":"組合表!AH39","v":""},{"$f":"CONCATENATE(H41,C41)","v":""},null,{"$f":"VLOOKUP(H41,チーム表!C:D,2,FALSE)","v":{"$error":"#N/A"}},null,{"$f":"組合表!AI39","v":""},{"$f":"CONCATENATE(M41,R41)","v":""},null,{"$f":"VLOOKUP(M41,チーム表!C:D,2,FALSE)","v":{"$error":"#N/A"}},"×",{"$f":"組合表!AJ39","v":""},{"$f":"CONCATENATE(R41,M41)","v":""},null,{"$f":"VLOOKUP(R41,チーム表!C:D,2,FALSE)","v":{"$error":"#N/A"}},{"$nulls":11},"",""]
[37,null,{"$f":"組合表!AG40","v":""},"",null,{"$f":"VLOOKUP(C42,チーム表!C:D,2,FALSE)","v":{"$error":"#N/A"}},"×",{"$f":"組合表!AH40","v":""},"",null,{"$f":"VLOOKUP(H42,チーム表!C:D,2,FALSE)","v":{"$error":"#N/A"}},null,{"$f":"組合表!AI40","v":""},"",null,{"$f":"VLOOKUP(M42,チーム表!C:D,2,FALSE)","v":{"$error":"#N/A"}},"×",{"$f":"組合表!AJ40","v":""},"",null,{"$f":"VLOOKUP(R42,チーム表!C:D,2,FALSE)","v":{"$error":"#N/A"}},{"$nulls":11},"",""]
[38,null,{"$f":"組合表!AG41","v":""},"",null,{"$f":"VLOOKUP(C43,チーム表!C:D,2,FALSE)","v":{"$error":"#N/A"}},"×",{"$f":"組合表!AH41","v":""},"",null,{"$f":"VLOOKUP(H43,チーム表!C:D,2,FALSE)","v":{"$error":"#N/A"}},null,{"$f":"組合表!AI41","v":""},"",null,{"$f":"VLOOKUP(M43,チーム表!C:D,2,FALSE)","v":{"$error":"#N/A"}},"×",{"$f":"組合表!AJ41","v":""},"",null,{"$f":"VLOOKUP(R43,チーム表!C:D,2,FALSE)","v":{"$error":"#N/A"}},{"$nulls":11},"",""]
[39,null,{"$f":"組合表!AG42","v":""},"",null,{"$f":"VLOOKUP(C44,チーム表!C:D,2,FALSE)","v":{"$error":"#N/A"}},"×",{"$f":"組合表!AH42","v":""},"",null,{"$f":"VLOOKUP(H44,チーム表!C:D,2,FALSE)","v":{"$error":"#N/A"}},null,{"$f":"組合表!AI42","v":""},"",null,{"$f":"VLOOKUP(M44,チーム表!C:D,2,FALSE)","v":{"$error":"#N/A"}},"×",{"$f":"組合表!AJ42","v":""},"",null,{"$f":"VLOOKUP(R44,チーム表!C:D,2,FALSE)","v":{"$error":"#N/A"}},{"$nulls":11},"",""]
[40,null,{"$f":"組合表!AG43","v":""},"",null,{"$f":"VLOOKUP(C45,チーム表!C:D,2,FALSE)","v":{"$error":"#N/A"}},"×",{"$f":"組合表!AH43","v":""},"",null,{"$f":"VLOOKUP(H45,チーム表!C:D,2,FALSE)","v":{"$error":"#N/A"}},null,{"$f":"組合表!AI43","v":""},"",null,{"$f":"VLOOKUP(M45,チーム表!C:D,2,FALSE)","v":{"$error":"#N/A"}},"×",{"$f":"組合表!AJ43","v":""},"",null,{"$f":"VLOOKUP(R45,チーム表!C:D,2,FALSE)","v":{"$error":"#N/A"}},{"$nulls":11},"",""]
[41,null,1,{"$nulls":29},{"$f":"I6","v":"D2D1"},{"$f":"IF(J6=\"\",\"\",J6)","v":""}]
[42,null,2,{"$nulls":29},"B2B1",{"$f":"IF(J7=\"\",\"\",J7)","v":""}]
[43,null,3,{"$nulls":29},"E2E1",""]
[44,null,4,{"$nulls":29},"G2G1",""]
[45,null,5,{"$nulls":29},"D4D3",""]
[46,null,6,{"$nulls":29},"B4B3",""]
[47,null,7,{"$nulls":29},"E4E3",""]
[48,null,8,{"$nulls":29},"G4G3",""]
[49,null,9,{"$nulls":29},"D5D1",""]
[50,null,10,{"$nulls":29},"B3B2",""]
[{"$nulls":32},"E3E2",""]
[{"$nulls":32},"G3G2",""]
[{"$nulls":32},"D3D2",""]
[{"$nulls":32},"B4B1",""]
[{"$nulls":32},"E4E1",""]
[{"$nulls":32},"G4G1",""]
[{"$nulls":32},"D5D4",""]
[{"$nulls":32},"B3B1",""]
[{"$nulls":32},"E3E1",""]
[{"$nulls":32},"G3G1",""]
[{"$nulls":32},"D4D1",""]
[{"$nulls":32},"B4B2",""]
[{"$nulls":32},"E4E2",""]
[{"$nulls":32},"G4G2",""]
[{"$nulls":32},"D5D2",""]
[{"$nulls":32},"D4D2",""]
[{"$nulls":32},"",""]
[{"$nulls":32},"",""]
[{"$nulls":32},"",""]
[{"$nulls":32},"",""]
[{"$nulls":32},"",""]
[{"$nulls":32},"",""]
[{"$nulls":32},"",""]
[{"$nulls":32},"",""]
[{"$nulls":32},"",""]
[{"$nulls":32},"",""]
[{"$nulls":32},"",""]
[{"$nulls":32},"",""]
[{"$nulls":32},"",""]
[{"$nulls":32},"",""]
[{"$nulls":32},{"$f":"N6","v":"A1A2"},{"$f":"IF(O6=\"\",\"\",O6)","v":""}]
[{"$nulls":32},"C1C2",{"$f":"IF(O7=\"\",\"\",O7)","v":""}]
[{"$nulls":32},"F1F2",""]
[{"$nulls":32},"H1H2",""]
[{"$nulls":32},"A3A4",""]
[{"$nulls":32},"C3C4",""]
[{"$nulls":32},"F3F4",""]
[{"$nulls":32},"H3H4",""]
[{"$nulls":32},"A2A3",""]
[{"$nulls":32},"C2C3",""]
[{"$nulls":32},"F2F3",""]
[{"$nulls":32},"H2H3",""]
[{"$nulls":32},"A1A4",""]
[{"$nulls":32},"C1C4",""]
[{"$nulls":32},"F1F4",""]
[{"$nulls":32},"H1H4",""]
[{"$nulls":32},"A1A3",""]
[{"$nulls":32},"C1C3",""]
[{"$nulls":32},"F1F3",""]
[{"$nulls":32},"H1H3",""]
[{"$nulls":32},"A2A4",""]
[{"$nulls":32},"C2C4",""]
[{"$nulls":32},"F2F4",""]
[{"$nulls":32},"H2H4",""]
[{"$nulls":32},"D1D3",""]
[{"$nulls":32},"D3D5",""]
[{"$nulls":32},"",""]
[{"$nulls":32},"",""]
[{"$nulls":32},"",""]
[{"$nulls":32},"",""]
[{"$nulls":32},"",""]
[{"$nulls":32},"",""]
[{"$nulls":32},"",""]
[{"$nulls":32},"",""]
[{"$nulls":32},"",""]
[{"$nulls":32},"",""]
[{"$nulls":32},"",""]
[{"$nulls":32},"",""]
[{"$nulls":32},"",""]
[{"$nulls":32},"",""]
[{"$nulls":32},{"$f":"S6","v":"A2A1"},{"$f":"IF(T6=\"\",\"\",T6)","v":""}]
[{"$nulls":32},"C2C1",{"$f":"IF(T7=\"\",\"\",T7)","v":""}]
[{"$nulls":32},"F2F1",""]
[{"$nulls":32},"H2H1",""]
[{"$nulls":32},"A4A3",""]
[{"$nulls":32},"C4C3",""]
[{"$nulls":32},"F4F3",""]
[{"$nulls":32},"H4H3",""]
[{"$nulls":32},"A3A2",""]
[{"$nulls":32},"C3C2",""]
[{"$nulls":32},"F3F2",""]
[{"$nulls":32},"H3H2",""]
[{"$nulls":32},"A4A1",""]
[{"$nulls":32},"C4C1",""]
[{"$nulls":32},"F4F1",""]
[{"$nulls":32},"H4H1",""]
[{"$nulls":32},"A3A1",""]
[{"$nulls":32},"C3C1",""]
[{"$nulls":32},"F3F1",""]
[{"$nulls":32},"H3H1",""]
[{"$nulls":32},"A4A2",""]
[{"$nulls":32},"C4C2",""]
[{"$nulls":32},"F4F2",""]
[{"$nulls":32},"H4H2",""]
[{"$nulls":32},"D3D1",""]
[{"$nulls":32},"D5D3",""]
[{"$nulls":32},"",""]
[{"$nulls":32},"",""]
[{"$nulls":32},"",""]
[{"$nulls":32},"",""]
[{"$nulls":32},"",""]
[{"$nulls":32},"",""]
[{"$nulls":32},"",""]
[{"$nulls":32},"",""]
[{"$nulls":32},"",""]
[{"$nulls":32},"",""]
[{"$nulls":32},"",""]
[{"$nulls":32},"",""]
[{"$nulls":32},"",""]
[{"$nulls":32},"",""]

{"sheet":"対戦表3","index":10,"n_rows":245,"n_cols":34,"rows_kept":245,"merged":[[45,5,45,10],[45,15,45,20],[45,25,45,30],[46,5,46,10],[46,15,46,20],[46,25,46,30],[47,5,47,10],[47,15,47,20],[47,25,47,30],[48,5,48,10],[48,15,48,20],[48,25,48,30],[49,5,49,10],[49,15,49,20],[49,25,49,30],[50,5,50,10],[50,15,50,20],[50,25,50,30],[51,5,51,10],[51,15,51,20],[51,25,51,30],[52,5,52,10],[52,15,52,20],[52,25,52,30],[53,5,53,10],[53,15,53,20],[53,25,53,30],[54,5,54,10],[54,15,54,20],[54,25,54,30]]}
[{"$nulls":15},{"$f":"チーム表!$B$1","v":"第２０回　加賀地域少年少女ドッジボール大会"}]
[]
["　試合スケジュール"]
[]
[null,"時間",null,null,"点","Ａコート",{"$nulls":3},"点","Ａコート",{"$nulls":3},"点","Ｂコート",{"$nulls":3},"点","Ｂコート",{"$nulls":3},"点","Ｃコート",{"$nulls":3},"点","Ｃコート"]
[1,null,{"$f":"組合表!AG4","v":"D1"},{"$f":"CONCATENATE(C6,H6)","v":"D1D2"},null,{"$f":"VLOOKUP(C6,チーム表!C:D,2,FALSE)","v":"飯野マジックス"},"×",{"$f":"組合表!AH4","v":"D2"},{"$f":"CONCATENATE(H6,C6)","v":"D2D1"},null,{"$f":"VLOOKUP(H6,チーム表!C:D,2,FALSE)","v":"三馬パワフル"},null,{"$f":"組合表!AI4","v":"A1"},{"$f":"CONCATENATE(M6,R6)","v":"A1A2"},null,{"$f":"VLOOKUP(M6,チーム表!C:D,2,FALSE)","v":"鞍月アタッカーズ"},"×",{"$f":"組合表!AJ4","v":"A2"},{"$f":"CONCATENATE(R6,M6)","v":"A2A1"},null,{"$f":"VLOOKUP(R6,チーム表!C:D,2,FALSE)","v":"針原パイレーツ"},null,{"$f":"組合表!AK4","v":""},{"$f":"CONCATENATE(W6,AB6)","v":""},null,{"$f":"VLOOKUP(W6,チーム表!C:D,2,FALSE)","v":{"$error":"#N/A"}},{"$f":"Q6","v":"×"},{"$f":"組合表!AL4","v":""},{"$f":"CONCATENATE(AB6,W6)","v":""},null,{"$f":"VLOOKUP(AB6,チーム表!C:D,2,FALSE)","v":{"$error":"#N/A"}},null,{"$f":"D6","v":"D1D2"},{"$f":"IF(E6=\"\",\"\",E6)","v":""}]
[2,null,{"$f":"組合表!AG5","v":"B1"},{"$f":"CONCATENATE(C7,H7)","v":"B1B2"},null,{"$f":"VLOOKUP(C7,チーム表!C:D,2,FALSE)","v":"呉羽ドッジボールクラブ"},"×",{"$f":"組合表!AH5","v":"B2"},{"$f":"CONCATENATE(H7,C7)","v":"B2B1"},null,{"$f":"VLOOKUP(H7,チーム表!C:D,2,FALSE)","v":"鳳至ドッジボールクラブ"},null,{"$f":"組合表!AI5","v":"C1"},{"$f":"CONCATENATE(M7,R7)","v":"C1C2"},null,{"$f":"VLOOKUP(M7,チーム表!C:D,2,FALSE)","v":"光陽マーリンズ"},"×",{"$f":"組合表!AJ5","v":"C2"},{"$f":"CONCATENATE(R7,M7)","v":"C2C1"},null,{"$f":"VLOOKUP(R7,チーム表!C:D,2,FALSE)","v":"中郷ドッジボールクラブ"},null,{"$f":"組合表!AK5","v":""},{"$f":"CONCATENATE(W7,AB7)","v":""},null,{"$f":"VLOOKUP(W7,チーム表!C:D,2,FALSE)","v":{"$error":"#N/A"}},"×",{"$f":"組合表!AL5","v":""},{"$f":"CONCATENATE(AB7,W7)","v":""},null,{"$f":"VLOOKUP(AB7,チーム表!C:D,2,FALSE)","v":{"$error":"#N/A"}},null,"B1B2",{"$f":"IF(E7=\"\",\"\",E7)","v":""}]
[3,null,{"$f":"組合表!AG6","v":"E1"},"E1E2",null,{"$f":"VLOOKUP(C8,チーム表!C:D,2,FALSE)","v":"鞍月アタッカーズジュニア"},"×",{"$f":"組合表!AH6","v":"E2"},"E2E1",null,{"$f":"VLOOKUP(H8,チーム表!C:D,2,FALSE)","v":"鳳至ジュニア"},null,{"$f":"組合表!AI6","v":"F1"},"F1F2",null,{"$f":"VLOOKUP(M8,チーム表!C:D,2,FALSE)","v":"九十九クラブ"},"×",{"$f":"組合表!AJ6","v":"F2"},"F2F1",null,{"$f":"VLOOKUP(R8,チーム表!C:D,2,FALSE)","v":"千坂ロータスルート"},null,{"$f":"組合表!AK6","v":""},"",null,{"$f":"VLOOKUP(W8,チーム表!C:D,2,FALSE)","v":{"$error":"#N/A"}},"×",{"$f":"組合表!AL6","v":""},"",null,{"$f":"VLOOKUP(AB8,チーム表!C:D,2,FALSE)","v":{"$error":"#N/A"}},null,"E1E2",""]
[4,null,{"$f":"組合表!AG7","v":"G1"},"G1G2",null,{"$f":"VLOOKUP(C9,チーム表!C:D,2,FALSE)","v":"鞍月アタッカーズキッズ"},"×",{"$f":"組合表!AH7","v":"G2"},"G2G1",null,{"$f":"VLOOKUP(H9,チーム表!C:D,2,FALSE)","v":"松任の大魔陣Jr."},null,{"$f":"組合表!AI7","v":"H1"},"H1H2",null,{"$f":"VLOOKUP(M9,チーム表!C:D,2,FALSE)","v":"呉羽DBCジュニア"},"×",{"$f":"組合表!AJ7","v":"H2"},"H2H1",null,{"$f":"VLOOKUP(R9,チーム表!C:D,2,FALSE)","v":"NISHI　Jrスターズ"},null,{"$f":"組合表!AK7","v":""},"",null,{"$f":"VLOOKUP(W9,チーム表!C:D,2,FALSE)","v":{"$error":"#N/A"}},"×",{"$f":"組合表!AL7","v":""},"",null,{"$f":"VLOOKUP(AB9,チーム表!C:D,2,FALSE)","v":{"$error":"#N/A"}},null,"G1G2",""]
[5,null,{"$f":"組合表!AG8","v":"D3"},"D3D4",null,{"$f":"VLOOKUP(C10,チーム表!C:D,2,FALSE)","v":"寺井クラブ"},"×",{"$f":"組合表!AH8","v":"D4"},"D4D3",null,{"$f":"VLOOKUP(H10,チーム表!C:D,2,FALSE)","v":"大門ドッジボールクラブ"},null,{"$f":"組合表!AI8","v":"A3"},"A3A4",null,{"$f":"VLOOKUP(M10,チーム表!C:D,2,FALSE)","v":"小木クラブ"},"×",{"$f":"組合表!AJ8","v":"A4"},"A4A3",null,{"$f":"VLOOKUP(R10,チーム表!C:D,2,FALSE)","v":"NISHIファイヤースターズ"},null,{"$f":"組合表!AK8","v":""},"",null,{"$f":"VLOOKUP(W10,チーム表!C:D,2,FALSE)","v":{"$error":"#N/A"}},"×",{"$f":"組合表!AL8","v":""},"",null,{"$f":"VLOOKUP(AB10,チーム表!C:D,2,FALSE)","v":{"$error":"#N/A"}},null,"D3D4",""]
[6,null,{"$f":"組合表!AG9","v":"B3"},"B3B4",null,{"$f":"VLOOKUP(C11,チーム表!C:D,2,FALSE)","v":"千坂ドッジファイヤーズ"},"×",{"$f":"組合表!AH9","v":"B4"},"B4B3",null,{"$f":"VLOOKUP(H11,チーム表!C:D,2,FALSE)","v":"松任の大魔陣"},null,{"$f":"組合表!AI9","v":"C3"},"C3C4",null,{"$f":"VLOOKUP(M11,チーム表!C:D,2,FALSE)","v":"鵜川ミラクルフェニックス"},"×",{"$f":"組合表!AJ9","v":"C4"},"C4C3",null,{"$f":"VLOOKUP(R11,チーム表!C:D,2,FALSE)","v":"向本折クラブA"},null,{"$f":"組合表!AK9","v":""},"",null,{"$f":"VLOOKUP(W11,チーム表!C:D,2,FALSE)","v":{"$error":"#N/A"}},"×",{"$f":"組合表!AL9","v":""},"",null,{"$f":"VLOOKUP(AB11,チーム表!C:D,2,FALSE)","v":{"$error":"#N/A"}},null,"B3B4",""]
[7,null,{"$f":"組合表!AG10","v":"E3"},"E3E4",null,{"$f":"VLOOKUP(C12,チーム表!C:D,2,FALSE)","v":"中郷ミラクルジュニア"},"×",{"$f":"組合表!AH10","v":"E4"},"E4E3",null,{"$f":"VLOOKUP(H12,チーム表!C:D,2,FALSE)","v":"ドッジの王子様"},null,{"$f":"組合表!AI10","v":"F3"},"F3F4",null,{"$f":"VLOOKUP(M12,チーム表!C:D,2,FALSE)","v":"向本折クラブNew"},"×",{"$f":"組合表!AJ10","v":"F4"},"F4F3",null,{"$f":"VLOOKUP(R12,チーム表!C:D,2,FALSE)","v":"寺井クラブＪｒ　A"},null,{"$f":"組合表!AK10","v":""},"",null,{"$f":"VLOOKUP(W12,チーム表!C:D,2,FALSE)","v":{"$error":"#N/A"}},"×",{"$f":"組合表!AL10","v":""},"",null,{"$f":"VLOOKUP(AB12,チーム表!C:D,2,FALSE)","v":{"$error":"#N/A"}},null,"E3E4",""]
[8,null,{"$f":"組合表!AG11","v":"G3"},"G3G4",null,{"$f":"VLOOKUP(C13,チーム表!C:D,2,FALSE)","v":"鵜川フェニックスジュニア"},"×",{"$f":"組合表!AH11","v":"G4"},"G4G3",null,{"$f":"VLOOKUP(H13,チーム表!C:D,2,FALSE)","v":"大門ドッジボールクラブJr"},null,{"$f":"組合表!AI11","v":"H3"},"H3H4",null,{"$f":"VLOOKUP(M13,チーム表!C:D,2,FALSE)","v":"寺井クラブＪｒ　B"},"×",{"$f":"組合表!AJ11","v":"H4"},"H4H3",null,{"$f":"VLOOKUP(R13,チーム表!C:D,2,FALSE)","v":"田上闘球FUTURES"},null,{"$f":"組合表!AK11","v":""},"",null,{"$f":"VLOOKUP(W13,チーム表!C:D,2,FALSE)","v":{"$error":"#N/A"}},{"$f":"Q14","v":"×"},{"$f":"組合表!AL11","v":""},"",null,{"$f":"VLOOKUP(AB13,チーム表!C:D,2,FALSE)","v":{"$error":"#N/A"}},null,"G3G4",""]
[9,null,{"$f":"組合表!AG12","v":"D1"},"D1D5",null,{"$f":"VLOOKUP(C14,チーム表!C:D,2,FALSE)","v":"飯野マジックス"},"×",{"$f":"組合表!AH12","v":"D5"},"D5D1",null,{"$f":"VLOOKUP(H14,チーム表!C:D,2,FALSE)","v":"田上闘球DREAMS"},null,{"$f":"組合表!AI12","v":"A2"},"A2A3",null,{"$f":"VLOOKUP(M14,チーム表!C:D,2,FALSE)","v":"針原パイレーツ"},"×",{"$f":"組合表!AJ12","v":"A3"},"A3A2",null,{"$f":"VLOOKUP(R14,チーム表!C:D,2,FALSE)","v":"小木クラブ"},null,{"$f":"組合表!AK12","v":""},"",null,{"$f":"VLOOKUP(W14,チーム表!C:D,2,FALSE)","v":{"$error":"#N/A"}},{"$f":"Q15","v":"×"},{"$f":"組合表!AL12","v":""},"",null,{"$f":"VLOOKUP(AB14,チーム表!C:D,2,FALSE)","v":{"$error":"#N/A"}},null,"D1D5",""]
[10,null,{"$f":"組合表!AG13","v":"B2"},"B2B3",null,{"$f":"VLOOKUP(C15,チーム表!C:D,2,FALSE)","v":"鳳至ドッジボールクラブ"},"×",{"$f":"組合表!AH13","v":"B3"},"B3B2",null,{"$f":"VLOOKUP(H15,チーム表!C:D,2,FALSE)","v":"千坂ドッジファイヤーズ"},null,{"$f":"組合表!AI13","v":"C2"},"C2C3",null,{"$f":"VLOOKUP(M15,チーム表!C:D,2,FALSE)","v":"中郷ドッジボールクラブ"},"×",{"$f":"組合表!AJ13","v":"C3"},"C3C2",null,{"$f":"VLOOKUP(R15,チーム表!C:D,2,FALSE)","v":"鵜川ミラクルフェニックス"},null,{"$f":"組合表!AK13","v":""},"",null,{"$f":"VLOOKUP(W15,チーム表!C:D,2,FALSE)","v":{"$error":"#N/A"}},{"$f":"Q16","v":"×"},{"$f":"組合表!AL13","v":""},"",null,{"$f":"VLOOKUP(AB15,チーム表!C:D,2,FALSE)","v":{"$error":"#N/A"}},null,"B2B3",""]
[11,null,{"$f":"組合表!AG14","v":"E2"},"E2E3",null,{"$f":"VLOOKUP(C16,チーム表!C:D,2,FALSE)","v":"鳳至ジュニア"},"×",{"$f":"組合表!AH14","v":"E3"},"E3E2",null,{"$f":"VLOOKUP(H16,チーム表!C:D,2,FALSE)","v":"中郷ミラクルジュニア"},null,{"$f":"組合表!AI14","v":"F2"},"F2F3",null,{"$f":"VLOOKUP(M16,チーム表!C:D,2,FALSE)","v":"千坂ロータスルート"},"×",{"$f":"組合表!AJ14","v":"F3"},"F3F2",null,{"$f":"VLOOKUP(R16,チーム表!C:D,2,FALSE)","v":"向本折クラブNew"},null,{"$f":"組合表!AK14","v":""},"",null,{"$f":"VLOOKUP(W16,チーム表!C:D,2,FALSE)","v":{"$error":"#N/A"}},{"$f":"Q17","v":"×"},{"$f":"組合表!AL14","v":""},"",null,{"$f":"VLOOKUP(AB16,チーム表!C:D,2,FALSE)","v":{"$error":"#N/A"}},null,"E2E3",""]
[12,null,{"$f":"組合表!AG15","v":"G2"},"G2G3",null,{"$f":"VLOOKUP(C17,チーム表!C:D,2,FALSE)","v":"松任の大魔陣Jr."},"×",{"$f":"組合表!AH15","v":"G3"},"G3G2",null,{"$f":"VLOOKUP(H17,チーム表!C:D,2,FALSE)","v":"鵜川フェニックスジュニア"},null,{"$f":"組合表!AI15","v":"H2"},"H2H3",null,{"$f":"VLOOKUP(M17,チーム表!C:D,2,FALSE)","v":"NISHI　Jrスターズ"},"×",{"$f":"組合表!AJ15","v":"H3"},"H3H2",null,{"$f":"VLOOKUP(R17,チーム表!C:D,2,FALSE)","v":"寺井クラブＪｒ　B"},null,{"$f":"組合表!AK15","v":""},"",null,{"$f":"VLOOKUP(W17,チーム表!C:D,2,FALSE)","v":{"$error":"#N/A"}},{"$f":"Q19","v":"×"},{"$f":"組合表!AL15","v":""},"",null,{"$f":"VLOOKUP(AB17,チーム表!C:D,2,FALSE)","v":{"$error":"#N/A"}},null,"G2G3",""]
[13,null,{"$f":"組合表!AG16","v":"D2"},"D2D3",null,{"$f":"VLOOKUP(C18,チーム表!C:D,2,FALSE)","v":"三馬パワフル"},"×",{"$f":"組合表!AH16","v":"D3"},"D3D2",null,{"$f":"VLOOKUP(H18,チーム表!C:D,2,FALSE)","v":"寺井クラブ"},null,{"$f":"組合表!AI16","v":"A1"},"A1A4",null,{"$f":"VLOOKUP(M18,チーム表!C:D,2,FALSE)","v":"鞍月アタッカーズ"},"×",{"$f":"組合表!AJ16","v":"A4"},"A4A1",null,{"$f":"VLOOKUP(R18,チーム表!C:D,2,FALSE)","v":"NISHIファイヤースターズ"},null,{"$f":"組合表!AK16","v":""},"",null,{"$f":"VLOOKUP(W18,チーム表!C:D,2,FALSE)","v":{"$error":"#N/A"}},{"$f":"Q29","v":"×"},{"$f":"組合表!AL16","v":""},"",null,{"$f":"VLOOKUP(AB18,チーム表!C:D,2,FALSE)","v":{"$error":"#N/A"}},null,"D2D3",""]
[14,null,{"$f":"組合表!AG17","v":"B1"},"B1B4",null,{"$f":"VLOOKUP(C19,チーム表!C:D,2,FALSE)","v":"呉羽ドッジボールクラブ"},"×",{"$f":"組合表!AH17","v":"B4"},"B4B1",null,{"$f":"VLOOKUP(H19,チーム表!C:D,2,FALSE)","v":"松任の大魔陣"},null,{"$f":"組合表!AI17","v":"C1"},"C1C4",null,{"$f":"VLOOKUP(M19,チーム表!C:D,2,FALSE)","v":"光陽マーリンズ"},"×",{"$f":"組合表!AJ17","v":"C4"},"C4C1",null,{"$f":"VLOOKUP(R19,チーム表!C:D,2,FALSE)","v":"向本折クラブA"},null,{"$f":"組合表!AK17","v":""},"",null,{"$f":"VLOOKUP(W19,チーム表!C:D,2,FALSE)","v":{"$error":"#N/A"}},"×",{"$f":"組合表!AL17","v":""},"",null,{"$f":"VLOOKUP(AB19,チーム表!C:D,2,FALSE)","v":{"$error":"#N/A"}},null,"B1B4",""]
[15,null,{"$f":"組合表!AG18","v":"E1"},"E1E4",null,{"$f":"VLOOKUP(C20,チーム表!C:D,2,FALSE)","v":"鞍月アタッカーズジュニア"},"×",{"$f":"組合表!AH18","v":"E4"},"E4E1",null,{"$f":"VLOOKUP(H20,チーム表!C:D,2,FALSE)","v":"ドッジの王子様"},null,{"$f":"組合表!AI18","v":"F1"},"F1F4",null,{"$f":"VLOOKUP(M20,チーム表!C:D,2,FALSE)","v":"九十九クラブ"},"×",{"$f":"組合表!AJ18","v":"F4"},"F4F1",null,{"$f":"VLOOKUP(R20,チーム表!C:D,2,FALSE)","v":"寺井クラブＪｒ　A"},null,{"$f":"組合表!AK18","v":""},"",null,{"$f":"VLOOKUP(W20,チーム表!C:D,2,FALSE)","v":{"$error":"#N/A"}},"×",{"$f":"組合表!AL18","v":""},"",null,{"$f":"VLOOKUP(AB20,チーム表!C:D,2,FALSE)","v":{"$error":"#N/A"}},null,"E1E4",""]
[16,null,{"$f":"組合表!AG19","v":"G1"},{"$f":"CONCATENATE(C21,H21)","v":"G1G4"},null,{"$f":"VLOOKUP(C21,チーム表!C:D,2,FALSE)","v":"鞍月アタッカーズキッズ"},"×",{"$f":"組合表!AH19","v":"G4"},{"$f":"CONCATENATE(H21,C21)","v":"G4G1"},null,{"$f":"VLOOKUP(H21,チーム表!C:D,2,FALSE)","v":"大門ドッジボールクラブJr"},null,{"$f":"組合表!AI19","v":"H1"},{"$f":"CONCATENATE(M21,R21)","v":"H1H4"},null,{"$f":"VLOOKUP(M21,チーム表!C:D,2,FALSE)","v":"呉羽DBCジュニア"},"×",{"$f":"組合表!AJ19","v":"H4"},{"$f":"CONCATENATE(R21,M21)","v":"H4H1"},null,{"$f":"VLOOKUP(R21,チーム表!C:D,2,FALSE)","v":"田上闘球FUTURES"},null,{"$f":"組合表!AK19","v":""},{"$f":"CONCATENATE(W21,AB21)","v":""},null,{"$f":"VLOOKUP(W21,チーム表!C:D,2,FALSE)","v":{"$error":"#N/A"}},"×",{"$f":"組合表!AL19","v":""},{"$f":"CONCATENATE(AB21,W21)","v":""},null,{"$f":"VLOOKUP(AB21,チーム表!C:D,2,FALSE)","v":{"$error":"#N/A"}},null,"G1G4",""]
[17,null,{"$f":"組合表!AG20","v":"D4"},"D4D5",null,{"$f":"VLOOKUP(C22,チーム表!C:D,2,FALSE)","v":"大門ドッジボールクラブ"},"×",{"$f":"組合表!AH20","v":"D5"},"D5D4",null,{"$f":"VLOOKUP(H22,チーム表!C:D,2,FALSE)","v":"田上闘球DREAMS"},null,{"$f":"組合表!AI20","v":"A1"},"A1A3",null,{"$f":"VLOOKUP(M22,チーム表!C:D,2,FALSE)","v":"鞍月アタッカーズ"},"×",{"$f":"組合表!AJ20","v":"A3"},"A3A1",null,{"$f":"VLOOKUP(R22,チーム表!C:D,2,FALSE)","v":"小木クラブ"},null,{"$f":"組合表!AK20","v":""},"",null,{"$f":"VLOOKUP(W22,チーム表!C:D,2,FALSE)","v":{"$error":"#N/A"}},"×",{"$f":"組合表!AL20","v":""},"",null,{"$f":"VLOOKUP(AB22,チーム表!C:D,2,FALSE)","v":{"$error":"#N/A"}},null,"D4D5",""]
[18,null,{"$f":"組合表!AG21","v":"B1"},"B1B3",null,{"$f":"VLOOKUP(C23,チーム表!C:D,2,FALSE)","v":"呉羽ドッジボールクラブ"},"×",{"$f":"組合表!AH21","v":"B3"},"B3B1",null,{"$f":"VLOOKUP(H23,チーム表!C:D,2,FALSE)","v":"千坂ドッジファイヤーズ"},null,{"$f":"組合表!AI21","v":"C1"},"C1C3",null,{"$f":"VLOOKUP(M23,チーム表!C:D,2,FALSE)","v":"光陽マーリンズ"},"×",{"$f":"組合表!AJ21","v":"C3"},"C3C1",null,{"$f":"VLOOKUP(R23,チーム表!C:D,2,FALSE)","v":"鵜川ミラクルフェニックス"},null,{"$f":"組合表!AK21","v":""},"",null,{"$f":"VLOOKUP(W23,チーム表!C:D,2,FALSE)","v":{"$error":"#N/A"}},"×",{"$f":"組合表!AL21","v":""},"",null,{"$f":"VLOOKUP(AB23,チーム表!C:D,2,FALSE)","v":{"$error":"#N/A"}},null,"B1B3",""]
[19,null,{"$f":"組合表!AG22","v":"E1"},"E1E3",null,{"$f":"VLOOKUP(C24,チーム表!C:D,2,FALSE)","v":"鞍月アタッカーズジュニア"},"×",{"$f":"組合表!AH22","v":"E3"},"E3E1",null,{"$f":"VLOOKUP(H24,チーム表!C:D,2,FALSE)","v":"中郷ミラクルジュニア"},null,{"$f":"組合表!AI22","v":"F1"},"F1F3",null,{"$f":"VLOOKUP(M24,チーム表!C:D,2,FALSE)","v":"九十九クラブ"},"×",{"$f":"組合表!AJ22","v":"F3"},"F3F1",null,{"$f":"VLOOKUP(R24,チーム表!C:D,2,FALSE)","v":"向本折クラブNew"},null,{"$f":"組合表!AK22","v":""},"",null,{"$f":"VLOOKUP(W24,チーム表!C:D,2,FALSE)","v":{"$error":"#N/A"}},"×",{"$f":"組合表!AL22","v":""},"",null,{"$f":"VLOOKUP(AB24,チーム表!C:D,2,FALSE)","v":{"$error":"#N/A"}},null,"E1E3",""]
[20,null,{"$f":"組合表!AG23","v":"G1"},"G1G3",null,{"$f":"VLOOKUP(C25,チーム表!C:D,2,FALSE)","v":"鞍月アタッカーズキッズ"},"×",{"$f":"組合表!AH23","v":"G3"},"G3G1",null,{"$f":"VLOOKUP(H25,チーム表!C:D,2,FALSE)","v":"鵜川フェニックスジュニア"},null,{"$f":"組合表!AI23","v":"H1"},"H1H3",null,{"$f":"VLOOKUP(M25,チーム表!C:D,2,FALSE)","v":"呉羽DBCジュニア"},"×",{"$f":"組合表!AJ23","v":"H3"},"H3H1",null,{"$f":"VLOOKUP(R25,チーム表!C:D,2,FALSE)","v":"寺井クラブＪｒ　B"},null,{"$f":"組合表!AK23","v":""},"",null,{"$f":"VLOOKUP(W25,チーム表!C:D,2,FALSE)","v":{"$error":"#N/A"}},"×",{"$f":"組合表!AL23","v":""},"",null,{"$f":"VLOOKUP(AB25,チーム表!C:D,2,FALSE)","v":{"$error":"#N/A"}},null,"G1G3",""]
[21,null,{"$f":"組合表!AG24","v":"D1"},"D1D4",null,{"$f":"VLOOKUP(C26,チーム表!C:D,2,FALSE)","v":"飯野マジックス"},"×",{"$f":"組合表!AH24","v":"D4"},"D4D1",null,{"$f":"VLOOKUP(H26,チーム表!C:D,2,FALSE)","v":"大門ドッジボールクラブ"},null,{"$f":"組合表!AI24","v":"A2"},"A2A4",null,{"$f":"VLOOKUP(M26,チーム表!C:D,2,FALSE)","v":"針原パイレーツ"},"×",{"$f":"組合表!AJ24","v":"A4"},"A4A2",null,{"$f":"VLOOKUP(R26,チーム表!C:D,2,FALSE)","v":"NISHIファイヤースターズ"},null,{"$f":"組合表!AK24","v":""},"",null,{"$f":"VLOOKUP(W26,チーム表!C:D,2,FALSE)","v":{"$error":"#N/A"}},"×",{"$f":"組合表!AL24","v":""},"",null,{"$f":"VLOOKUP(AB26,チーム表!C:D,2,FALSE)","v":{"$error":"#N/A"}},null,"D1D4",""]
[22,null,{"$f":"組合表!AG25","v":"B2"},"B2B4",null,{"$f":"VLOOKUP(C27,チーム表!C:D,2,FALSE)","v":"鳳至ドッジボールクラブ"},"×",{"$f":"組合表!AH25","v":"B4"},"B4B2",null,{"$f":"VLOOKUP(H27,チーム表!C:D,2,FALSE)","v":"松任の大魔陣"},null,{"$f":"組合表!AI25","v":"C2"},"C2C4",null,{"$f":"VLOOKUP(M27,チーム表!C:D,2,FALSE)","v":"中郷ドッジボールクラブ"},"×",{"$f":"組合表!AJ25","v":"C4"},"C4C2",null,{"$f":"VLOOKUP(R27,チーム表!C:D,2,FALSE)","v":"向本折クラブA"},null,{"$f":"組合表!AK25","v":""},"",null,{"$f":"VLOOKUP(W27,チーム表!C:D,2,FALSE)","v":{"$error":"#N/A"}},"×",{"$f":"組合表!AL25","v":""},"",null,{"$f":"VLOOKUP(AB27,チーム表!C:D,2,FALSE)","v":{"$error":"#N/A"}},null,"B2B4",""]
[23,null,{"$f":"組合表!AG26","v":"E2"},"E2E4",null,{"$f":"VLOOKUP(C28,チーム表!C:D,2,FALSE)","v":"鳳至ジュニア"},"×",{"$f":"組合表!AH26","v":"E4"},"E4E2",null,{"$f":"VLOOKUP(H28,チーム表!C:D,2,FALSE)","v":"ドッジの王子様"},null,{"$f":"組合表!AI26","v":"F2"},"F2F4",null,{"$f":"VLOOKUP(M28,チーム表!C:D,2,FALSE)","v":"千坂ロータスルート"},"×",{"$f":"組合表!AJ26","v":"F4"},"F4F2",null,{"$f":"VLOOKUP(R28,チーム表!C:D,2,FALSE)","v":"寺井クラブＪｒ　A"},null,{"$f":"組合表!AK26","v":""},"",null,{"$f":"VLOOKUP(W28,チーム表!C:D,2,FALSE)","v":{"$error":"#N/A"}},"×",{"$f":"組合表!AL26","v":""},"",null,{"$f":"VLOOKUP(AB28,チーム表!C:D,2,FALSE)","v":{"$error":"#N/A"}},null,"E2E4",""]
[24,null,{"$f":"組合表!AG27","v":"G2"},"G2G4",null,{"$f":"VLOOKUP(C29,チーム表!C:D,2,FALSE)","v":"松任の大魔陣Jr."},"×",{"$f":"組合表!AH27","v":"G4"},"G4G2",null,{"$f":"VLOOKUP(H29,チーム表!C:D,2,FALSE)","v":"大門ドッジボールクラブJr"},null,{"$f":"組合表!AI27","v":"H2"},"H2H4",null,{"$f":"VLOOKUP(M29,チーム表!C:D,2,FALSE)","v":"NISHI　Jrスターズ"},"×",{"$f":"組合表!AJ27","v":"H4"},"H4H2",null,{"$f":"VLOOKUP(R29,チーム表!C:D,2,FALSE)","v":"田上闘球FUTURES"},null,{"$f":"組合表!AK27","v":""},"",null,{"$f":"VLOOKUP(W29,チーム表!C:D,2,FALSE)","v":{"$error":"#N/A"}},"×",{"$f":"組合表!AL27","v":""},"",null,{"$f":"VLOOKUP(AB29,チーム表!C:D,2,FALSE)","v":{"$error":"#N/A"}},null,"G2G4",""]
[25,null,{"$f":"組合表!AG28","v":"D2"},"D2D5",null,{"$f":"VLOOKUP(C30,チーム表!C:D,2,FALSE)","v":"三馬パワフル"},"×",{"$f":"組合表!AH28","v":"D5"},"D5D2",null,{"$f":"VLOOKUP(H30,チーム表!C:D,2,FALSE)","v":"田上闘球DREAMS"},null,{"$f":"組合表!AI28","v":"D1"},"D1D3",null,{"$f":"VLOOKUP(M30,チーム表!C:D,2,FALSE)","v":"飯野マジックス"},"×",{"$f":"組合表!AJ28","v":"D3"},"D3D1",null,{"$f":"VLOOKUP(R30,チーム表!C:D,2,FALSE)","v":"寺井クラブ"},null,{"$f":"組合表!AK28","v":""},"",null,{"$f":"VLOOKUP(W30,チーム表!C:D,2,FALSE)","v":{"$error":"#N/A"}},"×",{"$f":"組合表!AL28","v":""},"",null,{"$f":"VLOOKUP(AB30,チーム表!C:D,2,FALSE)","v":{"$error":"#N/A"}},null,"D2D5",""]
[26,null,{"$f":"組合表!AG29","v":"D2"},{"$f":"CONCATENATE(C31,H31)","v":"D2D4"},null,{"$f":"VLOOKUP(C31,チーム表!C:D,2,FALSE)","v":"三馬パワフル"},"×",{"$f":"組合表!AH29","v":"D4"},{"$f":"CONCATENATE(H31,C31)","v":"D4D2"},null,{"$f":"VLOOKUP(H31,チーム表!C:D,2,FALSE)","v":"大門ドッジボールクラブ"},null,{"$f":"組合表!AI29","v":"D3"},{"$f":"CONCATENATE(M31,R31)","v":"D3D5"},null,{"$f":"VLOOKUP(M31,チーム表!C:D,2,FALSE)","v":"寺井クラブ"},"×",{"$f":"組合表!AJ29","v":"D5"},{"$f":"CONCATENATE(R31,M31)","v":"D5D3"},null,{"$f":"VLOOKUP(R31,チーム表!C:D,2,FALSE)","v":"田上闘球DREAMS"},null,{"$f":"組合表!AK29","v":""},{"$f":"CONCATENATE(W31,AB31)","v":""},null,{"$f":"VLOOKUP(W31,チーム表!C:D,2,FALSE)","v":{"$error":"#N/A"}},"×",{"$f":"組合表!AL29","v":""},{"$f":"CONCATENATE(AB31,W31)","v":""},null,{"$f":"VLOOKUP(AB31,チーム表!C:D,2,FALSE)","v":{"$error":"#N/A"}},null,"D2D4",""]
[27,null,{"$f":"組合表!AG30","v":""},"",null,{"$f":"VLOOKUP(C32,チーム表!C:D,2,FALSE)","v":{"$error":"#N/A"}},"×",{"$f":"組合表!AH30","v":""},"",null,{"$f":"VLOOKUP(H32,チーム表!C:D,2,FALSE)","v":{"$error":"#N/A"}},null,{"$f":"組合表!AI30","v":""},"",null,{"$f":"VLOOKUP(M32,チーム表!C:D,2,FALSE)","v":{"$error":"#N/A"}},"×",{"$f":"組合表!AJ30","v":""},"",null,{"$f":"VLOOKUP(R32,チーム表!C:D,2,FALSE)","v":{"$error":"#N/A"}},null,{"$f":"組合表!AK30","v":""},"",null,{"$f":"VLOOKUP(W32,チーム表!C:D,2,FALSE)","v":{"$error":"#N/A"}},"×",{"$f":"組合表!AL30","v":""},"",null,{"$f":"VLOOKUP(AB32,チーム表!C:D,2,FALSE)","v":{"$error":"#N/A"}},null,"",""]
[28,null,{"$f":"組合表!AG31","v":""},"",null,{"$f":"VLOOKUP(C33,チーム表!C:D,2,FALSE)","v":{"$error":"#N/A"}},"×",{"$f":"組合表!AH31","v":""},"",null,{"$f":"VLOOKUP(H33,チーム表!C:D,2,FALSE)","v":{"$error":"#N/A"}},null,{"$f":"組合表!AI31","v":""},"",null,{"$f":"VLOOKUP(M33,チーム表!C:D,2,FALSE)","v":{"$error":"#N/A"}},"×",{"$f":"組合表!AJ31","v":""},"",null,{"$f":"VLOOKUP(R33,チーム表!C:D,2,FALSE)","v":{"$error":"#N/A"}},null,{"$f":"組合表!AK31","v":""},"",null,{"$f":"VLOOKUP(W33,チーム表!C:D,2,FALSE)","v":{"$error":"#N/A"}},"×",{"$f":"組合表!AL31","v":""},"",null,{"$f":"VLOOKUP(AB33,チーム表!C:D,2,FALSE)","v":{"$error":"#N/A"}},null,"",""]
[29,null,{"$f":"組合表!AG32","v":""},"",null,{"$f":"VLOOKUP(C34,チーム表!C:D,2,FALSE)","v":{"$error":"#N/A"}},"×",{"$f":"組合表!AH32","v":""},"",null,{"$f":"VLOOKUP(H34,チーム表!C:D,2,FALSE)","v":{"$error":"#N/A"}},null,{"$f":"組合表!AI32","v":""},"",null,{"$f":"VLOOKUP(M34,チーム表!C:D,2,FALSE)","v":{"$error":"#N/A"}},"×",{"$f":"組合表!AJ32","v":""},"",null,{"$f":"VLOOKUP(R34,チーム表!C:D,2,FALSE)","v":{"$error":"#N/A"}},null,{"$f":"組合表!AK32","v":""},"",null,{"$f":"VLOOKUP(W34,チーム表!C:D,2,FALSE)","v":{"$error":"#N/A"}},"×",{"$f":"組合表!AL32","v":""},"",null,{"$f":"VLOOKUP(AB34,チーム表!C:D,2,FALSE)","v":{"$error":"#N/A"}},null,"",""]
[30,null,{"$f":"組合表!AG33","v":""},"",null,{"$f":"VLOOKUP(C35,チーム表!C:D,2,FALSE)","v":{"$error":"#N/A"}},"×",{"$f":"組合表!AH33","v":""},"",null,{"$f":"VLOOKUP(H35,チーム表!C:D,2,FALSE)","v":{"$error":"#N/A"}},null,{"$f":"組合表!AI33","v":""},"",null,{"$f":"VLOOKUP(M35,チーム表!C:D,2,FALSE)","v":{"$error":"#N/A"}},"×",{"$f":"組合表!AJ33","v":""},"",null,{"$f":"VLOOKUP(R35,チーム表!C:D,2,FALSE)","v":{"$error":"#N/A"}},null,{"$f":"組合表!AK33","v":""},"",null,{"$f":"VLOOKUP(W35,チーム表!C:D,2,FALSE)","v":{"$error":"#N/A"}},"×",{"$f":"組合表!AL33","v":""},"",null,{"$f":"VLOOKUP(AB35,チーム表!C:D,2,FALSE)","v":{"$error":"#N/A"}},null,"",""]
[31,null,{"$f":"組合表!AG34","v":""},"",null,{"$f":"VLOOKUP(C36,チーム表!C:D,2,FALSE)","v":{"$error":"#N/A"}},"×",{"$f":"組合表!AH34","v":""},"",null,{"$f":"VLOOKUP(H36,チーム表!C:D,2,FALSE)","v":{"$error":"#N/A"}},null,{"$f":"組合表!AI34","v":""},"",null,{"$f":"VLOOKUP(M36,チーム表!C:D,2,FALSE)","v":{"$error":"#N/A"}},"×",{"$f":"組合表!AJ34","v":""},"",null,{"$f":"VLOOKUP(R36,チーム表!C:D,2,FALSE)","v":{"$error":"#N/A"}},null,{"$f":"組合表!AK34","v":""},"",null,{"$f":"VLOOKUP(W36,チーム表!C:D,2,FALSE)","v":{"$error":"#N/A"}},"×",{"$f":"組合表!AL34","v":""},"",null,{"$f":"VLOOKUP(AB36,チーム表!C:D,2,FALSE)","v":{"$error":"#N/A"}},null,"",""]
[32,null,{"$f":"組合表!AG35","v":""},"",null,{"$f":"VLOOKUP(C37,チーム表!C:D,2,FALSE)","v":{"$error":"#N/A"}},"×",{"$f":"組合表!AH35","v":""},"",null,{"$f":"VLOOKUP(H37,チーム表!C:D,2,FALSE)","v":{"$error":"#N/A"}},null,{"$f":"組合表!AI35","v":""},"",null,{"$f":"VLOOKUP(M37,チーム表!C:D,2,FALSE)","v":{"$error":"#N/A"}},"×",{"$f":"組合表!AJ35","v":""},"",null,{"$f":"VLOOKUP(R37,チーム表!C:D,2,FALSE)","v":{"$error":"#N/A"}},null,{"$f":"組合表!AK35","v":""},"",null,{"$f":"VLOOKUP(W37,チーム表!C:D,2,FALSE)","v":{"$error":"#N/A"}},"×",{"$f":"組合表!AL35","v":""},"",null,{"$f":"VLOOKUP(AB37,チーム表!C:D,2,FALSE)","v":{"$error":"#N/A"}},null,"",""]
[33,null,{"$f":"組合表!AG36","v":""},"",null,{"$f":"VLOOKUP(C38,チーム表!C:D,2,FALSE)","v":{"$error":"#N/A"}},"×",{"$f":"組合表!AH36","v":""},"",null,{"$f":"VLOOKUP(H38,チーム表!C:D,2,FALSE)","v":{"$error":"#N/A"}},null,{"$f":"組合表!AI36","v":""},"",null,{"$f":"VLOOKUP(M38,チーム表!C:D,2,FALSE)","v":{"$error":"#N/A"}},"×",{"$f":"組合表!AJ36","v":""},"",null,{"$f":"VLOOKUP(R38,チーム表!C:D,2,FALSE)","v":{"$error":"#N/A"}},null,{"$f":"組合表!AK36","v":""},"",null,{"$f":"VLOOKUP(W38,チーム表!C:D,2,FALSE)","v":{"$error":"#N/A"}},"×",{"$f":"組合表!AL36","v":""},"",null,{"$f":"VLOOKUP(AB38,チーム表!C:D,2,FALSE)","v":{"$error":"#N/A"}},null,"",""]
[34,null,{"$f":"組合表!AG37","v":""},{"$f":"CONCATENATE(C39,H39)","v":""},null,{"$f":"VLOOKUP(C39,チーム表!C:D,2,FALSE)","v":{"$error":"#N/A"}},"×",{"$f":"組合表!AH37","v":""},{"$f":"CONCATENATE(H39,C39)","v":""},null,{"$f":"VLOOKUP(H39,チーム表!C:D,2,FALSE)","v":{"$error":"#N/A"}},null,{"$f":"組合表!AI37","v":""},{"$f":"CONCATENATE(M39,R39)","v":""},null,{"$f":"VLOOKUP(M39,チーム表!C:D,2,FALSE)","v":{"$error":"#N/A"}},"×",{"$f":"組合表!AJ37","v":""},{"$f":"CONCATENATE(R39,M39)","v":""},null,{"$f":"VLOOKUP(R39,チーム表!C:D,2,FALSE)","v":{"$error":"#N/A"}},null,{"$f":"組合表!AK37","v":""},{"$f":"CONCATENATE(W39,AB39)","v":""},null,{"$f":"VLOOKUP(W39,チーム表!C:D,2,FALSE)","v":{"$error":"#N/A"}},"×",{"$f":"組合表!AL37","v":""},{"$f":"CONCATENATE(AB39,W39)","v":""},null,{"$f":"VLOOKUP(AB39,チーム表!C:D,2,FALSE)","v":{"$error":"#N/A"}},null,"",""]
[35,null,{"$f":"組合表!AG38","v":""},{"$f":"CONCATENATE(C40,H40)","v":""},null,{"$f":"VLOOKUP(C40,チーム表!C:D,2,FALSE)","v":{"$error":"#N/A"}},"×",{"$f":"組合表!AH38","v":""},{"$f":"CONCATENATE(H40,C40)","v":""},null,{"$f":"VLOOKUP(H40,チーム表!C:D,2,FALSE)","v":{"$error":"#N/A"}},null,{"$f":"組合表!AI38","v":""},{"$f":"CONCATENATE(M40,R40)","v":""},null,{"$f":"VLOOKUP(M40,チーム表!C:D,2,FALSE)","v":{"$error":"#N/A"}},"×",{"$f":"組合表!AJ38","v":""},{"$f":"CONCATENATE(R40,M40)","v":""},null,{"$f":"VLOOKUP(R40,チーム表!C:D,2,FALSE)","v":{"$error":"#N/A"}},null,{"$f":"組合表!AK38","v":""},{"$f":"CONCATENATE(W40,AB40)","v":""},null,{"$f":"VLOOKUP(W40,チーム表!C:D,2,FALSE)","v":{"$error":"#N/A"}},"×",{"$f":"組合表!AL38","v":""},{"$f":"CONCATENATE(AB40,W40)","v":""},null,{"$f":"VLOOKUP(AB40,チーム表!C:D,2,FALSE)","v":{"$error":"#N/A"}},null,"",""]
[36,null,{"$f":"組合表!AG39","v":""},{"$f":"CONCATENATE(C41,H41)","v":""},null,{"$f":"VLOOKUP(C41,チーム表!C:D,2,FALSE)","v":{"$error":"#N/A"}},"×",{"$f":"組合表!AH39","v":""},{"$f":"CONCATENATE(H41,C41)","v":""},null,{"$f":"VLOOKUP(H41,チーム表!C:D,2,FALSE)","v":{"$error":"#N/A"}},null,{"$f":"組合表!AI39","v":""},{"$f":"CONCATENATE(M41,R41)","v":""},null,{"$f":"VLOOKUP(M41,チーム表!C:D,2,FALSE)","v":{"$error":"#N/A"}},"×",{"$f":"組合表!AJ39","v":""},{"$f":"CONCATENATE(R41,M41)","v":""},null,{"$f":"VLOOKUP(R41,チーム表!C:D,2,FALSE)","v":{"$error":"#N/A"}},null,{"$f":"組合表!AK39","v":""},{"$f":"CONCATENATE(W41,AB41)","v":""},null,{"$f":"VLOOKUP(W41,チーム表!C:D,2,FALSE)","v":{"$error":"#N/A"}},"×",{"$f":"組合表!AL39","v":""},{"$f":"CONCATENATE(AB41,W41)","v":""},null,{"$f":"VLOOKUP(AB41,チーム表!C:D,2,FALSE)","v":{"$error":"#N/A"}},null,"",""]
[37,null,{"$f":"組合表!AG40","v":""},"",null,{"$f":"VLOOKUP(C42,チーム表!C:D,2,FALSE)","v":{"$error":"#N/A"}},"×",{"$f":"組合表!AH40","v":""},"",null,{"$f":"VLOOKUP(H42,チーム表!C:D,2,FALSE)","v":{"$error":"#N/A"}},null,{"$f":"組合表!AI40","v":""},"",null,{"$f":"VLOOKUP(M42,チーム表!C:D,2,FALSE)","v":{"$error":"#N/A"}},"×",{"$f":"組合表!AJ40","v":""},"",null,{"$f":"VLOOKUP(R42,チーム表!C:D,2,FALSE)","v":{"$error":"#N/A"}},null,{"$f":"組合表!AK40","v":""},"",null,{"$f":"VLOOKUP(W42,チーム表!C:D,2,FALSE)","v":{"$error":"#N/A"}},"×",{"$f":"組合表!AL40","v":""},"",null,{"$f":"VLOOKUP(AB42,チーム表!C:D,2,FALSE)","v":{"$error":"#N/A"}},null,"",""]
[38,null,{"$f":"組合表!AG41","v":""},"",null,{"$f":"VLOOKUP(C43,チーム表!C:D,2,FALSE)","v":{"$error":"#N/A"}},"×",{"$f":"組合表!AH41","v":""},"",null,{"$f":"VLOOKUP(H43,チーム表!C:D,2,FALSE)","v":{"$error":"#N/A"}},null,{"$f":"組合表!AI41","v":""},"",null,{"$f":"VLOOKUP(M43,チーム表!C:D,2,FALSE)","v":{"$error":"#N/A"}},"×",{"$f":"組合表!AJ41","v":""},"",null,{"$f":"VLOOKUP(R43,チーム表!C:D,2,FALSE)","v":{"$error":"#N/A"}},null,{"$f":"組合表!AK41","v":""},"",null,{"$f":"VLOOKUP(W43,チーム表!C:D,2,FALSE)","v":{"$error":"#N/A"}},"×",{"$f":"組合表!AL41","v":""},"",null,{"$f":"VLOOKUP(AB43,チーム表!C:D,2,FALSE)","v":{"$error":"#N/A"}},null,"",""]
[39,null,{"$f":"組合表!AG42","v":""},"",null,{"$f":"VLOOKUP(C44,チーム表!C:D,2,FALSE)","v":{"$error":"#N/A"}},"×",{"$f":"組合表!AH42","v":""},"",null,{"$f":"VLOOKUP(H44,チーム表!C:D,2,FALSE)","v":{"$error":"#N/A"}},null,{"$f":"組合表!AI42","v":""},"",null,{"$f":"VLOOKUP(M44,チーム表!C:D,2,FALSE)","v":{"$error":"#N/A"}},"×",{"$f":"組合表!AJ42","v":""},"",null,{"$f":"VLOOKUP(R44,チーム表!C:D,2,FALSE)","v":{"$error":"#N/A"}},null,{"$f":"組合表!AK42","v":""},"",null,{"$f":"VLOOKUP(W44,チーム表!C:D,2,FALSE)","v":{"$error":"#N/A"}},"×",{"$f":"組合表!AL42","v":""},"",null,{"$f":"VLOOKUP(AB44,チーム表!C:D,2,FALSE)","v":{"$error":"#N/A"}},null,"",""]
[40,null,{"$f":"組合表!AG43","v":""},"",null,{"$f":"VLOOKUP(C45,チーム表!C:D,2,FALSE)","v":{"$error":"#N/A"}},"×",{"$f":"組合表!AH43","v":""},"",null,{"$f":"VLOOKUP(H45,チーム表!C:D,2,FALSE)","v":{"$error":"#N/A"}},null,{"$f":"組合表!AI43","v":""},"",null,{"$f":"VLOOKUP(M45,チーム表!C:D,2,FALSE)","v":{"$error":"#N/A"}},"×",{"$f":"組合表!AJ43","v":""},"",null,{"$f":"VLOOKUP(R45,チーム表!C:D,2,FALSE)","v":{"$error":"#N/A"}},null,{"$f":"組合表!AK43","v":""},"",null,{"$f":"VLOOKUP(W45,チーム表!C:D,2,FALSE)","v":{"$error":"#N/A"}},"×",{"$f":"組合表!AL43","v":""},"",null,{"$f":"VLOOKUP(AB45,チーム表!C:D,2,FALSE)","v":{"$error":"#N/A"}},null,"",""]
[41,null,1,{"$nulls":29},{"$f":"I6","v":"D2D1"},{"$f":"IF(J6=\"\",\"\",J6)","v":""}]
[42,null,2,{"$nulls":29},"B2B1",{"$f":"IF(J7=\"\",\"\",J7)","v":""}]
[43,null,3,{"$nulls":29},"E2E1",""]
[44,null,4,{"$nulls":29},"G2G1",""]
[45,null,5,{"$nulls":29},"D4D3",""]
[46,null,6,{"$nulls":29},"B4B3",""]
[47,null,7,{"$nulls":29},"E4E3",""]
[48,null,8,{"$nulls":29},"G4G3",""]
[49,null,9,{"$nulls":29},"D5D1",""]
[50,null,10,{"$nulls":29},"B3B2",""]
[{"$nulls":32},"E3E2",""]
[{"$nulls":32},"G3G2",""]
[{"$nulls":32},"D3D2",""]
[{"$nulls":32},"B4B1",""]
[{"$nulls":32},"E4E1",""]
[{"$nulls":32},"G4G1",""]
[{"$nulls":32},"D5D4",""]
[{"$nulls":32},"B3B1",""]
[{"$nulls":32},"E3E1",""]
[{"$nulls":32},"G3G1",""]
[{"$nulls":32},"D4D1",""]
[{"$nulls":32},"B4B2",""]
[{"$nulls":32},"E4E2",""]
[{"$nulls":32},"G4G2",""]
[{"$nulls":32},"D5D2",""]
[{"$nulls":32},"D4D2",""]
[{"$nulls":32},"",""]
[{"$nulls":32},"",""]
[{"$nulls":32},"",""]
[{"$nulls":32},"",""]
[{"$nulls":32},"",""]
[{"$nulls":32},"",""]
[{"$nulls":32},"",""]
[{"$nulls":32},"",""]
[{"$nulls":32},"",""]
[{"$nulls":32},"",""]
[{"$nulls":32},"",""]
[{"$nulls":32},"",""]
[{"$nulls":32},"",""]
[{"$nulls":32},"",""]
[{"$nulls":32},{"$f":"N6","v":"A1A2"},{"$f":"IF(O6=\"\",\"\",O6)","v":""}]
[{"$nulls":32},"C1C2",{"$f":"IF(O7=\"\",\"\",O7)","v":""}]
[{"$nulls":32},"F1F2",""]
[{"$nulls":32},"H1H2",""]
[{"$nulls":32},"A3A4",""]
[{"$nulls":32},"C3C4",""]
[{"$nulls":32},"F3F4",""]
[{"$nulls":32},"H3H4",""]
[{"$nulls":32},"A2A3",""]
[{"$nulls":32},"C2C3",""]
[{"$nulls":32},"F2F3",""]
[{"$nulls":32},"H2H3",""]
[{"$nulls":32},"A1A4",""]
[{"$nulls":32},"C1C4",""]
[{"$nulls":32},"F1F4",""]
[{"$nulls":32},"H1H4",""]
[{"$nulls":32},"A1A3",""]
[{"$nulls":32},"C1C3",""]
[{"$nulls":32},"F1F3",""]
[{"$nulls":32},"H1H3",""]
[{"$nulls":32},"A2A4",""]
[{"$nulls":32},"C2C4",""]
[{"$nulls":32},"F2F4",""]
[{"$nulls":32},"H2H4",""]
[{"$nulls":32},"D1D3",""]
[{"$nulls":32},"D3D5",""]
[{"$nulls":32},"",""]
[{"$nulls":32},"",""]
[{"$nulls":32},"",""]
[{"$nulls":32},"",""]
[{"$nulls":32},"",""]
[{"$nulls":32},"",""]
[{"$nulls":32},"",""]
[{"$nulls":32},"",""]
[{"$nulls":32},"",""]
[{"$nulls":32},"",""]
[{"$nulls":32},"",""]
[{"$nulls":32},"",""]
[{"$nulls":32},"",""]
[{"$nulls":32},"",""]
[{"$nulls":32},{"$f":"S6","v":"A2A1"},{"$f":"IF(T6=\"\",\"\",T6)","v":""}]
[{"$nulls":32},"C2C1",{"$f":"IF(T7=\"\",\"\",T7)","v":""}]
[{"$nulls":32},"F2F1",""]
[{"$nulls":32},"H2H1",""]
[{"$nulls":32},"A4A3",""]
[{"$nulls":32},"C4C3",""]
[{"$nulls":32},"F4F3",""]
[{"$nulls":32},"H4H3",""]
[{"$nulls":32},"A3A2",""]
[{"$nulls":32},"C3C2",""]
[{"$nulls":32},"F3F2",""]
[{"$nulls":32},"H3H2",""]
[{"$nulls":32},"A4A1",""]
[{"$nulls":32},"C4C1",""]
[{"$nulls":32},"F4F1",""]
[{"$nulls":32},"H4H1",""]
[{"$nulls":32},"A3A1",""]
[{"$nulls":32},"C3C1",""]
[{"$nulls":32},"F3F1",""]
[{"$nulls":32},"H3H1",""]
[{"$nulls":32},"A4A2",""]
[{"$nulls":32},"C4C2",""]
[{"$nulls":32},"F4F2",""]
[{"$nulls":32},"H4H2",""]
[{"$nulls":32},"D3D1",""]
[{"$nulls":32},"D5D3",""]
[{"$nulls":32},"",""]
[{"$nulls":32},"",""]
[{"$nulls":32},"",""]
[{"$nulls":32},"",""]
[{"$nulls":32},"",""]
[{"$nulls":32},"",""]
[{"$nulls":32},"",""]
[{"$nulls":32},"",""]
[{"$nulls":32},"",""]
[{"$nulls":32},"",""]
[{"$nulls":32},"",""]
[{"$nulls":32},"",""]
[{"$nulls":32},"",""]
[{"$nulls":32},"",""]
[{"$nulls":32},{"$f":"X6","v":""},{"$f":"IF(Y6=\"\",\"\",Y6)","v":""}]
[{"$nulls":32},"",{"$f":"IF(Y7=\"\",\"\",Y7)","v":""}]
[{"$nulls":32},"",""]
[{"$nulls":32},"",""]
[{"$nulls":32},"",""]
[{"$nulls":32},"",""]
[{"$nulls":32},"",""]
[{"$nulls":32},"",""]
[{"$nulls":32},"",""]
[{"$nulls":32},"",""]
[{"$nulls":32},"",""]
[{"$nulls":32},"",""]
[{"$nulls":32},"",""]
[{"$nulls":32},"",""]
[{"$nulls":32},"",""]
[{"$nulls":32},"",""]
[{"$nulls":32},"",""]
[{"$nulls":32},"",""]
[{"$nulls":32},"",""]
[{"$nulls":32},"",""]
[{"$nulls":32},"",""]
[{"$nulls":32},"",""]
[{"$nulls":32},"",""]
[{"$nulls":32},"",""]
[{"$nulls":32},"",""]
[{"$nulls":32},"",""]
[{"$nulls":32},"",""]
[{"$nulls":32},"",""]
[{"$nulls":32},"",""]
[{"$nulls":32},"",""]
[{"$nulls":32},"",""]
[{"$nulls":32},"",""]
[{"$nulls":32},"",""]
[{"$nulls":32},"",""]
[{"$nulls":32},"",""]
[{"$nulls":32},"",""]
[{"$nulls":32},"",""]
[{"$nulls":32},"",""]
[{"$nulls":32},"",""]
[{"$nulls":32},"",""]
[{"$nulls":32},{"$f":"AC6","v":""},{"$f":"IF(AD6=\"\",\"\",AD6)","v":""}]
[{"$nulls":32},"",{"$f":"IF(AD7=\"\",\"\",AD7)","v":""}]
[{"$nulls":32},"",""]
[{"$nulls":32},"",""]
[{"$nulls":32},"",""]
[{"$nulls":32},"",""]
[{"$nulls":32},"",""]
[{"$nulls":32},"",""]
[{"$nulls":32},"",""]
[{"$nulls":32},"",""]
[{"$nulls":32},"",""]
[{"$nulls":32},"",""]
[{"$nulls":32},"",""]
[{"$nulls":32},"",""]
[{"$nulls":32},"",""]
[{"$nulls":32},"",""]
[{"$nulls":32},"",""]
[{"$nulls":32},"",""]
[{"$nulls":32},"",""]
[{"$nulls":32},"",""]
[{"$nulls":32},"",""]
[{"$nulls":32},"",""]
[{"$nulls":32},"",""]
[{"$nulls":32},"",""]
[{"$nulls":32},"",""]
[{"$nulls":32},"",""]
[{"$nulls":32},"",""]
[{"$nulls":32},"",""]
[{"$nulls":32},"",""]
[{"$nulls":32},"",""]
[{"$nulls":32},"",""]
[{"$nulls":32},"",""]
[{"$nulls":32},"",""]
[{"$nulls":32},"",""]
[{"$nulls":32},"",""]
[{"$nulls":32},"",""]
[{"$nulls":32},"",""]
[{"$nulls":32},"",""]
[{"$nulls":32},"",""]
[{"$nulls":32},"",""]

{"sheet":"組合表","index":11,"n_rows":55,"n_cols":39,"rows_kept":55,"merged":[[2,32,2,33],[2,34,2,35],[2,36,2,37]]}
[{"$nulls":25},26]
[{"$nulls":25},52]
[1,2,3,4,5,6,7,8,9,10,11,12,13,14,15,16,17,18,19,20,21,22,23,24,25,{"$nulls":7},"Aコート",null,"Ｂコート",null,"Ｃコート"]
[null,5,"D","D1D2","D3D4","D1D5","D2D3","D4D5","D1D4","D2D5","D1D3","D2D4","D3D5",{"$nulls":13},"D1D2",null,"D1D2","A1A2",null,null,{"$f":"LEFT(AC4,2)","v":"D1"},{"$f":"RIGHT(AC4,2)","v":"D2"},{"$f":"LEFT(AD4,2)","v":"A1"},{"$f":"RIGHT(AD4,2)","v":"A2"},{"$f":"LEFT(AE4,2)","v":""},{"$f":"RIGHT(AE4,2)","v":""},1]
[null,4,"A","A1A2","A3A4","A2A3","A1A4","A1A3","A2A4",{"$nulls":17},"A1A2",null,"B1B2","C1C2",null,null,{"$f":"LEFT(AC5,2)","v":"B1"},{"$f":"RIGHT(AC5,2)","v":"B2"},{"$f":"LEFT(AD5,2)","v":"C1"},{"$f":"RIGHT(AD5,2)","v":"C2"},{"$f":"LEFT(AE5,2)","v":""},{"$f":"RIGHT(AE5,2)","v":""},2]
[null,4,"B","B1B2","B3B4","B2B3","B1B4","B1B3","B2B4",{"$nulls":17},"B1B2",null,"E1E2","F1F2",null,null,"E1","E2","F1","F2","","",3]
[null,4,"C","C1C2","C3C4","C2C3","C1C4","C1C3","C2C4",{"$nulls":17},"C1C2",null,"G1G2","H1H2",null,null,"G1","G2","H1","H2","","",4]
[null,4,"E","E1E2","E3E4","E2E3","E1E4","E1E3","E2E4",{"$nulls":17},"E1E2",null,"D3D4","A3A4",null,null,"D3","D4","A3","A4","","",5]
[null,4,"F","F1F2","F3F4","F2F3","F1F4","F1F3","F2F4",{"$nulls":17},"F1F2",null,"B3B4","C3C4",null,null,"B3","B4","C3","C4","","",6]
[null,4,"G","G1G2","G3G4","G2G3","G1G4","G1G3","G2G4",{"$nulls":17},"G1G2",null,"E3E4","F3F4",null,null,"E3","E4","F3","F4","","",7]
[null,4,"H","H1H2","H3H4","H2H3","H1H4","H1H3","H2H4",{"$nulls":17},"H1H2",null,"G3G4","H3H4",null,null,"G3","G4","H3","H4","","",8]
[{"$nulls":26},"D3D4",null,"D1D5","A2A3",null,null,"D1","D5","A2","A3","","",9]
[{"$nulls":26},"A3A4",null,"B2B3","C2C3",null,null,"B2","B3","C2","C3","","",10]
[{"$nulls":26},"B3B4",null,"E2E3","F2F3",null,null,"E2","E3","F2","F3","","",11]
[{"$nulls":26},"C3C4",null,"G2G3","H2H3",null,null,"G2","G3","H2","H3","","",12]
[{"$nulls":26},"E3E4",null,"D2D3","A1A4",null,null,"D2","D3","A1","A4","","",13]
[{"$nulls":26},"F3F4",null,"B1B4","C1C4",null,null,"B1","B4","C1","C4","","",14]
[{"$nulls":26},"G3G4",null,"E1E4","F1F4",null,null,"E1","E4","F1","F4","","",15]
[{"$nulls":26},"H3H4",null,"G1G4","H1H4",null,null,"G1","G4","H1","H4","","",16]
[{"$nulls":26},"D1D5",null,"D4D5","A1A3",null,null,"D4","D5","A1","A3","","",17]
[{"$nulls":26},"A2A3",null,"B1B3","C1C3",null,null,"B1","B3","C1","C3","","",18]
[{"$nulls":26},"B2B3",null,"E1E3","F1F3",null,null,"E1","E3","F1","F3","","",19]
[{"$nulls":26},"C2C3",null,"G1G3","H1H3",null,null,"G1","G3","H1","H3","","",20]
[{"$nulls":26},"E2E3",null,"D1D4","A2A4",null,null,"D1","D4","A2","A4","","",21]
[{"$nulls":26},"F2F3",null,"B2B4","C2C4",null,null,"B2","B4","C2","C4","","",22]
[{"$nulls":26},"G2G3",null,"E2E4","F2F4",null,null,"E2","E4","F2","F4","","",23]
[{"$nulls":3},1,2,3,4,5,6,7,8,9,10,11,12,13,14,15,16,17,18,19,20,"21",null,null,"H2H3",null,"G2G4","H2H4",null,null,"G2","G4","H2","H4","","",24]
["７チーム",null,"B",{"$f":"CONCATENATE(C28,1,C28,2)","v":"B1B2"},{"$f":"CONCATENATE(C28,3,C28,4)","v":"B3B4"},{"$f":"CONCATENATE(C28,5,C28,6)","v":"B5B6"},{"$f":"CONCATENATE(C28,1,C28,7)","v":"B1B7"},{"$f":"CONCATENATE(C28,2,C28,3)","v":"B2B3"},{"$f":"CONCATENATE(C28,4,C28,5)","v":"B4B5"},{"$f":"CONCATENATE(C28,6,C28,7)","v":"B6B7"},{"$f":"CONCATENATE(C28,1,C28,4)","v":"B1B4"},{"$f":"CONCATENATE(C28,2,C28,5)","v":"B2B5"},{"$f":"CONCATENATE(C28,3,C28,6)","v":"B3B6"},{"$f":"CONCATENATE(C28,4,C28,7)","v":"B4B7"},{"$f":"CONCATENATE(C28,1,C28,6)","v":"B1B6"},{"$f":"CONCATENATE(C28,5,C28,7)","v":"B5B7"},{"$f":"CONCATENATE(C28,1,C28,3)","v":"B1B3"},{"$f":"CONCATENATE(C28,2,C28,4)","v":"B2B4"},{"$f":"CONCATENATE(C28,3,C28,5)","v":"B3B5"},{"$f":"CONCATENATE(C28,4,C28,6)","v":"B4B6"},{"$f":"CONCATENATE(C28,2,C28,7)","v":"B2B7"},{"$f":"CONCATENATE(C28,1,C28,5)","v":"B1B5"},{"$f":"CONCATENATE(C28,2,C28,6)","v":"B2B6"},{"$f":"CONCATENATE(C28,3,C28,7)","v":"B3B7"},null,null,"D2D3",null,"D2D5","D1D3",null,null,"D2","D5","D1","D3","","",25]
["6チーム",null,"A",{"$f":"CONCATENATE(C29,1,C29,2)","v":"A1A2"},{"$f":"CONCATENATE(C29,3,C29,4)","v":"A3A4"},{"$f":"CONCATENATE(C29,5,C29,6)","v":"A5A6"},{"$f":"CONCATENATE(C29,1,C29,3)","v":"A1A3"},{"$f":"CONCATENATE(C29,2,C29,4)","v":"A2A4"},{"$f":"CONCATENATE(C29,3,C29,5)","v":"A3A5"},{"$f":"CONCATENATE(C29,4,C29,6)","v":"A4A6"},{"$f":"CONCATENATE(C29,1,C29,5)","v":"A1A5"},{"$f":"CONCATENATE(C29,2,C29,6)","v":"A2A6"},{"$f":"CONCATENATE(C29,1,C29,4)","v":"A1A4"},{"$f":"CONCATENATE(C29,2,C29,5)","v":"A2A5"},{"$f":"CONCATENATE(C29,3,C29,6)","v":"A3A6"},{"$f":"CONCATENATE(C29,4,C29,5)","v":"A4A5"},{"$f":"CONCATENATE(C29,2,C29,3)","v":"A2A3"},{"$f":"CONCATENATE(C29,1,C29,6)","v":"A1A6"},{"$nulls":8},"A1A4",null,"D2D4","D3D5",null,null,"D2","D4","D3","D5","","",26]
["5チーム",null,"D",{"$f":"CONCATENATE(C30,1,C30,2)","v":"D1D2"},{"$f":"CONCATENATE(C30,3,C30,4)","v":"D3D4"},{"$f":"CONCATENATE(C30,1,C30,5)","v":"D1D5"},{"$f":"CONCATENATE(C30,2,C30,3)","v":"D2D3"},{"$f":"CONCATENATE(C30,4,C30,5)","v":"D4D5"},{"$f":"CONCATENATE(C30,1,C30,4)","v":"D1D4"},{"$f":"CONCATENATE(C30,2,C30,5)","v":"D2D5"},{"$f":"CONCATENATE(C30,1,C30,3)","v":"D1D3"},{"$f":"CONCATENATE(C30,2,C30,4)","v":"D2D4"},{"$f":"CONCATENATE(C30,3,C30,5)","v":"D3D5"},{"$nulls":13},"B1B4",{"$nulls":5},"","","","","","",27]
["4チーム",null,"H",{"$f":"CONCATENATE(C31,1,C31,2)","v":"H1H2"},{"$f":"CONCATENATE(C31,3,C31,4)","v":"H3H4"},{"$f":"CONCATENATE(C31,2,C31,3)","v":"H2H3"},{"$f":"CONCATENATE(C31,1,C31,4)","v":"H1H4"},{"$f":"CONCATENATE(C31,1,C31,3)","v":"H1H3"},{"$f":"CONCATENATE(C31,2,C31,4)","v":"H2H4"},{"$nulls":17},"C1C4",{"$nulls":5},"","","","","","",28]
["3チーム",null,"D",{"$f":"CONCATENATE(C32,1,C32,2)","v":"D1D2"},{"$f":"CONCATENATE(C32,2,C32,3)","v":"D2D3"},{"$f":"CONCATENATE(C32,1,C32,3)","v":"D1D3"},{"$nulls":20},"E1E4",{"$nulls":5},"","","","","","",29]
[{"$nulls":26},"F1F4",{"$nulls":5},"","","","","","",30]
[{"$nulls":26},"G1G4",{"$nulls":5},"","","","","","",31]
[{"$nulls":26},"H1H4",{"$nulls":5},"","","","","","",32]
[{"$nulls":26},"D4D5",{"$nulls":5},"","","","","","",33]
[{"$nulls":26},"A1A3",{"$nulls":5},"","","","","","",34]
[{"$nulls":26},"B1B3",{"$nulls":5},{"$f":"LEFT(AC38,2)","v":""},{"$f":"RIGHT(AC38,2)","v":""},{"$f":"LEFT(AD38,2)","v":""},{"$f":"RIGHT(AD38,2)","v":""},{"$f":"LEFT(AE38,2)","v":""},{"$f":"RIGHT(AE38,2)","v":""},35]
[{"$nulls":26},"C1C3",{"$nulls":5},"","","","","","",36]
[{"$nulls":26},"E1E3",{"$nulls":5},"","","","","","",37]
[{"$nulls":26},"F1F3",{"$nulls":5},"","","","","","",38]
[{"$nulls":26},"G1G3",{"$nulls":5},"","","","","","",39]
[{"$nulls":26},"H1H3",{"$nulls":5},"","","","","","",40]
[{"$nulls":26},"D1D4"]
[{"$nulls":26},"A2A4"]
[{"$nulls":26},"B2B4"]
[{"$nulls":26},"C2C4"]
[{"$nulls":26},"E2E4"]
[{"$nulls":26},"F2F4"]
[{"$nulls":26},"G2G4"]
[{"$nulls":26},"H2H4"]
[{"$nulls":26},"D2D5"]
[{"$nulls":26},"D1D3"]
[{"$nulls":26},"D2D4"]
[{"$nulls":26},"D3D5"]