{"text_format":"3","workbook":"xlsx","n_sheets":11,"sheets":["チーム表","対戦表","リーグ戦表","トーナメント表","優秀選手","DATA1","DATA","対戦表1","対戦表2","対戦表3","組合表"],"not_rendered":{"images":7,"macros":1,"defined_names":5},"read":"whole","date_system":"1900"}

{"sheet":"チーム表","index":0,"n_rows":45,"n_cols":11,"rows_kept":45,"merged":[[0,1,0,5],[1,1,1,4]]}
[null,"第２０回　加賀地域少年少女ドッジボール大会"]
[]
[null,"番号","ﾌﾞﾛｯｸ","チ　ー　ム　名","代表者名","県名"]
[null,1,"A1","鞍月アタッカーズ","廣岡　俊和","石川"]
[null,2,"A2","針原パイレーツ","木原　清志","富山"]
[null,3,"A3","小木クラブ","福田　陽三","石川"]
[null,4,"A4","NISHIファイヤースターズ","足滝　信雄","石川"]
[null,5,"B1","呉羽ドッジボールクラブ","久郷　巌","富山"]
[null,6,"B2","鳳至ドッジボールクラブ","中野　悟","石川"]
[null,7,"B3","千坂ドッジファイヤーズ","成瀬　章宏","石川"]
[null,8,"B4","松任の大魔陣","吉岡　正敏","石川"]
[null,9,"C1","光陽マーリンズ","上野　まどか","富山"]
[null,10,"C2","中郷ドッジボールクラブ","野崎　珠美","福井"]
[null,11,"C3","鵜川ミラクルフェニックス","新谷　信之","石川"]
[null,12,"C4","向本折クラブA","中嶋　大樹","石川"]
[null,13,"D1","飯野マジックス","村田　和孝","富山"]
[null,14,"D2","三馬パワフル","石田　一栄","石川"]
[null,15,"D3","寺井クラブ","端野　智博","石川"]
[null,16,"D4","大門ドッジボールクラブ","大橋　潤子","富山"]
[null,17,"D5","田上闘球DREAMS","盛一　純平","石川"]
{"$rows_left_out":26}
{"sheet":"対戦表","index":1,"n_rows":164,"n_cols":34,"rows_kept":164,"merged":[[32,5,32,10],[32,15,32,20],[32,25,32,30],[33,5,33,10],[33,15,33,20],[33,25,33,30],[34,5,34,10],[34,15,34,20],[34,25,34,30],[35,5,35,10],[35,15,35,20],[35,25,35,30],[36,5,36,10],[36,15,36,20],[36,25,36,30],[37,5,37,10],[37,15,37,20],[37,25,37,30],[38,5,38,10],[38,15,38,20],[38,25,38,30],[39,5,39,10],[39,15,39,20],[40,5,40,10],[40,15,40,20],[41,5,41,10],[41,15,41,20],[41,25,41,30],[42,5,42,10],[42,15,42,20],[43,5,43,10],[43,15,43,20],[44,5,44,10],[44,15,44,20]]}
[{"$nulls":10},{"$f":"チーム表!$B$1","v":"第２０回　加賀地域少年少女ドッジボール大会"},{"$nulls":13},"予選試合数",26]
[]
["　試合スケジュール"]
[]
[null,"時間",null,null,"点","Ａコート",{"$nulls":3},"点","Ａコート",{"$nulls":3},"点","Ｂコート",{"$nulls":3},"点","Ｂコート"]
[1,"09:30:00",{"$f":"組合表!AG4","v":"D1"},{"$f":"CONCATENATE(C6,H6)","v":"D1D2"},null,{"$f":"VLOOKUP(C6,チーム表!C:D,2,FALSE)","v":"飯野マジックス"},"×",{"$f":"組合表!AH4","v":"D2"},{"$f":"CONCATENATE(H6,C6)","v":"D2D1"},null,{"$f":"VLOOKUP(H6,チーム表!C:D,2,FALSE)","v":"三馬パワフル"},null,{"$f":"組合表!AI4","v":"A1"},{"$f":"CONCATENATE(M6,R6)","v":"A1A2"},null,{"$f":"VLOOKUP(M6,チーム表!C:D,2,FALSE)","v":"鞍月アタッカーズ"},"×",{"$f":"組合表!AJ4","v":"A2"},{"$f":"CONCATENATE(R6,M6)","v":"A2A1"},null,{"$f":"VLOOKUP(R6,チーム表!C:D,2,FALSE)","v":"針原パイレーツ"},{"$nulls":11},{"$f":"D6","v":"D1D2"},{"$f":"IF(E6=\"\",\"\",E6)","v":""}]
[2,"09:40:00",{"$f":"組合表!AG5","v":"B1"},{"$f":"CONCATENATE(C7,H7)","v":"B1B2"},null,{"$f":"VLOOKUP(C7,チーム表!C:D,2,FALSE)","v":"呉羽ドッジボールクラブ"},"×",{"$f":"組合表!AH5","v":"B2"},{"$f":"CONCATENATE(H7,C7)","v":"B2B1"},null,{"$f":"VLOOKUP(H7,チーム表!C:D,2,FALSE)","v":"鳳至ドッジボールクラブ"},null,{"$f":"組合表!AI5","v":"C1"},{"$f":"CONCATENATE(M7,R7)","v":"C1C2"},null,{"$f":"VLOOKUP(M7,チーム表!C:D,2,FALSE)","v":"光陽マーリンズ"},"×",{"$f":"組合表!AJ5","v":"C2"},{"$f":"CONCATENATE(R7,M7)","v":"C2C1"},null,{"$f":"VLOOKUP(R7,チーム表!C:D,2,FALSE)","v":"中郷ドッジボールクラブ"},{"$nulls":11},"B1B2",{"$f":"IF(E7=\"\",\"\",E7)","v":""}]
[3,"09:50:00","D3","D3D4",null,{"$f":"VLOOKUP(C8,チーム表!C:D,2,FALSE)","v":"寺井クラブ"},"×","D4","D4D3",null,{"$f":"VLOOKUP(H8,チーム表!C:D,2,FALSE)","v":"大門ドッジボールクラブ"},null,"A3","A3A4",null,{"$f":"VLOOKUP(M8,チーム表!C:D,2,FALSE)","v":"小木クラブ"},"×","A4","A4A3",null,{"$f":"VLOOKUP(R8,チーム表!C:D,2,FALSE)","v":"NISHIファイヤースターズ"},{"$nulls":11},"D3D4",""]
[4,"10:00:00","B3","B3B4",null,{"$f":"VLOOKUP(C9,チーム表!C:D,2,FALSE)","v":"千坂ドッジファイヤーズ"},"×","B4","B4B3",null,{"$f":"VLOOKUP(H9,チーム表!C:D,2,FALSE)","v":"松任の大魔陣"},null,"C3","C3C4",null,{"$f":"VLOOKUP(M9,チーム表!C:D,2,FALSE)","v":"鵜川ミラクルフェニックス"},"×","C4","C4C3",null,{"$f":"VLOOKUP(R9,チーム表!C:D,2,FALSE)","v":"向本折クラブA"},{"$nulls":11},"B3B4",""]
[5,"10:10:00","D1","D1D5",null,{"$f":"VLOOKUP(C10,チーム表!C:D,2,FALSE)","v":"飯野マジックス"},"×","D5","D5D1",null,{"$f":"VLOOKUP(H10,チーム表!C:D,2,FALSE)","v":"田上闘球DREAMS"},null,"A2","A2A3",null,{"$f":"VLOOKUP(M10,チーム表!C:D,2,FALSE)","v":"針原パイレーツ"},"×","A3","A3A2",null,{"$f":"VLOOKUP(R10,チーム表!C:D,2,FALSE)","v":"小木クラブ"},{"$nulls":11},"D1D5",""]
[6,"10:20:00","B2","B2B3",null,{"$f":"VLOOKUP(C11,チーム表!C:D,2,FALSE)","v":"鳳至ドッジボールクラブ"},"×","B3","B3B2",null,{"$f":"VLOOKUP(H11,チーム表!C:D,2,FALSE)","v":"千坂ドッジファイヤーズ"},null,"C2","C2C3",null,{"$f":"VLOOKUP(M11,チーム表!C:D,2,FALSE)","v":"中郷ドッジボールクラブ"},"×","C3","C3C2",null,{"$f":"VLOOKUP(R11,チーム表!C:D,2,FALSE)","v":"鵜川ミラクルフェニックス"},{"$nulls":11},"B2B3",""]
[7,"10:30:00","D2","D2D3",null,{"$f":"VLOOKUP(C12,チーム表!C:D,2,FALSE)","v":"三馬パワフル"},"×","D3","D3D2",null,{"$f":"VLOOKUP(H12,チーム表!C:D,2,FALSE)","v":"寺井クラブ"},null,"A1","A1A4",null,{"$f":"VLOOKUP(M12,チーム表!C:D,2,FALSE)","v":"鞍月アタッカーズ"},"×","A4","A4A1",null,{"$f":"VLOOKUP(R12,チーム表!C:D,2,FALSE)","v":"NISHIファイヤースターズ"},{"$nulls":11},"D2D3",""]
[8,"10:40:00","E1","E1E2",null,{"$f":"VLOOKUP(C13,チーム表!C:D,2,FALSE)","v":"鞍月アタッカーズジュニア"},"×","E2","E2E1",null,{"$f":"VLOOKUP(H13,チーム表!C:D,2,FALSE)","v":"鳳至ジュニア"},null,"F1","F1F2",null,{"$f":"VLOOKUP(M13,チーム表!C:D,2,FALSE)","v":"九十九クラブ"},"×","F2","F2F1",null,{"$f":"VLOOKUP(R13,チーム表!C:D,2,FALSE)","v":"千坂ロータスルート"},{"$nulls":11},"E1E2",""]
[9,"10:50:00","G1","G1G2",null,{"$f":"VLOOKUP(C14,チーム表!C:D,2,FALSE)","v":"鞍月アタッカーズキッズ"},"×","G2","G2G1",null,{"$f":"VLOOKUP(H14,チーム表!C:D,2,FALSE)","v":"松任の大魔陣Jr."},null,"H1","H1H2",null,{"$f":"VLOOKUP(M14,チーム表!C:D,2,FALSE)","v":"呉羽DBCジュニア"},"×","H2","H2H1",null,{"$f":"VLOOKUP(R14,チーム表!C:D,2,FALSE)","v":"NISHI　Jrスターズ"},{"$nulls":11},"G1G2",""]
[10,"11:00:00","E3","E3E4",null,{"$f":"VLOOKUP(C15,チーム表!C:D,2,FALSE)","v":"中郷ミラクルジュニア"},"×","E4","E4E3",null,{"$f":"VLOOKUP(H15,チーム表!C:D,2,FALSE)","v":"ドッジの王子様"},null,"F3","F3F4",null,{"$f":"VLOOKUP(M15,チーム表!C:D,2,FALSE)","v":"向本折クラブNew"},"×","F4","F4F3",null,{"$f":"VLOOKUP(R15,チーム表!C:D,2,FALSE)","v":"寺井クラブＪｒ　A"},{"$nulls":11},"E3E4",""]
[11,"11:10:00","G3","G3G4",null,{"$f":"VLOOKUP(C16,チーム表!C:D,2,FALSE)","v":"鵜川フェニックスジュニア"},"×","G4","G4G3",null,{"$f":"VLOOKUP(H16,チーム表!C:D,2,FALSE)","v":"大門ドッジボールクラブJr"},null,"H3","H3H4",null,{"$f":"VLOOKUP(M16,チーム表!C:D,2,FALSE)","v":"寺井クラブＪｒ　B"},"×","H4","H4H3",null,{"$f":"VLOOKUP(R16,チーム表!C:D,2,FALSE)","v":"田上闘球FUTURES"},{"$nulls":11},"G3G4",""]
[12,"11:20:00","E2","E2E3",null,{"$f":"VLOOKUP(C17,チーム表!C:D,2,FALSE)","v":"鳳至ジュニア"},"×","E3","E3E2",null,{"$f":"VLOOKUP(H17,チーム表!C:D,2,FALSE)","v":"中郷ミラクルジュニア"},null,"F2","F2F3",null,{"$f":"VLOOKUP(M17,チーム表!C:D,2,FALSE)","v":"千坂ロータスルート"},"×","F3","F3F2",null,{"$f":"VLOOKUP(R17,チーム表!C:D,2,FALSE)","v":"向本折クラブNew"},{"$nulls":11},"E2E3",""]
[13,"11:30:00","G2","G2G3",null,{"$f":"VLOOKUP(C18,チーム表!C:D,2,FALSE)","v":"松任の大魔陣Jr."},"×","G3","G3G2",null,{"$f":"VLOOKUP(H18,チーム表!C:D,2,FALSE)","v":"鵜川フェニックスジュニア"},null,"H2","H2H3",null,{"$f":"VLOOKUP(M18,チーム表!C:D,2,FALSE)","v":"NISHI　Jrスターズ"},"×","H3","H3H2",null,{"$f":"VLOOKUP(R18,チーム表!C:D,2,FALSE)","v":"寺井クラブＪｒ　B"},{"$nulls":11},"G2G3",""]
[14,"11:40:00","E1","E1E4",null,{"$f":"VLOOKUP(C19,チーム表!C:D,2,FALSE)","v":"鞍月アタッカーズジュニア"},"×","E4","E4E1",null,{"$f":"VLOOKUP(H19,チーム表!C:D,2,FALSE)","v":"ドッジの王子様"},null,"F1","F1F4",null,{"$f":"VLOOKUP(M19,チーム表!C:D,2,FALSE)","v":"九十九クラブ"},"×","F4","F4F1",null,{"$f":"VLOOKUP(R19,チーム表!C:D,2,FALSE)","v":"寺井クラブＪｒ　A"},{"$nulls":11},"E1E4",""]
[15,"11:50:00","G1","G1G4",null,{"$f":"VLOOKUP(C20,チーム表!C:D,2,FALSE)","v":"鞍月アタッカーズキッズ"},"×","G4","G4G1",null,{"$f":"VLOOKUP(H20,チーム表!C:D,2,FALSE)","v":"大門ドッジボールクラブJr"},null,"H1","H1H4",null,{"$f":"VLOOKUP(M20,チーム表!C:D,2,FALSE)","v":"呉羽DBCジュニア"},"×","H4","H4H1",null,{"$f":"VLOOKUP(R20,チーム表!C:D,2,FALSE)","v":"田上闘球FUTURES"},{"$nulls":11},{"$f":"D20","v":"G1G4"},{"$f":"IF(E20=\"\",\"\",E20)","v":""}]
{"$rows_left_out":145}
{"sheet":"リーグ戦表","index":2,"n_rows":100,"n_cols":35,"rows_kept":100,"merged":[[1,2,1,11],[4,0,5,0],[4,1,5,2],[4,3,5,5],[4,6,5,8],[4,9,5,11],[4,12,5,14],[4,15,5,17],[4,18,5,20],[4,21,5,23],[4,24,5,24],[4,25,5,25],[4,26,5,26],[4,27,5,27],[4,28,5,28],[4,29,5,29],[4,30,5,30],[4,31,5,31],[4,32,5,32],[6,0,7,0],[6,1,7,2],[6,3,7,5],[6,24,7,24],[6,25,7,25],[6,26,7,26],[6,27,7,27],[6,28,7,28],[6,29,7,29],[6,30,7,30],[6,31,7,31],[6,32,7,32],[8,0,9,0],[8,1,9,2],[8,6,9,8],[8,24,9,24],[8,25,9,25],[8,26,9,26],[8,27,9,27],[8,28,9,28],[8,29,9,29],[8,30,9,30],[8,31,9,31],[8,32,9,32],[10,0,11,0],[10,1,11,2],[10,9,11,11],[10,24,11,24],[10,25,11,25],[10,26,11,26],[10,27,11,27],[10,28,11,28],[10,29,11,29],[10,30,11,30],[10,31,11,31],[10,32,11,32],[12,0,13,0],[12,1,13,2],[12,12,13,14],[12,24,13,24],[12,25,13,25],[12,26,13,26],[12,27,13,27],[12,28,13,28],[12,29,13,29],[12,30,13,30],[12,31,13,31],[12,32,13,32],[16,0,17,0],[16,1,17,2],[16,3,17,5],[16,6,17,8],[16,9,17,11],[16,12,17,14],[16,15,17,17],[16,18,17,20],[16,21,17,23],[16,24,17,24],[16,25,17,25],[16,26,17,26],[16,27,17,27],[16,28,17,28],[16,29,17,29],[16,30,17,30],[16,31,17,31],[16,32,17,32],[18,0,19,0],[18,1,19,2],[18,3,19,5],[18,24,19,24],[18,25,19,25],[18,26,19,26],[18,27,19,27],[18,28,19,28],[18,29,19,29],[18,30,19,30],[18,31,19,31],[18,32,19,32],[20,0,21,0],[20,1,21,2],[20,6,21,8],[20,24,21,24],[20,25,21,25],[20,26,21,26],[20,27,21,27],[20,28,21,28],[20,29,21,29],[20,30,21,30],[20,31,21,31],[20,32,21,32],[22,0,23,0],[22,1,23,2],[22,9,23,11],[22,24,23,24],[22,25,23,25],[22,26,23,26],[22,27,23,27],[22,28,23,28],[22,29,23,29],[22,30,23,30],[22,31,23,31],[22,32,23,32],[24,0,25,0],[24,1,25,2],[24,12,25,14],[24,24,25,24],[24,25,25,25],[24,26,25,26],[24,27,25,27],[24,28,25,28],[24,29,25,29],[24,30,25,30],[24,31,25,31],[24,32,25,32],[28,0,29,0],[28,1,29,2],[28,3,29,5],[28,6,29,8],[28,9,29,11],[28,12,29,14],[28,15,29,17],[28,18,29,20],[28,21,29,23],[28,24,29,24],[28,25,29,25],[28,26,29,26],[28,27,29,27],[28,28,29,28],[28,29,29,29],[28,30,29,30],[28,31,29,31],[28,32,29,32],[30,0,31,0],[30,1,31,2],[30,3,31,5],[30,24,31,24],[30,25,31,25],[30,26,31,26],[30,27,31,27],[30,28,31,28],[30,29,31,29],[30,30,31,30],[30,31,31,31],[30,32,31,32],[32,0,33,0],[32,1,33,2],[32,6,33,8],[32,24,33,24],[32,25,33,25],[32,26,33,26],[32,27,33,27],[32,28,33,28],[32,29,33,29],[32,30,33,30],[32,31,33,31],[32,32,33,32],[34,0,35,0],[34,1,35,2],[34,9,35,11],[34,24,35,24],[34,25,35,25],[34,26,35,26],[34,27,35,27],[34,28,35,28],[34,29,35,29],[34,30,35,30],[34,31,35,31],[34,32,35,32],[36,0,37,0],[36,1,37,2],[36,12,37,14],[36,24,37,24],[36,25,37,25],[36,26,37,26],[36,27,37,27],[36,28,37,28],[36,29,37,29],[36,30,37,30],[36,31,37,31],[36,32,37,32],[40,0,41,0],[40,1,41,2],[40,3,41,5],[40,6,41,8],[40,9,41,11],[40,12,41,14],[40,15,41,17],[40,18,41,20],[40,21,41,23],[40,24,41,24],[40,25,41,25],[40,26,41,26],[40,27,41,27],[40,28,41,28],[40,29,41,29],[40,30,41,30],[40,31,41,31],[40,32,41,32],[42,0,43,0],[42,1,43,2],[42,3,43,5],[42,24,43,24],[42,25,43,25],[42,26,43,26],[42,27,43,27],[42,28,43,28],[42,29,43,29],[42,30,43,30],[42,31,43,31],[42,32,43,32],[44,0,45,0],[44,1,45,2],[44,6,45,8],[44,24,45,24],[44,25,45,25],[44,26,45,26],[44,27,45,27],[44,28,45,28],[44,29,45,29],[44,30,45,30],[44,31,45,31],[44,32,45,32],[46,0,47,0],[46,1,47,2],[46,9,47,11],[46,24,47,24],[46,25,47,25],[46,26,47,26],[46,27,47,27],[46,28,47,28],[46,29,47,29],[46,30,47,30],[46,31,47,31],[46,32,47,32],[48,0,49,0],[48,1,49,2],[48,12,49,14],[48,24,49,24],[48,25,49,25],[48,26,49,26],[48,27,49,27],[48,28,49,28],[48,29,49,29],[48,30,49,30],[48,31,49,31],[48,32,49,32],[50,0,51,0],[50,1,51,2],[50,15,51,17],[50,24,51,24],[50,25,51,25],[50,26,51,26],[50,27,51,27],[50,28,51,28],[50,29,51,29],[50,30,51,30],[50,31,51,31],[50,32,51,32],[54,0,55,0],[54,1,55,2],[54,3,55,5],[54,6,55,8],[54,9,55,11],[54,12,55,14],[54,15,55,17],[54,18,55,20],[54,21,55,23],[54,24,55,24],[54,25,55,25],[54,26,55,26],[54,27,55,27],[54,28,55,28],[54,29,55,29],[54,30,55,30],[54,31,55,31],[54,32,55,32],[56,0,57,0],[56,1,57,2],[56,3,57,5],[56,24,57,24],[56,25,57,25],[56,26,57,26],[56,27,57,27],[56,28,57,28],[56,29,57,29],[56,30,57,30],[56,31,57,31],[56,32,57,32],[58,0,59,0],[58,1,59,2],[58,6,59,8],[58,24,59,24],[58,25,59,25],[58,26,59,26],[58,27,59,27],[58,28,59,28],[58,29,59,29],[58,30,59,30],[58,31,59,31],[58,32,59,32],[60,0,61,0],[60,1,61,2],[60,9,61,11],[60,24,61,24],[60,25,61,25],[60,26,61,26],[60,27,61,27],[60,28,61,28],[60,29,61,29],[60,30,61,30],[60,31,61,31],[60,32,61,32],[62,0,63,0],[62,1,63,2],[62,12,63,14],[62,24,63,24],[62,25,63,25],[62,26,63,26],[62,27,63,27],[62,28,63,28],[62,29,63,29],[62,30,63,30],[62,31,63,31],[62,32,63,32],[66,0,67,0],[66,1,67,2],[66,3,67,5],[66,6,67,8],[66,9,67,11],[66,12,67,14],[66,15,67,17],[66,18,67,20],[66,21,67,23],[66,24,67,24],[66,25,67,25],[66,26,67,26],[66,27,67,27],[66,28,67,28],[66,29,67,29],[66,30,67,30],[66,31,67,31],[66,32,67,32],[68,0,69,0],[68,1,69,2],[68,3,69,5],[68,24,69,24],[68,25,69,25],[68,26,69,26],[68,27,69,27],[68,28,69,28],[68,29,69,29],[68,30,69,30],[68,31,69,31],[68,32,69,32],[70,0,71,0],[70,1,71,2],[70,6,71,8],[70,24,71,24],[70,25,71,25],[70,26,71,26],[70,27,71,27],[70,28,71,28],[70,29,71,29],[70,30,71,30],[70,31,71,31],[70,32,71,32],[72,0,73,0],[72,1,73,2],[72,9,73,11],[72,24,73,24],[72,25,73,25],[72,26,73,26],[72,27,73,27],[72,28,73,28],[72,29,73,29],[72,30,73,30],[72,31,73,31],[72,32,73,32],[74,0,75,0],[74,1,75,2],[74,12,75,14],[74,24,75,24],[74,25,75,25],[74,26,75,26],[74,27,75,27],[74,28,75,28],[74,29,75,29],[74,30,75,30],[74,31,75,31],[74,32,75,32],[78,0,79,0],[78,1,79,2],[78,3,79,5],[78,6,79,8],[78,9,79,11],[78,12,79,14],[78,15,79,17],[78,18,79,20],[78,21,79,23],[78,24,79,24],[78,25,79,25],[78,26,79,26],[78,27,79,27],[78,28,79,28],[78,29,79,29],[78,30,79,30],[78,31,79,31],[78,32,79,32],[80,0,81,0],[80,1,81,2],[80,3,81,5],[80,24,81,24],[80,25,81,25],[80,26,81,26],[80,27,81,27],[80,28,81,28],[80,29,81,29],[80,30,81,30],[80,31,81,31],[80,32,81,32],[82,0,83,0],[82,1,83,2],[82,6,83,8],[82,24,83,24],[82,25,83,25],[82,26,83,26],[82,27,83,27],[82,28,83,28],[82,29,83,29],[82,30,83,30],[82,31,83,31],[82,32,83,32],[84,0,85,0],[84,1,85,2],[84,9,85,11],[84,24,85,24],[84,25,85,25],[84,26,85,26],[84,27,85,27],[84,28,85,28],[84,29,85,29],[84,30,85,30],[84,31,85,31],[84,32,85,32],[86,0,87,0],[86,1,87,2],[86,12,87,14],[86,24,87,24],[86,25,87,25],[86,26,87,26],[86,27,87,27],[86,28,87,28],[86,29,87,29],[86,30,87,30],[86,31,87,31],[86,32,87,32],[90,0,91,0],[90,1,91,2],[90,3,91,5],[90,6,91,8],[90,9,91,11],[90,12,91,14],[90,15,91,17],[90,18,91,20],[90,21,91,23],[90,24,91,24],[90,25,91,25],[90,26,91,26],[90,27,91,27],[90,28,91,28],[90,29,91,29],[90,30,91,30],[90,31,91,31],[90,32,91,32],[92,0,93,0],[92,1,93,2],[92,3,93,5],[92,24,93,24],[92,25,93,25],[92,26,93,26],[92,27,93,27],[92,28,93,28],[92,29,93,29],[92,30,93,30],[92,31,93,31],[92,32,93,32],[94,0,95,0],[94,1,95,2],[94,6,95,8],[94,24,95,24],[94,25,95,25],[94,26,95,26],[94,27,95,27],[94,28,95,28],[94,29,95,29],[94,30,95,30],[94,31,95,31],[94,32,95,32],[96,0,97,0],[96,1,97,2],[96,9,97,11],[96,24,97,24],[96,25,97,25],[96,26,97,26],[96,27,97,27],[96,28,97,28],[96,29,97,29],[96,30,97,30],[96,31,97,31],[96,32,97,32],[98,0,99,0],[98,1,99,2],[98,12,99,14],[98,24,99,24],[98,25,99,25],[98,26,99,26],[98,27,99,27],[98,28,99,28],[98,29,99,29],[98,30,99,30],[98,31,99,31],[98,32,99,32]]}
[null,null,{"$f":"チーム表!$B$1","v":"第２０回　加賀地域少年少女ドッジボール大会"}]
[null,null,"リーグ戦表"]
[null,"レギュラーの部"]
[{"$nulls":4},{"$f":"CONCATENATE(A5,\"1\")","v":"A1"},null,null,{"$f":"CONCATENATE(A5,\"2\")","v":"A2"},null,null,{"$f":"CONCATENATE(A5,\"3\")","v":"A3"},null,null,{"$f":"CONCATENATE(A5,\"4\")","v":"A4"}]
["A","チーム名",null,{"$f":"B7","v":"鞍月アタッカーズ"},null,null,{"$f":"B9","v":"針原パイレーツ"},null,null,{"$f":"B11","v":"小木クラブ"},null,null,{"$f":"B13","v":"NISHIファイヤースターズ"},{"$nulls":11},"勝","負","分","点","内野","順位決定点","相手内野","順位","kaku"]
[]
[{"$f":"CONCATENATE(A5,1)","v":"A1"},{"$f":"VLOOKUP(A7,チーム表!C:D,2,FALSE)","v":"鞍月アタッカーズ"},{"$nulls":22},{"$f":"COUNTIF($E7:$N7,\"〇\")","v":0},{"$f":"COUNTIF($E7:$N7,\"×\")","v":0},{"$f":"COUNTIF($E7:$N7,\"△\")","v":0},{"$f":"Y7*2+AA7","v":0},{"$f":"IF(G8=\"\",\"\",D8+G8+M8+J8)","v":""},{"$f":"IF(AC7=\"\",\"\",AB7*100+AC7)","v":""},{"$f":"IF(AC7=\"\",\"\",F8+I8+L8+O8)","v":""},{"$f":"IF(AD7=\"\",\"\",RANK(AD7,AD7:AD14,0))","v":""},null,{"$f":"CONCATENATE(A5,AF7)","v":"A"},{"$f":"B7","v":"鞍月アタッカーズ"}]
[]
[{"$f":"CONCATENATE(A5,2)","v":"A2"},{"$f":"VLOOKUP(A9,チーム表!C:D,2,FALSE)","v":"針原パイレーツ"},null,null,{"$f":"IF(D10=\"\",\"\",IF(D10=F10,\"△\",IF(D10>F10,\"〇\",\"×\")))","v":""},{"$nulls":19},{"$f":"COUNTIF($E9:$N9,\"〇\")","v":0},{"$f":"COUNTIF($E9:$N9,\"×\")","v":0},{"$f":"COUNTIF($E9:$N9,\"△\")","v":0},{"$f":"Y9*2+AA9","v":0},{"$f":"IF(D10=\"\",\"\",D10+G10+M10+J10)","v":""},{"$f":"IF(AC9=\"\",\"\",AB9*100+AC9)","v":""},{"$f":"IF(AC9=\"\",\"\",F10+I10+L10+O10)","v":""},{"$f":"IF(AD9=\"\",\"\",RANK(AD9,AD7:AD14,0))","v":""},null,{"$f":"CONCATENATE(A5,AF9)","v":"A"},{"$f":"B9","v":"針原パイレーツ"}]
[{"$nulls":3},{"$f":"IF(I8=\"\",\"\",I8)","v":""},"-",{"$f":"IF(G8=\"\",\"\",G8)","v":""}]
[{"$f":"CONCATENATE(A5,3)","v":"A3"},{"$f":"VLOOKUP(A11,チーム表!C:D,2,FALSE)","v":"小木クラブ"},null,null,{"$f":"IF(D12=\"\",\"\",IF(D12=F12,\"△\",IF(D12>F12,\"〇\",\"×\")))","v":""},{"$nulls":19},{"$f":"COUNTIF($E11:$N11,\"〇\")","v":0},{"$f":"COUNTIF($E11:$N11,\"×\")","v":0},{"$f":"COUNTIF($E11:$N11,\"△\")","v":0},{"$f":"Y11*2+AA11","v":0},{"$f":"IF(G12=\"\",\"\",D12+G12+M12+J12)","v":""},{"$f":"IF(AC11=\"\",\"\",AB11*100+AC11)","v":""},{"$f":"IF(AC11=\"\",\"\",F12+I12+L12+O12)","v":""},{"$f":"IF(AD11=\"\",\"\",RANK(AD11,AD7:AD14,0))","v":""},null,{"$f":"CONCATENATE(A5,AF11)","v":"A"},{"$f":"B11","v":"小木クラブ"}]
[{"$nulls":3},{"$f":"IF(L8=\"\",\"\",L8)","v":""},"-",{"$f":"IF(J8=\"\",\"\",J8)","v":""}]
[{"$f":"CONCATENATE(A5,4)","v":"A4"},{"$f":"VLOOKUP(A13,チーム表!C:D,2,FALSE)","v":"NISHIファイヤースターズ"},null,null,{"$f":"IF(D14=\"\",\"\",IF(D14=F14,\"△\",IF(D14>F14,\"〇\",\"×\")))","v":""},null,null,{"$f":"IF(G14=\"\",\"\",IF(G14=I14,\"△\",IF(G14>I14,\"〇\",\"×\")))","v":""},null,null,{"$f":"IF(J14=\"\",\"\",IF(J14=L14,\"△\",IF(J14>L14,\"〇\",\"×\")))","v":""},{"$nulls":13},{"$f":"COUNTIF($E13:$N13,\"〇\")","v":0},{"$f":"COUNTIF($E13:$N13,\"×\")","v":0},{"$f":"COUNTIF($E13:$N13,\"△\")","v":0},{"$f":"Y13*2+AA13","v":0},{"$f":"IF(G14=\"\",\"\",D14+G14+M14+J14)","v":""},{"$f":"IF(AC13=\"\",\"\",AB13*100+AC13)","v":""},{"$f":"IF(AC13=\"\",\"\",F14+I14+L14+O14)","v":""},{"$f":"IF(AD13=\"\",\"\",RANK(AD13,AD7:AD14,0))","v":""},null,{"$f":"CONCATENATE(A5,AF13)","v":"A"},{"$f":"B13","v":"NISHIファイヤースターズ"}]
[{"$nulls":3},{"$f":"IF(O8=\"\",\"\",O8)","v":""},"-",{"$f":"IF(M8=\"\",\"\",M8)","v":""},{"$f":"IF(O10=\"\",\"\",O10)","v":""},"-",{"$f":"IF(M10=\"\",\"\",M10)","v":""},{"$f":"IF(O12=\"\",\"\",O12)","v":""},"-",{"$f":"IF(M12=\"\",\"\",M12)","v":""}]
[]
[{"$nulls":4},{"$f":"CONCATENATE(A17,\"1\")","v":"B1"},null,null,{"$f":"CONCATENATE(A17,\"2\")","v":"B2"},null,null,{"$f":"CONCATENATE(A17,\"3\")","v":"B3"},null,null,{"$f":"CONCATENATE(A17,\"4\")","v":"B4"}]
["B","チーム名",null,{"$f":"B19","v":"呉羽ドッジボールクラブ"},null,null,{"$f":"B21","v":"鳳至ドッジボールクラブ"},null,null,{"$f":"B23","v":"千坂ドッジファイヤーズ"},null,null,{"$f":"B25","v":"松任の大魔陣"},{"$nulls":11},"勝","負","分","点","内野","順位決定点","相手内野","順位","kaku"]
[]
[{"$f":"CONCATENATE(A17,1)","v":"B1"},{"$f":"VLOOKUP(A19,チーム表!C:D,2,FALSE)","v":"呉羽ドッジボールクラブ"},{"$nulls":22},{"$f":"COUNTIF($E19:$N19,\"〇\")","v":0},{"$f":"COUNTIF($E19:$N19,\"×\")","v":0},{"$f":"COUNTIF($E19:$N19,\"△\")","v":0},{"$f":"Y19*2+AA19","v":0},{"$f":"IF(G20=\"\",\"\",D20+G20+M20+J20)","v":""},{"$f":"IF(AC19=\"\",\"\",AB19*100+AC19)","v":""},{"$f":"IF(AC19=\"\",\"\",F20+I20+L20+O20)","v":""},{"$f":"IF(AD19=\"\",\"\",RANK(AD19,AD19:AD26,0))","v":""},null,{"$f":"CONCATENATE(A17,AF19)","v":"B"},{"$f":"B19","v":"呉羽ドッジボールクラブ"}]
[]
{"$rows_left_out":81}
{"sheet":"トーナメント表","index":3,"n_rows":121,"n_cols":41,"rows_kept":121,"merged":[[4,0,5,0],[6,10,7,11],[8,0,9,0],[10,13,11,14],[12,0,13,0],[14,10,15,11],[15,20,16,21],[16,0,17,0],[17,16,18,17],[20,0,21,0],[22,10,23,11],[24,0,25,0],[26,13,27,14],[28,0,29,0],[30,10,31,11],[32,0,33,0],[38,16,39,17],[47,0,48,0],[49,12,50,13],[51,0,52,0],[54,15,55,16],[55,0,56,0],[58,12,59,13],[59,0,60,0],[60,22,61,24],[61,9,62,10],[63,0,64,0],[63,18,64,19],[67,0,68,0],[69,12,70,13],[71,0,72,0],[73,15,74,16],[75,0,76,0],[77,12,78,13],[79,0,80,0],[86,0,87,0],[88,10,89,11],[90,0,91,0],[92,13,93,14],[94,0,95,0],[96,10,97,11],[98,0,99,0],[99,16,100,17],[102,0,103,0],[104,10,105,11],[106,0,107,0],[108,13,109,14],[110,0,111,0],[112,10,113,11],[114,0,115,0],[120,16,121,17]]}
[null,"レギュラーの部",{"$nulls":5},"決勝トーナメント"]
[]
[]
[]
["Ａ1位"]
[{"$nulls":39},"A1",{"$f":"VLOOKUP(AN6,リーグ戦表!AH:AI,2,0)","v":{"$error":"#N/A"}}]
[{"$nulls":10},"A⑦",{"$nulls":28},"A2",{"$f":"VLOOKUP(AN7,リーグ戦表!AH:AI,2,0)","v":{"$error":"#N/A"}}]
[{"$nulls":39},"B1",{"$f":"VLOOKUP(AN8,リーグ戦表!AH:AI,2,0)","v":{"$error":"#N/A"}}]
["D２位",{"$nulls":38},"B2",{"$f":"VLOOKUP(AN9,リーグ戦表!AH:AI,2,0)","v":{"$error":"#N/A"}}]
[{"$nulls":39},"C1",{"$f":"VLOOKUP(AN10,リーグ戦表!AH:AI,2,0)","v":{"$error":"#N/A"}}]
[{"$nulls":13},"A⑫",{"$nulls":25},"C2",{"$f":"VLOOKUP(AN11,リーグ戦表!AH:AI,2,0)","v":{"$error":"#N/A"}}]
[{"$nulls":39},"D1",{"$f":"VLOOKUP(AN12,リーグ戦表!AH:AI,2,0)","v":{"$error":"#N/A"}}]
["B２位",{"$nulls":38},"D2",{"$f":"VLOOKUP(AN13,リーグ戦表!AH:AI,2,0)","v":{"$error":"#N/A"}}]
[]
[{"$nulls":10},"A⑧"]
[{"$nulls":20},"優　勝"]
["C１位"]
[{"$nulls":16},"A⑬"]
[]
[]
{"$rows_left_out":102}
{"sheet":"優秀選手","index":4,"n_rows":45,"n_cols":7,"rows_kept":45,"merged":[[0,1,0,6],[1,1,1,5]]}
[null,"第２０回　加賀地域少年少女ドッジボール大会優秀選手"]
[]
[null,"番号","ﾌﾞﾛｯｸ","チ　ー　ム　名","氏名","ふりがな","学年"]
[null,{"$f":"チーム表!B4","v":1},{"$f":"チーム表!C4","v":"A1"},{"$f":"チーム表!D4","v":"鞍月アタッカーズ"}]
[null,{"$f":"チーム表!B5","v":2},{"$f":"チーム表!C5","v":"A2"},{"$f":"チーム表!D5","v":"針原パイレーツ"}]
[null,{"$f":"チーム表!B6","v":3},{"$f":"チーム表!C6","v":"A3"},{"$f":"チーム表!D6","v":"小木クラブ"}]
[null,{"$f":"チーム表!B7","v":4},{"$f":"チーム表!C7","v":"A4"},{"$f":"チーム表!D7","v":"NISHIファイヤースターズ"}]
[null,{"$f":"チーム表!B8","v":5},{"$f":"チーム表!C8","v":"B1"},{"$f":"チーム表!D8","v":"呉羽ドッジボールクラブ"}]
[null,{"$f":"チーム表!B9","v":6},{"$f":"チーム表!C9","v":"B2"},{"$f":"チーム表!D9","v":"鳳至ドッジボールクラブ"}]
[null,{"$f":"チーム表!B10","v":7},{"$f":"チーム表!C10","v":"B3"},{"$f":"チーム表!D10","v":"千坂ドッジファイヤーズ"}]
[null,{"$f":"チーム表!B11","v":8},{"$f":"チーム表!C11","v":"B4"},{"$f":"チーム表!D11","v":"松任の大魔陣"}]
[null,{"$f":"チーム表!B12","v":9},{"$f":"チーム表!C12","v":"C1"},{"$f":"チーム表!D12","v":"光陽マーリンズ"}]
[null,{"$f":"チーム表!B13","v":10},{"$f":"チーム表!C13","v":"C2"},{"$f":"チーム表!D13","v":"中郷ドッジボールクラブ"}]
[null,{"$f":"チーム表!B14","v":11},{"$f":"チーム表!C14","v":"C3"},{"$f":"チーム表!D14","v":"鵜川ミラクルフェニックス"}]
[null,{"$f":"チーム表!B15","v":12},{"$f":"チーム表!C15","v":"C4"},{"$f":"チーム表!D15","v":"向本折クラブA"}]
[null,{"$f":"チーム表!B16","v":13},{"$f":"チーム表!C16","v":"D1"},{"$f":"チーム表!D16","v":"飯野マジックス"}]
[null,{"$f":"チーム表!B17","v":14},{"$f":"チーム表!C17","v":"D2"},{"$f":"チーム表!D17","v":"三馬パワフル"}]
[null,{"$f":"チーム表!B18","v":15},{"$f":"チーム表!C18","v":"D3"},{"$f":"チーム表!D18","v":"寺井クラブ"}]
[null,{"$f":"チーム表!B19","v":16},{"$f":"チーム表!C19","v":"D4"},{"$f":"チーム表!D19","v":"大門ドッジボールクラブ"}]
[null,{"$f":"チーム表!B20","v":17},{"$f":"チーム表!C20","v":"D5"},{"$f":"チーム表!D20","v":"田上闘球DREAMS"}]
{"$rows_left_out":26}
{"sheet":"DATA1","index":5,"n_rows":0,"n_cols":0,"rows_kept":0}

{"sheet":"DATA","index":6,"n_rows":0,"n_cols":0,"rows_kept":0}

{"sheet":"対戦表1","index":7,"n_rows":0,"n_cols":0,"rows_kept":0}

{"sheet":"対戦表2","index":8,"n_rows":0,"n_cols":0,"rows_kept":0}

{"sheet":"対戦表3","index":9,"n_rows":0,"n_cols":0,"rows_kept":0}

{"sheet":"組合表","index":10,"n_rows":55,"n_cols":39,"rows_kept":55,"merged":[[2,32,2,33],[2,34,2,35],[2,36,2,37]]}
[{"$nulls":25},26]
[{"$nulls":25},52]
[1,2,3,4,5,6,7,8,9,10,11,12,13,14,15,16,17,18,19,20,21,22,23,24,25,{"$nulls":7},"Aコート",null,"Ｂコート",null,"Ｃコート"]
[null,5,"D","D1D2","D3D4","D1D5","D2D3","D4D5","D1D4","D2D5","D1D3","D2D4","D3D5",{"$nulls":13},"D1D2",null,"D1D2","A1A2",null,null,{"$f":"LEFT(AC4,2)","v":"D1"},{"$f":"RIGHT(AC4,2)","v":"D2"},{"$f":"LEFT(AD4,2)","v":"A1"},{"$f":"RIGHT(AD4,2)","v":"A2"},{"$f":"LEFT(AE4,2)","v":""},{"$f":"RIGHT(AE4,2)","v":""},1]
[null,4,"A","A1A2","A3A4","A2A3","A1A4","A1A3","A2A4",{"$nulls":17},"A1A2",null,"B1B2","C1C2",null,null,{"$f":"LEFT(AC5,2)","v":"B1"},{"$f":"RIGHT(AC5,2)","v":"B2"},{"$f":"LEFT(AD5,2)","v":"C1"},{"$f":"RIGHT(AD5,2)","v":"C2"},{"$f":"LEFT(AE5,2)","v":""},{"$f":"RIGHT(AE5,2)","v":""},2]
[null,4,"B","B1B2","B3B4","B2B3","B1B4","B1B3","B2B4",{"$nulls":17},"B1B2",null,"E1E2","F1F2",null,null,"E1","E2","F1","F2","","",3]
[null,4,"C","C1C2","C3C4","C2C3","C1C4","C1C3","C2C4",{"$nulls":17},"C1C2",null,"G1G2","H1H2",null,null,"G1","G2","H1","H2","","",4]
[null,4,"E","E1E2","E3E4","E2E3","E1E4","E1E3","E2E4",{"$nulls":17},"E1E2",null,"D3D4","A3A4",null,null,"D3","D4","A3","A4","","",5]
[null,4,"F","F1F2","F3F4","F2F3","F1F4","F1F3","F2F4",{"$nulls":17},"F1F2",null,"B3B4","C3C4",null,null,"B3","B4","C3","C4","","",6]
[null,4,"G","G1G2","G3G4","G2G3","G1G4","G1G3","G2G4",{"$nulls":17},"G1G2",null,"E3E4","F3F4",null,null,"E3","E4","F3","F4","","",7]
[null,4,"H","H1H2","H3H4","H2H3","H1H4","H1H3","H2H4",{"$nulls":17},"H1H2",null,"G3G4","H3H4",null,null,"G3","G4","H3","H4","","",8]
[{"$nulls":26},"D3D4",null,"D1D5","A2A3",null,null,"D1","D5","A2","A3","","",9]
[{"$nulls":26},"A3A4",null,"B2B3","C2C3",null,null,"B2","B3","C2","C3","","",10]
[{"$nulls":26},"B3B4",null,"E2E3","F2F3",null,null,"E2","E3","F2","F3","","",11]
[{"$nulls":26},"C3C4",null,"G2G3","H2H3",null,null,"G2","G3","H2","H3","","",12]
[{"$nulls":26},"E3E4",null,"D2D3","A1A4",null,null,"D2","D3","A1","A4","","",13]
[{"$nulls":26},"F3F4",null,"B1B4","C1C4",null,null,"B1","B4","C1","C4","","",14]
[{"$nulls":26},"G3G4",null,"E1E4","F1F4",null,null,"E1","E4","F1","F4","","",15]
[{"$nulls":26},"H3H4",null,"G1G4","H1H4",null,null,"G1","G4","H1","H4","","",16]
[{"$nulls":26},"D1D5",null,"D4D5","A1A3",null,null,"D4","D5","A1","A3","","",17]
{"$rows_left_out":35}