{"text_format":"3","workbook":"xlsx","n_sheets":11,"sheets":["チーム表","対戦表","リーグ戦表","トーナメント表","優秀選手","DATA1","DATA","対戦表1","対戦表2","対戦表3","組合表"],"not_rendered":{"images":7,"macros":1,"defined_names":5},"read":"whole","date_system":"1900"}

{"sheet":"チーム表","index":0,"n_rows":45,"n_cols":11,"rows_kept":45,"merged":[[0,1,0,5],[1,1,1,4]]}
[null,"第２０回　加賀地域少年少女ドッジボール大会"]
[]
[null,"番号","ﾌﾞﾛｯｸ","チ　ー　ム　名","代表者名","県名"]
[null,1,"A1","鞍月アタッカーズ","廣岡　俊和","石川"]
[null,2,"A2","針原パイレーツ","木原　清志","富山"]
[null,3,"A3","小木クラブ","福田　陽三","石川"]
[null,4,"A4","NISHIファイヤースターズ","足滝　信雄","石川"]
[null,5,"B1","呉羽ドッジボールクラブ","久郷　巌","富山"]
[null,6,"B2","鳳至ドッジボールクラブ","中野　悟","石川"]
[null,7,"B3","千坂ドッジファイヤーズ","成瀬　章宏","石川"]
[null,8,"B4","松任の大魔陣","吉岡　正敏","石川"]
[null,9,"C1","光陽マーリンズ","上野　まどか","富山"]
[null,10,"C2","中郷ドッジボールクラブ","野崎　珠美","福井"]
[null,11,"C3","鵜川ミラクルフェニックス","新谷　信之","石川"]
[null,12,"C4","向本折クラブA","中嶋　大樹","石川"]
[null,13,"D1","飯野マジックス","村田　和孝","富山"]
[null,14,"D2","三馬パワフル","石田　一栄","石川"]
[null,15,"D3","寺井クラブ","端野　智博","石川"]
[null,16,"D4","大門ドッジボールクラブ","大橋　潤子","富山"]
[null,17,"D5","田上闘球DREAMS","盛一　純平","石川"]
[null,"Jr1","E1","鞍月アタッカーズジュニア","廣岡　俊和","石川",null,"E","F","G","H"]
[null,"Jr2","E2","鳳至ジュニア","中野　悟","石川",null,"鞍月","九十九","鞍月キ","呉羽"]
[null,"Jr3","E3","中郷ミラクルジュニア","野崎　珠美","福井",null,"鳳至","千坂","松任","NISHI"]
[null,"Jr4","E4","ドッジの王子様","石田　一栄","石川",null,"中郷","向本折","鵜川","寺井B"]
[null,"Jr5","F1","九十九クラブ","福田　陽三","石川",null,"ドッジ","寺井A","大門","田上"]
[null,"Jr6","F2","千坂ロータスルート","成瀬　章宏","石川"]
[null,"Jr7","F3","向本折クラブNew","中嶋　大樹","石川"]
[null,"Jr8","F4","寺井クラブＪｒ　A","端野　智博","石川"]
[null,"Jr9","G1","鞍月アタッカーズキッズ","廣岡　俊和","石川"]
[null,"Jr10","G2","松任の大魔陣Jr.","吉岡　正敏","石川"]
[null,"Jr11","G3","鵜川フェニックスジュニア","新谷　信之","石川"]
[null,"Jr12","G4","大門ドッジボールクラブJr","大橋　潤子","富山"]
[null,"Jr13","H1","呉羽DBCジュニア","久郷　巌","富山"]
[null,"Jr14","H2","NISHI　Jrスターズ","足滝　信雄","石川"]
[null,"Jr15","H3","寺井クラブＪｒ　B","端野　智博","石川"]
[null,"Jr16","H4","田上闘球FUTURES","盛一　純平","石川"]
[null,"一5","G5","魔陣一家","由水　伸弥"]
[null,"女１","H1","鞍月マミーズ","廣岡　俊和"]
[null,"女２","H2","NISHIヤングスターズ","足滝　信雄"]
[null,"女３","H3","山中Oba","中田　勝博"]
[null,"女４","H4","田上闘球HAPPYS","盛一　純平"]
[null,"女５","I1","チーム新米ママ","山田　ユカ子"]
[null,"女６","I2","千坂Ｍファイヤーズ","下野　高広"]
[null,"女７","I3","寺井Ｐ．P♪","山田　幸嗣"]
[null,"女８","I4","魔舞陣","由水　伸弥"]

{"sheet":"対戦表","index":1,"n_rows":164,"n_cols":34,"rows_kept":164,"merged":[[32,5,32,10],[32,15,32,20],[32,25,32,30],[33,5,33,10],[33,15,33,20],[33,25,33,30],[34,5,34,10],[34,15,34,20],[34,25,34,30],[35,5,35,10],[35,15,35,20],[35,25,35,30],[36,5,36,10],[36,15,36,20],[36,25,36,30],[37,5,37,10],[37,15,37,20],[37,25,37,30],[38,5,38,10],[38,15,38,20],[38,25,38,30],[39,5,39,10],[39,15,39,20],[40,5,40,10],[40,15,40,20],[41,5,41,10],[41,15,41,20],[41,25,41,30],[42,5,42,10],[42,15,42,20],[43,5,43,10],[43,15,43,20],[44,5,44,10],[44,15,44,20]]}
[{"$nulls":10},{"$f":"チーム表!$B$1","v":"第２０回　加賀地域少年少女ドッジボール大会"},{"$nulls":13},"予選試合数",26]
[]
["　試合スケジュール"]
[]
[null,"時間",null,null,"点","Ａコート",{"$nulls":3},"点","Ａコート",{"$nulls":3},"点","Ｂコート",{"$nulls":3},"点","Ｂコート"]
[1,"09:30:00",{"$f":"組合表!AG4","v":"D1"},{"$f":"CONCATENATE(C6,H6)","v":"D1D2"},null,{"$f":"VLOOKUP(C6,チーム表!C:D,2,FALSE)","v":"飯野マジックス"},"×",{"$f":"組合表!AH4","v":"D2"},{"$f":"CONCATENATE(H6,C6)","v":"D2D1"},null,{"$f":"VLOOKUP(H6,チーム表!C:D,2,FALSE)","v":"三馬パワフル"},null,{"$f":"組合表!AI4","v":"A1"},{"$f":"CONCATENATE(M6,R6)","v":"A1A2"},null,{"$f":"VLOOKUP(M6,チーム表!C:D,2,FALSE)","v":"鞍月アタッカーズ"},"×",{"$f":"組合表!AJ4","v":"A2"},{"$f":"CONCATENATE(R6,M6)","v":"A2A1"},null,{"$f":"VLOOKUP(R6,チーム表!C:D,2,FALSE)","v":"針原パイレーツ"},{"$nulls":11},{"$f":"D6","v":"D1D2"},{"$f":"IF(E6=\"\",\"\",E6)","v":""}]
[2,"09:40:00",{"$f":"組合表!AG5","v":"B1"},{"$f":"CONCATENATE(C7,H7)","v":"B1B2"},null,{"$f":"VLOOKUP(C7,チーム表!C:D,2,FALSE)","v":"呉羽ドッジボールクラブ"},"×",{"$f":"組合表!AH5","v":"B2"},{"$f":"CONCATENATE(H7,C7)","v":"B2B1"},null,{"$f":"VLOOKUP(H7,チーム表!C:D,2,FALSE)","v":"鳳至ドッジボールクラブ"},null,{"$f":"組合表!AI5","v":"C1"},{"$f":"CONCATENATE(M7,R7)","v":"C1C2"},null,{"$f":"VLOOKUP(M7,チーム表!C:D,2,FALSE)","v":"光陽マーリンズ"},"×",{"$f":"組合表!AJ5","v":"C2"},{"$f":"CONCATENATE(R7,M7)","v":"C2C1"},null,{"$f":"VLOOKUP(R7,チーム表!C:D,2,FALSE)","v":"中郷ドッジボールクラブ"},{"$nulls":11},"B1B2",{"$f":"IF(E7=\"\",\"\",E7)","v":""}]
[3,"09:50:00","D3","D3D4",null,{"$f":"VLOOKUP(C8,チーム表!C:D,2,FALSE)","v":"寺井クラブ"},"×","D4","D4D3",null,{"$f":"VLOOKUP(H8,チーム表!C:D,2,FALSE)","v":"大門ドッジボールクラブ"},null,"A3","A3A4",null,{"$f":"VLOOKUP(M8,チーム表!C:D,2,FALSE)","v":"小木クラブ"},"×","A4","A4A3",null,{"$f":"VLOOKUP(R8,チーム表!C:D,2,FALSE)","v":"NISHIファイヤースターズ"},{"$nulls":11},"D3D4",""]
[4,"10:00:00","B3","B3B4",null,{"$f":"VLOOKUP(C9,チーム表!C:D,2,FALSE)","v":"千坂ドッジファイヤーズ"},"×","B4","B4B3",null,{"$f":"VLOOKUP(H9,チーム表!C:D,2,FALSE)","v":"松任の大魔陣"},null,"C3","C3C4",null,{"$f":"VLOOKUP(M9,チーム表!C:D,2,FALSE)","v":"鵜川ミラクルフェニックス"},"×","C4","C4C3",null,{"$f":"VLOOKUP(R9,チーム表!C:D,2,FALSE)","v":"向本折クラブA"},{"$nulls":11},"B3B4",""]
[5,"10:10:00","D1","D1D5",null,{"$f":"VLOOKUP(C10,チーム表!C:D,2,FALSE)","v":"飯野マジックス"},"×","D5","D5D1",null,{"$f":"VLOOKUP(H10,チーム表!C:D,2,FALSE)","v":"田上闘球DREAMS"},null,"A2","A2A3",null,{"$f":"VLOOKUP(M10,チーム表!C:D,2,FALSE)","v":"針原パイレーツ"},"×","A3","A3A2",null,{"$f":"VLOOKUP(R10,チーム表!C:D,2,FALSE)","v":"小木クラブ"},{"$nulls":11},"D1D5",""]
[6,"10:20:00","B2","B2B3",null,{"$f":"VLOOKUP(C11,チーム表!C:D,2,FALSE)","v":"鳳至ドッジボールクラブ"},"×","B3","B3B2",null,{"$f":"VLOOKUP(H11,チーム表!C:D,2,FALSE)","v":"千坂ドッジファイヤーズ"},null,"C2","C2C3",null,{"$f":"VLOOKUP(M11,チーム表!C:D,2,FALSE)","v":"中郷ドッジボールクラブ"},"×","C3","C3C2",null,{"$f":"VLOOKUP(R11,チーム表!C:D,2,FALSE)","v":"鵜川ミラクルフェニックス"},{"$nulls":11},"B2B3",""]
[7,"10:30:00","D2","D2D3",null,{"$f":"VLOOKUP(C12,チーム表!C:D,2,FALSE)","v":"三馬パワフル"},"×","D3","D3D2",null,{"$f":"VLOOKUP(H12,チーム表!C:D,2,FALSE)","v":"寺井クラブ"},null,"A1","A1A4",null,{"$f":"VLOOKUP(M12,チーム表!C:D,2,FALSE)","v":"鞍月アタッカーズ"},"×","A4","A4A1",null,{"$f":"VLOOKUP(R12,チーム表!C:D,2,FALSE)","v":"NISHIファイヤースターズ"},{"$nulls":11},"D2D3",""]
[8,"10:40:00","E1","E1E2",null,{"$f":"VLOOKUP(C13,チーム表!C:D,2,FALSE)","v":"鞍月アタッカーズジュニア"},"×","E2","E2E1",null,{"$f":"VLOOKUP(H13,チーム表!C:D,2,FALSE)","v":"鳳至ジュニア"},null,"F1","F1F2",null,{"$f":"VLOOKUP(M13,チーム表!C:D,2,FALSE)","v":"九十九クラブ"},"×","F2","F2F1",null,{"$f":"VLOOKUP(R13,チーム表!C:D,2,FALSE)","v":"千坂ロータスルート"},{"$nulls":11},"E1E2",""]
[9,"10:50:00","G1","G1G2",null,{"$f":"VLOOKUP(C14,チーム表!C:D,2,FALSE)","v":"鞍月アタッカーズキッズ"},"×","G2","G2G1",null,{"$f":"VLOOKUP(H14,チーム表!C:D,2,FALSE)","v":"松任の大魔陣Jr."},null,"H1","H1H2",null,{"$f":"VLOOKUP(M14,チーム表!C:D,2,FALSE)","v":"呉羽DBCジュニア"},"×","H2","H2H1",null,{"$f":"VLOOKUP(R14,チーム表!C:D,2,FALSE)","v":"NISHI　Jrスターズ"},{"$nulls":11},"G1G2",""]
[10,"11:00:00","E3","E3E4",null,{"$f":"VLOOKUP(C15,チーム表!C:D,2,FALSE)","v":"中郷ミラクルジュニア"},"×","E4","E4E3",null,{"$f":"VLOOKUP(H15,チーム表!C:D,2,FALSE)","v":"ドッジの王子様"},null,"F3","F3F4",null,{"$f":"VLOOKUP(M15,チーム表!C:D,2,FALSE)","v":"向本折クラブNew"},"×","F4","F4F3",null,{"$f":"VLOOKUP(R15,チーム表!C:D,2,FALSE)","v":"寺井クラブＪｒ　A"},{"$nulls":11},"E3E4",""]
[11,"11:10:00","G3","G3G4",null,{"$f":"VLOOKUP(C16,チーム表!C:D,2,FALSE)","v":"鵜川フェニックスジュニア"},"×","G4","G4G3",null,{"$f":"VLOOKUP(H16,チーム表!C:D,2,FALSE)","v":"大門ドッジボールクラブJr"},null,"H3","H3H4",null,{"$f":"VLOOKUP(M16,チーム表!C:D,2,FALSE)","v":"寺井クラブＪｒ　B"},"×","H4","H4H3",null,{"$f":"VLOOKUP(R16,チーム表!C:D,2,FALSE)","v":"田上闘球FUTURES"},{"$nulls":11},"G3G4",""]
[12,"11:20:00","E2","E2E3",null,{"$f":"VLOOKUP(C17,チーム表!C:D,2,FALSE)","v":"鳳至ジュニア"},"×","E3","E3E2",null,{"$f":"VLOOKUP(H17,チーム表!C:D,2,FALSE)","v":"中郷ミラクルジュニア"},null,"F2","F2F3",null,{"$f":"VLOOKUP(M17,チーム表!C:D,2,FALSE)","v":"千坂ロータスルート"},"×","F3","F3F2",null,{"$f":"VLOOKUP(R17,チーム表!C:D,2,FALSE)","v":"向本折クラブNew"},{"$nulls":11},"E2E3",""]
[13,"11:30:00","G2","G2G3",null,{"$f":"VLOOKUP(C18,チーム表!C:D,2,FALSE)","v":"松任の大魔陣Jr."},"×","G3","G3G2",null,{"$f":"VLOOKUP(H18,チーム表!C:D,2,FALSE)","v":"鵜川フェニックスジュニア"},null,"H2","H2H3",null,{"$f":"VLOOKUP(M18,チーム表!C:D,2,FALSE)","v":"NISHI　Jrスターズ"},"×","H3","H3H2",null,{"$f":"VLOOKUP(R18,チーム表!C:D,2,FALSE)","v":"寺井クラブＪｒ　B"},{"$nulls":11},"G2G3",""]
[14,"11:40:00","E1","E1E4",null,{"$f":"VLOOKUP(C19,チーム表!C:D,2,FALSE)","v":"鞍月アタッカーズジュニア"},"×","E4","E4E1",null,{"$f":"VLOOKUP(H19,チーム表!C:D,2,FALSE)","v":"ドッジの王子様"},null,"F1","F1F4",null,{"$f":"VLOOKUP(M19,チーム表!C:D,2,FALSE)","v":"九十九クラブ"},"×","F4","F4F1",null,{"$f":"VLOOKUP(R19,チーム表!C:D,2,FALSE)","v":"寺井クラブＪｒ　A"},{"$nulls":11},"E1E4",""]
[15,"11:50:00","G1","G1G4",null,{"$f":"VLOOKUP(C20,チーム表!C:D,2,FALSE)","v":"鞍月アタッカーズキッズ"},"×","G4","G4G1",null,{"$f":"VLOOKUP(H20,チーム表!C:D,2,FALSE)","v":"大門ドッジボールクラブJr"},null,"H1","H1H4",null,{"$f":"VLOOKUP(M20,チーム表!C:D,2,FALSE)","v":"呉羽DBCジュニア"},"×","H4","H4H1",null,{"$f":"VLOOKUP(R20,チーム表!C:D,2,FALSE)","v":"田上闘球FUTURES"},{"$nulls":11},{"$f":"D20","v":"G1G4"},{"$f":"IF(E20=\"\",\"\",E20)","v":""}]
[{"$nulls":32},{"$f":"D22","v":"B1B4"},{"$f":"IF(E22=\"\",\"\",E22)","v":""}]
[16,"12:30:00","B1","B1B4",null,{"$f":"VLOOKUP(C22,チーム表!C:D,2,FALSE)","v":"呉羽ドッジボールクラブ"},"×","B4","B4B1",null,{"$f":"VLOOKUP(H22,チーム表!C:D,2,FALSE)","v":"松任の大魔陣"},null,"C1","C1C4",null,{"$f":"VLOOKUP(M22,チーム表!C:D,2,FALSE)","v":"光陽マーリンズ"},"×","C4","C4C1",null,{"$f":"VLOOKUP(R22,チーム表!C:D,2,FALSE)","v":"向本折クラブA"},{"$nulls":11},"D4D5",""]
[17,"12:40:00","D4","D4D5",null,{"$f":"VLOOKUP(C23,チーム表!C:D,2,FALSE)","v":"大門ドッジボールクラブ"},"×","D5","D5D4",null,{"$f":"VLOOKUP(H23,チーム表!C:D,2,FALSE)","v":"田上闘球DREAMS"},null,"A1","A1A3",null,{"$f":"VLOOKUP(M23,チーム表!C:D,2,FALSE)","v":"鞍月アタッカーズ"},"×","A3","A3A1",null,{"$f":"VLOOKUP(R23,チーム表!C:D,2,FALSE)","v":"小木クラブ"},{"$nulls":11},"B1B3",""]
[18,"12:50:00","B1","B1B3",null,{"$f":"VLOOKUP(C24,チーム表!C:D,2,FALSE)","v":"呉羽ドッジボールクラブ"},"×","B3","B3B1",null,{"$f":"VLOOKUP(H24,チーム表!C:D,2,FALSE)","v":"千坂ドッジファイヤーズ"},null,"C1","C1C3",null,{"$f":"VLOOKUP(M24,チーム表!C:D,2,FALSE)","v":"光陽マーリンズ"},"×","C3","C3C1",null,{"$f":"VLOOKUP(R24,チーム表!C:D,2,FALSE)","v":"鵜川ミラクルフェニックス"},{"$nulls":11},"D2D5",""]
[19,"13:00:00","D2","D2D5",null,{"$f":"VLOOKUP(C25,チーム表!C:D,2,FALSE)","v":"三馬パワフル"},"×","D5","D5D2",null,{"$f":"VLOOKUP(H25,チーム表!C:D,2,FALSE)","v":"田上闘球DREAMS"},null,"A2","A2A4",null,{"$f":"VLOOKUP(M25,チーム表!C:D,2,FALSE)","v":"針原パイレーツ"},"×","A4","A4A2",null,{"$f":"VLOOKUP(R25,チーム表!C:D,2,FALSE)","v":"NISHIファイヤースターズ"},{"$nulls":11},"D1D4",""]
[20,"13:10:00","D1","D1D4",null,{"$f":"VLOOKUP(C26,チーム表!C:D,2,FALSE)","v":"飯野マジックス"},"×","D4","D4D1",null,{"$f":"VLOOKUP(H26,チーム表!C:D,2,FALSE)","v":"大門ドッジボールクラブ"},null,"C2","C2C4",null,{"$f":"VLOOKUP(M26,チーム表!C:D,2,FALSE)","v":"中郷ドッジボールクラブ"},"×","C4","C4C2",null,{"$f":"VLOOKUP(R26,チーム表!C:D,2,FALSE)","v":"向本折クラブA"},{"$nulls":11},"B2B4",""]
[21,"13:20:00","B2","B2B4",null,{"$f":"VLOOKUP(C27,チーム表!C:D,2,FALSE)","v":"鳳至ドッジボールクラブ"},"×","B4","B4B2",null,{"$f":"VLOOKUP(H27,チーム表!C:D,2,FALSE)","v":"松任の大魔陣"},null,"D3","D3D5",null,{"$f":"VLOOKUP(M27,チーム表!C:D,2,FALSE)","v":"寺井クラブ"},"×","D5","D5D3",null,{"$f":"VLOOKUP(R27,チーム表!C:D,2,FALSE)","v":"田上闘球DREAMS"},{"$nulls":11},"D2D4",""]
[22,"13:30:00","D2","D2D4",null,{"$f":"VLOOKUP(C28,チーム表!C:D,2,FALSE)","v":"三馬パワフル"},"×","D4","D4D2",null,{"$f":"VLOOKUP(H28,チーム表!C:D,2,FALSE)","v":"大門ドッジボールクラブ"},null,"D1","D1D3",null,{"$f":"VLOOKUP(M28,チーム表!C:D,2,FALSE)","v":"飯野マジックス"},"×","D3","D3D1",null,{"$f":"VLOOKUP(R28,チーム表!C:D,2,FALSE)","v":"寺井クラブ"},{"$nulls":11},"E1E3",""]
[23,"13:40:00","E1","E1E3",null,{"$f":"VLOOKUP(C29,チーム表!C:D,2,FALSE)","v":"鞍月アタッカーズジュニア"},"×","E3","E3E1",null,{"$f":"VLOOKUP(H29,チーム表!C:D,2,FALSE)","v":"中郷ミラクルジュニア"},null,"F1","F1F3",null,{"$f":"VLOOKUP(M29,チーム表!C:D,2,FALSE)","v":"九十九クラブ"},"×","F3","F3F1",null,{"$f":"VLOOKUP(R29,チーム表!C:D,2,FALSE)","v":"向本折クラブNew"},{"$nulls":11},"G1G3",""]
[24,"13:50:00","G1","G1G3",null,{"$f":"VLOOKUP(C30,チーム表!C:D,2,FALSE)","v":"鞍月アタッカーズキッズ"},"×","G3","G3G1",null,{"$f":"VLOOKUP(H30,チーム表!C:D,2,FALSE)","v":"鵜川フェニックスジュニア"},null,"H1","H1H3",null,{"$f":"VLOOKUP(M30,チーム表!C:D,2,FALSE)","v":"呉羽DBCジュニア"},"×","H3","H3H1",null,{"$f":"VLOOKUP(R30,チーム表!C:D,2,FALSE)","v":"寺井クラブＪｒ　B"},{"$nulls":11},"E2E4",""]
[25,"14:00:00","E2","E2E4",null,{"$f":"VLOOKUP(C31,チーム表!C:D,2,FALSE)","v":"鳳至ジュニア"},"×","E4","E4E2",null,{"$f":"VLOOKUP(H31,チーム表!C:D,2,FALSE)","v":"ドッジの王子様"},null,"F2","F2F4",null,{"$f":"VLOOKUP(M31,チーム表!C:D,2,FALSE)","v":"千坂ロータスルート"},"×","F4","F4F2",null,{"$f":"VLOOKUP(R31,チーム表!C:D,2,FALSE)","v":"寺井クラブＪｒ　A"},{"$nulls":11},"G2G4",""]
[26,"14:10:00","G2","G2G4",null,{"$f":"VLOOKUP(C32,チーム表!C:D,2,FALSE)","v":"松任の大魔陣Jr."},"×","G4","G4G2",null,{"$f":"VLOOKUP(H32,チーム表!C:D,2,FALSE)","v":"大門ドッジボールクラブJr"},null,"H2","H2H4",null,{"$f":"VLOOKUP(M32,チーム表!C:D,2,FALSE)","v":"NISHI　Jrスターズ"},"×","H4","H4H2",null,{"$f":"VLOOKUP(R32,チーム表!C:D,2,FALSE)","v":"田上闘球FUTURES"},{"$nulls":11},{"$f":"#REF!","v":{"$error":"#REF!"}},{"$f":"IF(#REF!=\"\",\"\",#REF!)","v":{"$error":"#REF!"}}]
[27,"14:30:00",1,null,null,"決勝トーナメント　ジュニアの部　①",{"$nulls":9},"決勝トーナメント　ジュニアの部　①",{"$nulls":16},{"$f":"#REF!","v":{"$error":"#REF!"}},{"$f":"IF(#REF!=\"\",\"\",#REF!)","v":{"$error":"#REF!"}}]
[28,"14:40:00",2,null,null,"決勝トーナメント　ジュニアの部　②",{"$nulls":9},"決勝トーナメント　ジュニアの部　②",{"$nulls":16},{"$f":"#REF!","v":{"$error":"#REF!"}},{"$f":"IF(#REF!=\"\",\"\",#REF!)","v":{"$error":"#REF!"}}]
[29,"14:50:00",3,null,null,"交流トーナメント　レギュラーの部　③",{"$nulls":26},{"$f":"#REF!","v":{"$error":"#REF!"}},{"$f":"IF(#REF!=\"\",\"\",#REF!)","v":{"$error":"#REF!"}}]
[30,"15:00:00",4,null,null,"交流トーナメント　レギュラーの部　④",{"$nulls":9},"交流トーナメント　レギュラーの部　④",{"$nulls":16},{"$f":"#REF!","v":{"$error":"#REF!"}},{"$f":"IF(#REF!=\"\",\"\",#REF!)","v":{"$error":"#REF!"}}]
[31,"15:10:00",5,null,null,"交流トーナメント　レギュラーの部　⑤",{"$nulls":9},"交流トーナメント　レギュラーの部　⑤",{"$nulls":16},{"$f":"#REF!","v":{"$error":"#REF!"}},{"$f":"IF(#REF!=\"\",\"\",#REF!)","v":{"$error":"#REF!"}}]
[32,"15:20:00",6,null,null,"決勝トーナメント　ジュニアの部　準決勝　⑥",{"$nulls":9},"決勝トーナメント　ジュニアの部　準決勝　⑥",{"$nulls":16},{"$f":"#REF!","v":{"$error":"#REF!"}},{"$f":"IF(#REF!=\"\",\"\",#REF!)","v":{"$error":"#REF!"}}]
[33,"15:30:00",7,null,null,"決勝トーナメント　レギュラーの部　⑦",{"$nulls":9},"決勝トーナメント　レギュラーの部　⑦",{"$nulls":16},{"$f":"#REF!","v":{"$error":"#REF!"}},{"$f":"IF(#REF!=\"\",\"\",#REF!)","v":{"$error":"#REF!"}}]
[34,"15:40:00",8,null,null,"決勝トーナメント　レギュラーの部　⑧",{"$nulls":9},"決勝トーナメント　レギュラーの部　⑧",{"$nulls":16},{"$f":"#REF!","v":{"$error":"#REF!"}},{"$f":"IF(#REF!=\"\",\"\",#REF!)","v":{"$error":"#REF!"}}]
[35,"15:50:00",9,null,null,"交流トーナメント　レギュラーの部　準決勝　⑨",{"$nulls":9},"交流トーナメント　レギュラーの部　準決勝　⑨",{"$nulls":16},{"$f":"#REF!","v":{"$error":"#REF!"}},{"$f":"IF(#REF!=\"\",\"\",#REF!)","v":{"$error":"#REF!"}}]
[36,"16:00:00",10,null,null,"決勝トーナメント　ジュニアの部　３位決定戦　⑩",{"$nulls":9},"決勝トーナメント　ジュニアの部　決　勝　⑩",{"$nulls":16},{"$f":"#REF!","v":{"$error":"#REF!"}},{"$f":"IF(#REF!=\"\",\"\",#REF!)","v":{"$error":"#REF!"}}]
[37,"16:10:00",11,{"$nulls":12},"交流トーナメント　レギュラーの部　決　勝　⑪",{"$nulls":16},{"$f":"#REF!","v":{"$error":"#REF!"}},{"$f":"IF(#REF!=\"\",\"\",#REF!)","v":{"$error":"#REF!"}}]
[38,"16:20:00",12,null,null,"決勝トーナメント　レギュラーの部　準決勝　⑫",{"$nulls":9},"決勝トーナメント　レギュラーの部　準決勝　⑫",{"$nulls":16},{"$f":"#REF!","v":{"$error":"#REF!"}},{"$f":"IF(#REF!=\"\",\"\",#REF!)","v":{"$error":"#REF!"}}]
[39,"16:30:00",13,null,null,"決勝トーナメント　レギュラーの部　決　勝　⑬",{"$nulls":9},"決勝トーナメント　レギュラーの部　３位決定戦　⑬",{"$nulls":16},{"$f":"I6","v":"D2D1"},{"$f":"IF(J6=\"\",\"\",J6)","v":""}]
[{"$nulls":32},"B2B1",{"$f":"IF(J7=\"\",\"\",J7)","v":""}]
[{"$nulls":32},"D4D3",""]
[{"$nulls":32},"B4B3",""]
[{"$nulls":32},"D5D1",""]
[{"$nulls":32},"B3B2",""]
[{"$nulls":32},"D3D2",""]
[{"$nulls":32},"E2E1",""]
[{"$nulls":32},"G2G1",""]
[{"$nulls":32},"E4E3",""]
[{"$nulls":32},"G4G3",""]
[{"$nulls":32},"E3E2",""]
[{"$nulls":32},"G3G2",""]
[{"$nulls":32},"E4E1",""]
[{"$nulls":32},{"$f":"I20","v":"G4G1"},{"$f":"IF(J20=\"\",\"\",J20)","v":""}]
[{"$nulls":32},{"$f":"I22","v":"B4B1"},{"$f":"IF(J22=\"\",\"\",J22)","v":""}]
[{"$nulls":32},"D5D4",""]
[{"$nulls":32},"B3B1",""]
[{"$nulls":32},"D5D2",""]
[{"$nulls":32},"D4D1",""]
[{"$nulls":32},"B4B2",""]
[{"$nulls":32},"D4D2",""]
[{"$nulls":32},"E3E1",""]
[{"$nulls":32},"G3G1",""]
[{"$nulls":32},"E4E2",""]
[{"$nulls":32},"G4G2",""]
[{"$nulls":32},{"$f":"#REF!","v":{"$error":"#REF!"}},{"$f":"IF(#REF!=\"\",\"\",#REF!)","v":{"$error":"#REF!"}}]
[{"$nulls":32},{"$f":"#REF!","v":{"$error":"#REF!"}},{"$f":"IF(#REF!=\"\",\"\",#REF!)","v":{"$error":"#REF!"}}]
[{"$nulls":32},{"$f":"#REF!","v":{"$error":"#REF!"}},{"$f":"IF(#REF!=\"\",\"\",#REF!)","v":{"$error":"#REF!"}}]
[{"$nulls":32},{"$f":"#REF!","v":{"$error":"#REF!"}},{"$f":"IF(#REF!=\"\",\"\",#REF!)","v":{"$error":"#REF!"}}]
[{"$nulls":32},{"$f":"#REF!","v":{"$error":"#REF!"}},{"$f":"IF(#REF!=\"\",\"\",#REF!)","v":{"$error":"#REF!"}}]
[{"$nulls":32},{"$f":"#REF!","v":{"$error":"#REF!"}},{"$f":"IF(#REF!=\"\",\"\",#REF!)","v":{"$error":"#REF!"}}]
[{"$nulls":32},{"$f":"#REF!","v":{"$error":"#REF!"}},{"$f":"IF(#REF!=\"\",\"\",#REF!)","v":{"$error":"#REF!"}}]
[{"$nulls":32},{"$f":"#REF!","v":{"$error":"#REF!"}},{"$f":"IF(#REF!=\"\",\"\",#REF!)","v":{"$error":"#REF!"}}]
[{"$nulls":32},{"$f":"#REF!","v":{"$error":"#REF!"}},{"$f":"IF(#REF!=\"\",\"\",#REF!)","v":{"$error":"#REF!"}}]
[{"$nulls":32},{"$f":"#REF!","v":{"$error":"#REF!"}},{"$f":"IF(#REF!=\"\",\"\",#REF!)","v":{"$error":"#REF!"}}]
[{"$nulls":32},{"$f":"#REF!","v":{"$error":"#REF!"}},{"$f":"IF(#REF!=\"\",\"\",#REF!)","v":{"$error":"#REF!"}}]
[{"$nulls":32},{"$f":"#REF!","v":{"$error":"#REF!"}},{"$f":"IF(#REF!=\"\",\"\",#REF!)","v":{"$error":"#REF!"}}]
[{"$nulls":32},{"$f":"#REF!","v":{"$error":"#REF!"}},{"$f":"IF(#REF!=\"\",\"\",#REF!)","v":{"$error":"#REF!"}}]
[{"$nulls":32},{"$f":"#REF!","v":{"$error":"#REF!"}},{"$f":"IF(#REF!=\"\",\"\",#REF!)","v":{"$error":"#REF!"}}]
[{"$nulls":32},{"$f":"N6","v":"A1A2"},{"$f":"IF(O6=\"\",\"\",O6)","v":""}]
[{"$nulls":32},"C1C2",{"$f":"IF(O7=\"\",\"\",O7)","v":""}]
[{"$nulls":32},"A3A4",""]
[{"$nulls":32},"C3C4",""]
[{"$nulls":32},"A2A3",""]
[{"$nulls":32},"C2C3",""]
[{"$nulls":32},"A1A4",""]
[{"$nulls":32},"F1F2",""]
[{"$nulls":32},"H1H2",""]
[{"$nulls":32},"F3F4",""]
[{"$nulls":32},"H3H4",""]
[{"$nulls":32},"F2F3",""]
[{"$nulls":32},"H2H3",""]
[{"$nulls":32},"F1F4",""]
[{"$nulls":32},{"$f":"N20","v":"H1H4"},{"$f":"IF(O20=\"\",\"\",O20)","v":""}]
[{"$nulls":32},{"$f":"N22","v":"C1C4"},{"$f":"IF(O22=\"\",\"\",O22)","v":""}]
[{"$nulls":32},"A1A3",""]
[{"$nulls":32},"C1C3",""]
[{"$nulls":32},"A2A4",""]
[{"$nulls":32},"C2C4",""]
[{"$nulls":32},"D3D5",""]
[{"$nulls":32},"D1D3",""]
[{"$nulls":32},"F1F3",""]
[{"$nulls":32},"H1H3",""]
[{"$nulls":32},"F2F4",""]
[{"$nulls":32},"H2H4",""]
[{"$nulls":32},{"$f":"#REF!","v":{"$error":"#REF!"}},{"$f":"IF(#REF!=\"\",\"\",#REF!)","v":{"$error":"#REF!"}}]
[{"$nulls":32},{"$f":"#REF!","v":{"$error":"#REF!"}},{"$f":"IF(#REF!=\"\",\"\",#REF!)","v":{"$error":"#REF!"}}]
[{"$nulls":32},{"$f":"#REF!","v":{"$error":"#REF!"}},{"$f":"IF(#REF!=\"\",\"\",#REF!)","v":{"$error":"#REF!"}}]
[{"$nulls":32},{"$f":"#REF!","v":{"$error":"#REF!"}},{"$f":"IF(#REF!=\"\",\"\",#REF!)","v":{"$error":"#REF!"}}]
[{"$nulls":32},{"$f":"#REF!","v":{"$error":"#REF!"}},{"$f":"IF(#REF!=\"\",\"\",#REF!)","v":{"$error":"#REF!"}}]
[{"$nulls":32},{"$f":"#REF!","v":{"$error":"#REF!"}},{"$f":"IF(#REF!=\"\",\"\",#REF!)","v":{"$error":"#REF!"}}]
[{"$nulls":32},{"$f":"#REF!","v":{"$error":"#REF!"}},{"$f":"IF(#REF!=\"\",\"\",#REF!)","v":{"$error":"#REF!"}}]
[{"$nulls":32},{"$f":"#REF!","v":{"$error":"#REF!"}},{"$f":"IF(#REF!=\"\",\"\",#REF!)","v":{"$error":"#REF!"}}]
[{"$nulls":32},{"$f":"#REF!","v":{"$error":"#REF!"}},{"$f":"IF(#REF!=\"\",\"\",#REF!)","v":{"$error":"#REF!"}}]
[{"$nulls":32},{"$f":"#REF!","v":{"$error":"#REF!"}},{"$f":"IF(#REF!=\"\",\"\",#REF!)","v":{"$error":"#REF!"}}]
[{"$nulls":32},{"$f":"#REF!","v":{"$error":"#REF!"}},{"$f":"IF(#REF!=\"\",\"\",#REF!)","v":{"$error":"#REF!"}}]
[{"$nulls":32},{"$f":"#REF!","v":{"$error":"#REF!"}},{"$f":"IF(#REF!=\"\",\"\",#REF!)","v":{"$error":"#REF!"}}]
[{"$nulls":32},{"$f":"#REF!","v":{"$error":"#REF!"}},{"$f":"IF(#REF!=\"\",\"\",#REF!)","v":{"$error":"#REF!"}}]
[{"$nulls":32},{"$f":"#REF!","v":{"$error":"#REF!"}},{"$f":"IF(#REF!=\"\",\"\",#REF!)","v":{"$error":"#REF!"}}]
[{"$nulls":32},{"$f":"S6","v":"A2A1"},{"$f":"IF(T6=\"\",\"\",T6)","v":""}]
[{"$nulls":32},"C2C1",{"$f":"IF(T7=\"\",\"\",T7)","v":""}]
[{"$nulls":32},"A4A3",""]
[{"$nulls":32},"C4C3",""]
[{"$nulls":32},"A3A2",""]
[{"$nulls":32},"C3C2",""]
[{"$nulls":32},"A4A1",""]
[{"$nulls":32},"F2F1",""]
[{"$nulls":32},"H2H1",""]
[{"$nulls":32},"F4F3",""]
[{"$nulls":32},"H4H3",""]
[{"$nulls":32},"F3F2",""]
[{"$nulls":32},"H3H2",""]
[{"$nulls":32},"F4F1",""]
[{"$nulls":32},{"$f":"S20","v":"H4H1"},{"$f":"IF(T20=\"\",\"\",T20)","v":""}]
[{"$nulls":32},{"$f":"S22","v":"C4C1"},{"$f":"IF(T22=\"\",\"\",T22)","v":""}]
[{"$nulls":32},"A3A1",""]
[{"$nulls":32},"C3C1",""]
[{"$nulls":32},"A4A2",""]
[{"$nulls":32},"C4C2",""]
[{"$nulls":32},"D5D3",""]
[{"$nulls":32},"D3D1",""]
[{"$nulls":32},"F3F1",""]
[{"$nulls":32},"H3H1",""]
[{"$nulls":32},"F4F2",""]
[{"$nulls":32},"H4H2",""]
[{"$nulls":32},{"$f":"#REF!","v":{"$error":"#REF!"}},{"$f":"IF(#REF!=\"\",\"\",#REF!)","v":{"$error":"#REF!"}}]
[{"$nulls":32},{"$f":"#REF!","v":{"$error":"#REF!"}},{"$f":"IF(#REF!=\"\",\"\",#REF!)","v":{"$error":"#REF!"}}]
[{"$nulls":32},{"$f":"#REF!","v":{"$error":"#REF!"}},{"$f":"IF(#REF!=\"\",\"\",#REF!)","v":{"$error":"#REF!"}}]
[{"$nulls":32},{"$f":"#REF!","v":{"$error":"#REF!"}},{"$f":"IF(#REF!=\"\",\"\",#REF!)","v":{"$error":"#REF!"}}]
[{"$nulls":32},{"$f":"#REF!","v":{"$error":"#REF!"}},{"$f":"IF(#REF!=\"\",\"\",#REF!)","v":{"$error":"#REF!"}}]
[{"$nulls":32},{"$f":"#REF!","v":{"$error":"#REF!"}},{"$f":"IF(#REF!=\"\",\"\",#REF!)","v":{"$error":"#REF!"}}]
[{"$nulls":32},{"$f":"#REF!","v":{"$error":"#REF!"}},{"$f":"IF(#REF!=\"\",\"\",#REF!)","v":{"$error":"#REF!"}}]
[{"$nulls":32},{"$f":"#REF!","v":{"$error":"#REF!"}},{"$f":"IF(#REF!=\"\",\"\",#REF!)","v":{"$error":"#REF!"}}]
[{"$nulls":32},{"$f":"#REF!","v":{"$error":"#REF!"}},{"$f":"IF(#REF!=\"\",\"\",#REF!)","v":{"$error":"#REF!"}}]
[{"$nulls":32},{"$f":"#REF!","v":{"$error":"#REF!"}},{"$f":"IF(#REF!=\"\",\"\",#REF!)","v":{"$error":"#REF!"}}]
[{"$nulls":32},{"$f":"#REF!","v":{"$error":"#REF!"}},{"$f":"IF(#REF!=\"\",\"\",#REF!)","v":{"$error":"#REF!"}}]
[{"$nulls":32},{"$f":"#REF!","v":{"$error":"#REF!"}},{"$f":"IF(#REF!=\"\",\"\",#REF!)","v":{"$error":"#REF!"}}]
[{"$nulls":32},{"$f":"#REF!","v":{"$error":"#REF!"}},{"$f":"IF(#REF!=\"\",\"\",#REF!)","v":{"$error":"#REF!"}}]
[{"$nulls":32},{"$f":"#REF!","v":{"$error":"#REF!"}},{"$f":"IF(#REF!=\"\",\"\",#REF!)","v":{"$error":"#REF!"}}]

{"sheet":"リーグ戦表","index":2,"n_rows":100,"n_cols":35,"rows_kept":100,"merged":[[1,2,1,11],[4,0,5,0],[4,1,5,2],[4,3,5,5],[4,6,5,8],[4,9,5,11],[4,12,5,14],[4,15,5,17],[4,18,5,20],[4,21,5,23],[4,24,5,24],[4,25,5,25],[4,26,5,26],[4,27,5,27],[4,28,5,28],[4,29,5,29],[4,30,5,30],[4,31,5,31],[4,32,5,32],[6,0,7,0],[6,1,7,2],[6,3,7,5],[6,24,7,24],[6,25,7,25],[6,26,7,26],[6,27,7,27],[6,28,7,28],[6,29,7,29],[6,30,7,30],[6,31,7,31],[6,32,7,32],[8,0,9,0],[8,1,9,2],[8,6,9,8],[8,24,9,24],[8,25,9,25],[8,26,9,26],[8,27,9,27],[8,28,9,28],[8,29,9,29],[8,30,9,30],[8,31,9,31],[8,32,9,32],[10,0,11,0],[10,1,11,2],[10,9,11,11],[10,24,11,24],[10,25,11,25],[10,26,11,26],[10,27,11,27],[10,28,11,28],[10,29,11,29],[10,30,11,30],[10,31,11,31],[10,32,11,32],[12,0,13,0],[12,1,13,2],[12,12,13,14],[12,24,13,24],[12,25,13,25],[12,26,13,26],[12,27,13,27],[12,28,13,28],[12,29,13,29],[12,30,13,30],[12,31,13,31],[12,32,13,32],[16,0,17,0],[16,1,17,2],[16,3,17,5],[16,6,17,8],[16,9,17,11],[16,12,17,14],[16,15,17,17],[16,18,17,20],[16,21,17,23],[16,24,17,24],[16,25,17,25],[16,26,17,26],[16,27,17,27],[16,28,17,28],[16,29,17,29],[16,30,17,30],[16,31,17,31],[16,32,17,32],[18,0,19,0],[18,1,19,2],[18,3,19,5],[18,24,19,24],[18,25,19,25],[18,26,19,26],[18,27,19,27],[18,28,19,28],[18,29,19,29],[18,30,19,30],[18,31,19,31],[18,32,19,32],[20,0,21,0],[20,1,21,2],[20,6,21,8],[20,24,21,24],[20,25,21,25],[20,26,21,26],[20,27,21,27],[20,28,21,28],[20,29,21,29],[20,30,21,30],[20,31,21,31],[20,32,21,32],[22,0,23,0],[22,1,23,2],[22,9,23,11],[22,24,23,24],[22,25,23,25],[22,26,23,26],[22,27,23,27],[22,28,23,28],[22,29,23,29],[22,30,23,30],[22,31,23,31],[22,32,23,32],[24,0,25,0],[24,1,25,2],[24,12,25,14],[24,24,25,24],[24,25,25,25],[24,26,25,26],[24,27,25,27],[24,28,25,28],[24,29,25,29],[24,30,25,30],[24,31,25,31],[24,32,25,32],[28,0,29,0],[28,1,29,2],[28,3,29,5],[28,6,29,8],[28,9,29,11],[28,12,29,14],[28,15,29,17],[28,18,29,20],[28,21,29,23],[28,24,29,24],[28,25,29,25],[28,26,29,26],[28,27,29,27],[28,28,29,28],[28,29,29,29],[28,30,29,30],[28,31,29,31],[28,32,29,32],[30,0,31,0],[30,1,31,2],[30,3,31,5],[30,24,31,24],[30,25,31,25],[30,26,31,26],[30,27,31,27],[30,28,31,28],[30,29,31,29],[30,30,31,30],[30,31,31,31],[30,32,31,32],[32,0,33,0],[32,1,33,2],[32,6,33,8],[32,24,33,24],[32,25,33,25],[32,26,33,26],[32,27,33,27],[32,28,33,28],[32,29,33,29],[32,30,33,30],[32,31,33,31],[32,32,33,32],[34,0,35,0],[34,1,35,2],[34,9,35,11],[34,24,35,24],[34,25,35,25],[34,26,35,26],[34,27,35,27],[34,28,35,28],[34,29,35,29],[34,30,35,30],[34,31,35,31],[34,32,35,32],[36,0,37,0],[36,1,37,2],[36,12,37,14],[36,24,37,24],[36,25,37,25],[36,26,37,26],[36,27,37,27],[36,28,37,28],[36,29,37,29],[36,30,37,30],[36,31,37,31],[36,32,37,32],[40,0,41,0],[40,1,41,2],[40,3,41,5],[40,6,41,8],[40,9,41,11],[40,12,41,14],[40,15,41,17],[40,18,41,20],[40,21,41,23],[40,24,41,24],[40,25,41,25],[40,26,41,26],[40,27,41,27],[40,28,41,28],[40,29,41,29],[40,30,41,30],[40,31,41,31],[40,32,41,32],[42,0,43,0],[42,1,43,2],[42,3,43,5],[42,24,43,24],[42,25,43,25],[42,26,43,26],[42,27,43,27],[42,28,43,28],[42,29,43,29],[42,30,43,30],[42,31,43,31],[42,32,43,32],[44,0,45,0],[44,1,45,2],[44,6,45,8],[44,24,45,24],[44,25,45,25],[44,26,45,26],[44,27,45,27],[44,28,45,28],[44,29,45,29],[44,30,45,30],[44,31,45,31],[44,32,45,32],[46,0,47,0],[46,1,47,2],[46,9,47,11],[46,24,47,24],[46,25,47,25],[46,26,47,26],[46,27,47,27],[46,28,47,28],[46,29,47,29],[46,30,47,30],[46,31,47,31],[46,32,47,32],[48,0,49,0],[48,1,49,2],[48,12,49,14],[48,24,49,24],[48,25,49,25],[48,26,49,26],[48,27,49,27],[48,28,49,28],[48,29,49,29],[48,30,49,30],[48,31,49,31],[48,32,49,32],[50,0,51,0],[50,1,51,2],[50,15,51,17],[50,24,51,24],[50,25,51,25],[50,26,51,26],[50,27,51,27],[50,28,51,28],[50,29,51,29],[50,30,51,30],[50,31,51,31],[50,32,51,32],[54,0,55,0],[54,1,55,2],[54,3,55,5],[54,6,55,8],[54,9,55,11],[54,12,55,14],[54,15,55,17],[54,18,55,20],[54,21,55,23],[54,24,55,24],[54,25,55,25],[54,26,55,26],[54,27,55,27],[54,28,55,28],[54,29,55,29],[54,30,55,30],[54,31,55,31],[54,32,55,32],[56,0,57,0],[56,1,57,2],[56,3,57,5],[56,24,57,24],[56,25,57,25],[56,26,57,26],[56,27,57,27],[56,28,57,28],[56,29,57,29],[56,30,57,30],[56,31,57,31],[56,32,57,32],[58,0,59,0],[58,1,59,2],[58,6,59,8],[58,24,59,24],[58,25,59,25],[58,26,59,26],[58,27,59,27],[58,28,59,28],[58,29,59,29],[58,30,59,30],[58,31,59,31],[58,32,59,32],[60,0,61,0],[60,1,61,2],[60,9,61,11],[60,24,61,24],[60,25,61,25],[60,26,61,26],[60,27,61,27],[60,28,61,28],[60,29,61,29],[60,30,61,30],[60,31,61,31],[60,32,61,32],[62,0,63,0],[62,1,63,2],[62,12,63,14],[62,24,63,24],[62,25,63,25],[62,26,63,26],[62,27,63,27],[62,28,63,28],[62,29,63,29],[62,30,63,30],[62,31,63,31],[62,32,63,32],[66,0,67,0],[66,1,67,2],[66,3,67,5],[66,6,67,8],[66,9,67,11],[66,12,67,14],[66,15,67,17],[66,18,67,20],[66,21,67,23],[66,24,67,24],[66,25,67,25],[66,26,67,26],[66,27,67,27],[66,28,67,28],[66,29,67,29],[66,30,67,30],[66,31,67,31],[66,32,67,32],[68,0,69,0],[68,1,69,2],[68,3,69,5],[68,24,69,24],[68,25,69,25],[68,26,69,26],[68,27,69,27],[68,28,69,28],[68,29,69,29],[68,30,69,30],[68,31,69,31],[68,32,69,32],[70,0,71,0],[70,1,71,2],[70,6,71,8],[70,24,71,24],[70,25,71,25],[70,26,71,26],[70,27,71,27],[70,28,71,28],[70,29,71,29],[70,30,71,30],[70,31,71,31],[70,32,71,32],[72,0,73,0],[72,1,73,2],[72,9,73,11],[72,24,73,24],[72,25,73,25],[72,26,73,26],[72,27,73,27],[72,28,73,28],[72,29,73,29],[72,30,73,30],[72,31,73,31],[72,32,73,32],[74,0,75,0],[74,1,75,2],[74,12,75,14],[74,24,75,24],[74,25,75,25],[74,26,75,26],[74,27,75,27],[74,28,75,28],[74,29,75,29],[74,30,75,30],[74,31,75,31],[74,32,75,32],[78,0,79,0],[78,1,79,2],[78,3,79,5],[78,6,79,8],[78,9,79,11],[78,12,79,14],[78,15,79,17],[78,18,79,20],[78,21,79,23],[78,24,79,24],[78,25,79,25],[78,26,79,26],[78,27,79,27],[78,28,79,28],[78,29,79,29],[78,30,79,30],[78,31,79,31],[78,32,79,32],[80,0,81,0],[80,1,81,2],[80,3,81,5],[80,24,81,24],[80,25,81,25],[80,26,81,26],[80,27,81,27],[80,28,81,28],[80,29,81,29],[80,30,81,30],[80,31,81,31],[80,32,81,32],[82,0,83,0],[82,1,83,2],[82,6,83,8],[82,24,83,24],[82,25,83,25],[82,26,83,26],[82,27,83,27],[82,28,83,28],[82,29,83,29],[82,30,83,30],[82,31,83,31],[82,32,83,32],[84,0,85,0],[84,1,85,2],[84,9,85,11],[84,24,85,24],[84,25,85,25],[84,26,85,26],[84,27,85,27],[84,28,85,28],[84,29,85,29],[84,30,85,30],[84,31,85,31],[84,32,85,32],[86,0,87,0],[86,1,87,2],[86,12,87,14],[86,24,87,24],[86,25,87,25],[86,26,87,26],[86,27,87,27],[86,28,87,28],[86,29,87,29],[86,30,87,30],[86,31,87,31],[86,32,87,32],[90,0,91,0],[90,1,91,2],[90,3,91,5],[90,6,91,8],[90,9,91,11],[90,12,91,14],[90,15,91,17],[90,18,91,20],[90,21,91,23],[90,24,91,24],[90,25,91,25],[90,26,91,26],[90,27,91,27],[90,28,91,28],[90,29,91,29],[90,30,91,30],[90,31,91,31],[90,32,91,32],[92,0,93,0],[92,1,93,2],[92,3,93,5],[92,24,93,24],[92,25,93,25],[92,26,93,26],[92,27,93,27],[92,28,93,28],[92,29,93,29],[92,30,93,30],[92,31,93,31],[92,32,93,32],[94,0,95,0],[94,1,95,2],[94,6,95,8],[94,24,95,24],[94,25,95,25],[94,26,95,26],[94,27,95,27],[94,28,95,28],[94,29,95,29],[94,30,95,30],[94,31,95,31],[94,32,95,32],[96,0,97,0],[96,1,97,2],[96,9,97,11],[96,24,97,24],[96,25,97,25],[96,26,97,26],[96,27,97,27],[96,28,97,28],[96,29,97,29],[96,30,97,30],[96,31,97,31],[96,32,97,32],[98,0,99,0],[98,1,99,2],[98,12,99,14],[98,24,99,24],[98,25,99,25],[98,26,99,26],[98,27,99,27],[98,28,99,28],[98,29,99,29],[98,30,99,30],[98,31,99,31],[98,32,99,32]]}
[null,null,{"$f":"チーム表!$B$1","v":"第２０回　加賀地域少年少女ドッジボール大会"}]
[null,null,"リーグ戦表"]
[null,"レギュラーの部"]
[{"$nulls":4},{"$f":"CONCATENATE(A5,\"1\")","v":"A1"},null,null,{"$f":"CONCATENATE(A5,\"2\")","v":"A2"},null,null,{"$f":"CONCATENATE(A5,\"3\")","v":"A3"},null,null,{"$f":"CONCATENATE(A5,\"4\")","v":"A4"}]
["A","チーム名",null,{"$f":"B7","v":"鞍月アタッカーズ"},null,null,{"$f":"B9","v":"針原パイレーツ"},null,null,{"$f":"B11","v":"小木クラブ"},null,null,{"$f":"B13","v":"NISHIファイヤースターズ"},{"$nulls":11},"勝","負","分","点","内野","順位決定点","相手内野","順位","kaku"]
[]
[{"$f":"CONCATENATE(A5,1)","v":"A1"},{"$f":"VLOOKUP(A7,チーム表!C:D,2,FALSE)","v":"鞍月アタッカーズ"},{"$nulls":22},{"$f":"COUNTIF($E7:$N7,\"〇\")","v":0},{"$f":"COUNTIF($E7:$N7,\"×\")","v":0},{"$f":"COUNTIF($E7:$N7,\"△\")","v":0},{"$f":"Y7*2+AA7","v":0},{"$f":"IF(G8=\"\",\"\",D8+G8+M8+J8)","v":""},{"$f":"IF(AC7=\"\",\"\",AB7*100+AC7)","v":""},{"$f":"IF(AC7=\"\",\"\",F8+I8+L8+O8)","v":""},{"$f":"IF(AD7=\"\",\"\",RANK(AD7,AD7:AD14,0))","v":""},null,{"$f":"CONCATENATE(A5,AF7)","v":"A"},{"$f":"B7","v":"鞍月アタッカーズ"}]
[]
[{"$f":"CONCATENATE(A5,2)","v":"A2"},{"$f":"VLOOKUP(A9,チーム表!C:D,2,FALSE)","v":"針原パイレーツ"},null,null,{"$f":"IF(D10=\"\",\"\",IF(D10=F10,\"△\",IF(D10>F10,\"〇\",\"×\")))","v":""},{"$nulls":19},{"$f":"COUNTIF($E9:$N9,\"〇\")","v":0},{"$f":"COUNTIF($E9:$N9,\"×\")","v":0},{"$f":"COUNTIF($E9:$N9,\"△\")","v":0},{"$f":"Y9*2+AA9","v":0},{"$f":"IF(D10=\"\",\"\",D10+G10+M10+J10)","v":""},{"$f":"IF(AC9=\"\",\"\",AB9*100+AC9)","v":""},{"$f":"IF(AC9=\"\",\"\",F10+I10+L10+O10)","v":""},{"$f":"IF(AD9=\"\",\"\",RANK(AD9,AD7:AD14,0))","v":""},null,{"$f":"CONCATENATE(A5,AF9)","v":"A"},{"$f":"B9","v":"針原パイレーツ"}]
[{"$nulls":3},{"$f":"IF(I8=\"\",\"\",I8)","v":""},"-",{"$f":"IF(G8=\"\",\"\",G8)","v":""}]
[{"$f":"CONCATENATE(A5,3)","v":"A3"},{"$f":"VLOOKUP(A11,チーム表!C:D,2,FALSE)","v":"小木クラブ"},null,null,{"$f":"IF(D12=\"\",\"\",IF(D12=F12,\"△\",IF(D12>F12,\"〇\",\"×\")))","v":""},{"$nulls":19},{"$f":"COUNTIF($E11:$N11,\"〇\")","v":0},{"$f":"COUNTIF($E11:$N11,\"×\")","v":0},{"$f":"COUNTIF($E11:$N11,\"△\")","v":0},{"$f":"Y11*2+AA11","v":0},{"$f":"IF(G12=\"\",\"\",D12+G12+M12+J12)","v":""},{"$f":"IF(AC11=\"\",\"\",AB11*100+AC11)","v":""},{"$f":"IF(AC11=\"\",\"\",F12+I12+L12+O12)","v":""},{"$f":"IF(AD11=\"\",\"\",RANK(AD11,AD7:AD14,0))","v":""},null,{"$f":"CONCATENATE(A5,AF11)","v":"A"},{"$f":"B11","v":"小木クラブ"}]
[{"$nulls":3},{"$f":"IF(L8=\"\",\"\",L8)","v":""},"-",{"$f":"IF(J8=\"\",\"\",J8)","v":""}]
[{"$f":"CONCATENATE(A5,4)","v":"A4"},{"$f":"VLOOKUP(A13,チーム表!C:D,2,FALSE)","v":"NISHIファイヤースターズ"},null,null,{"$f":"IF(D14=\"\",\"\",IF(D14=F14,\"△\",IF(D14>F14,\"〇\",\"×\")))","v":""},null,null,{"$f":"IF(G14=\"\",\"\",IF(G14=I14,\"△\",IF(G14>I14,\"〇\",\"×\")))","v":""},null,null,{"$f":"IF(J14=\"\",\"\",IF(J14=L14,\"△\",IF(J14>L14,\"〇\",\"×\")))","v":""},{"$nulls":13},{"$f":"COUNTIF($E13:$N13,\"〇\")","v":0},{"$f":"COUNTIF($E13:$N13,\"×\")","v":0},{"$f":"COUNTIF($E13:$N13,\"△\")","v":0},{"$f":"Y13*2+AA13","v":0},{"$f":"IF(G14=\"\",\"\",D14+G14+M14+J14)","v":""},{"$f":"IF(AC13=\"\",\"\",AB13*100+AC13)","v":""},{"$f":"IF(AC13=\"\",\"\",F14+I14+L14+O14)","v":""},{"$f":"IF(AD13=\"\",\"\",RANK(AD13,AD7:AD14,0))","v":""},null,{"$f":"CONCATENATE(A5,AF13)","v":"A"},{"$f":"B13","v":"NISHIファイヤースターズ"}]
[{"$nulls":3},{"$f":"IF(O8=\"\",\"\",O8)","v":""},"-",{"$f":"IF(M8=\"\",\"\",M8)","v":""},{"$f":"IF(O10=\"\",\"\",O10)","v":""},"-",{"$f":"IF(M10=\"\",\"\",M10)","v":""},{"$f":"IF(O12=\"\",\"\",O12)","v":""},"-",{"$f":"IF(M12=\"\",\"\",M12)","v":""}]
[]
[{"$nulls":4},{"$f":"CONCATENATE(A17,\"1\")","v":"B1"},null,null,{"$f":"CONCATENATE(A17,\"2\")","v":"B2"},null,null,{"$f":"CONCATENATE(A17,\"3\")","v":"B3"},null,null,{"$f":"CONCATENATE(A17,\"4\")","v":"B4"}]
["B","チーム名",null,{"$f":"B19","v":"呉羽ドッジボールクラブ"},null,null,{"$f":"B21","v":"鳳至ドッジボールクラブ"},null,null,{"$f":"B23","v":"千坂ドッジファイヤーズ"},null,null,{"$f":"B25","v":"松任の大魔陣"},{"$nulls":11},"勝","負","分","点","内野","順位決定点","相手内野","順位","kaku"]
[]
[{"$f":"CONCATENATE(A17,1)","v":"B1"},{"$f":"VLOOKUP(A19,チーム表!C:D,2,FALSE)","v":"呉羽ドッジボールクラブ"},{"$nulls":22},{"$f":"COUNTIF($E19:$N19,\"〇\")","v":0},{"$f":"COUNTIF($E19:$N19,\"×\")","v":0},{"$f":"COUNTIF($E19:$N19,\"△\")","v":0},{"$f":"Y19*2+AA19","v":0},{"$f":"IF(G20=\"\",\"\",D20+G20+M20+J20)","v":""},{"$f":"IF(AC19=\"\",\"\",AB19*100+AC19)","v":""},{"$f":"IF(AC19=\"\",\"\",F20+I20+L20+O20)","v":""},{"$f":"IF(AD19=\"\",\"\",RANK(AD19,AD19:AD26,0))","v":""},null,{"$f":"CONCATENATE(A17,AF19)","v":"B"},{"$f":"B19","v":"呉羽ドッジボールクラブ"}]
[]
[{"$f":"CONCATENATE(A17,2)","v":"B2"},{"$f":"VLOOKUP(A21,チーム表!C:D,2,FALSE)","v":"鳳至ドッジボールクラブ"},null,null,{"$f":"IF(D22=\"\",\"\",IF(D22=F22,\"△\",IF(D22>F22,\"〇\",\"×\")))","v":""},{"$nulls":19},{"$f":"COUNTIF($E21:$N21,\"〇\")","v":0},{"$f":"COUNTIF($E21:$N21,\"×\")","v":0},{"$f":"COUNTIF($E21:$N21,\"△\")","v":0},{"$f":"Y21*2+AA21","v":0},{"$f":"IF(D22=\"\",\"\",D22+G22+M22+J22)","v":""},{"$f":"IF(AC21=\"\",\"\",AB21*100+AC21)","v":""},{"$f":"IF(AC21=\"\",\"\",F22+I22+L22+O22)","v":""},{"$f":"IF(AD21=\"\",\"\",RANK(AD21,AD19:AD26,0))","v":""},null,{"$f":"CONCATENATE(A17,AF21)","v":"B"},{"$f":"B21","v":"鳳至ドッジボールクラブ"}]
[{"$nulls":3},{"$f":"IF(I20=\"\",\"\",I20)","v":""},"-",{"$f":"IF(G20=\"\",\"\",G20)","v":""}]
[{"$f":"CONCATENATE(A17,3)","v":"B3"},{"$f":"VLOOKUP(A23,チーム表!C:D,2,FALSE)","v":"千坂ドッジファイヤーズ"},null,null,{"$f":"IF(D24=\"\",\"\",IF(D24=F24,\"△\",IF(D24>F24,\"〇\",\"×\")))","v":""},{"$nulls":19},{"$f":"COUNTIF($E23:$N23,\"〇\")","v":0},{"$f":"COUNTIF($E23:$N23,\"×\")","v":0},{"$f":"COUNTIF($E23:$N23,\"△\")","v":0},{"$f":"Y23*2+AA23","v":0},{"$f":"IF(G24=\"\",\"\",D24+G24+M24+J24)","v":""},{"$f":"IF(AC23=\"\",\"\",AB23*100+AC23)","v":""},{"$f":"IF(AC23=\"\",\"\",F24+I24+L24+O24)","v":""},{"$f":"IF(AD23=\"\",\"\",RANK(AD23,AD19:AD26,0))","v":""},null,{"$f":"CONCATENATE(A17,AF23)","v":"B"},{"$f":"B23","v":"千坂ドッジファイヤーズ"}]
[{"$nulls":3},{"$f":"IF(L20=\"\",\"\",L20)","v":""},"-",{"$f":"IF(J20=\"\",\"\",J20)","v":""}]
[{"$f":"CONCATENATE(A17,4)","v":"B4"},{"$f":"VLOOKUP(A25,チーム表!C:D,2,FALSE)","v":"松任の大魔陣"},null,null,{"$f":"IF(D26=\"\",\"\",IF(D26=F26,\"△\",IF(D26>F26,\"〇\",\"×\")))","v":""},null,null,{"$f":"IF(G26=\"\",\"\",IF(G26=I26,\"△\",IF(G26>I26,\"〇\",\"×\")))","v":""},null,null,{"$f":"IF(J26=\"\",\"\",IF(J26=L26,\"△\",IF(J26>L26,\"〇\",\"×\")))","v":""},{"$nulls":13},{"$f":"COUNTIF($E25:$N25,\"〇\")","v":0},{"$f":"COUNTIF($E25:$N25,\"×\")","v":0},{"$f":"COUNTIF($E25:$N25,\"△\")","v":0},{"$f":"Y25*2+AA25","v":0},{"$f":"IF(G26=\"\",\"\",D26+G26+M26+J26)","v":""},{"$f":"IF(AC25=\"\",\"\",AB25*100+AC25)","v":""},{"$f":"IF(AC25=\"\",\"\",F26+I26+L26+O26)","v":""},{"$f":"IF(AD25=\"\",\"\",RANK(AD25,AD19:AD26,0))","v":""},null,{"$f":"CONCATENATE(A17,AF25)","v":"B"},{"$f":"B25","v":"松任の大魔陣"}]
[{"$nulls":3},{"$f":"IF(O20=\"\",\"\",O20)","v":""},"-",{"$f":"IF(M20=\"\",\"\",M20)","v":""},{"$f":"IF(O22=\"\",\"\",O22)","v":""},"-",{"$f":"IF(M22=\"\",\"\",M22)","v":""},{"$f":"IF(O24=\"\",\"\",O24)","v":""},"-",{"$f":"IF(M24=\"\",\"\",M24)","v":""}]
[]
[{"$nulls":4},{"$f":"CONCATENATE(A29,\"1\")","v":"C1"},null,null,{"$f":"CONCATENATE(A29,\"2\")","v":"C2"},null,null,{"$f":"CONCATENATE(A29,\"3\")","v":"C3"},null,null,{"$f":"CONCATENATE(A29,\"4\")","v":"C4"}]
["C","チーム名",null,{"$f":"B31","v":"光陽マーリンズ"},null,null,{"$f":"B33","v":"中郷ドッジボールクラブ"},null,null,{"$f":"B35","v":"鵜川ミラクルフェニックス"},null,null,{"$f":"B37","v":"向本折クラブA"},{"$nulls":11},"勝","負","分","点","内野","順位決定点","相手内野","順位","kaku"]
[]
[{"$f":"CONCATENATE(A29,1)","v":"C1"},{"$f":"VLOOKUP(A31,チーム表!C:D,2,FALSE)","v":"光陽マーリンズ"},{"$nulls":22},{"$f":"COUNTIF($E31:$N31,\"〇\")","v":0},{"$f":"COUNTIF($E31:$N31,\"×\")","v":0},{"$f":"COUNTIF($E31:$N31,\"△\")","v":0},{"$f":"Y31*2+AA31","v":0},{"$f":"IF(G32=\"\",\"\",D32+G32+M32+J32)","v":""},{"$f":"IF(AC31=\"\",\"\",AB31*100+AC31)","v":""},{"$f":"IF(AC31=\"\",\"\",F32+I32+L32+O32)","v":""},{"$f":"IF(AD31=\"\",\"\",RANK(AD31,AD31:AD38,0))","v":""},null,{"$f":"CONCATENATE(A29,AF31)","v":"C"},{"$f":"B31","v":"光陽マーリンズ"}]
[]
[{"$f":"CONCATENATE(A29,2)","v":"C2"},{"$f":"VLOOKUP(A33,チーム表!C:D,2,FALSE)","v":"中郷ドッジボールクラブ"},null,null,{"$f":"IF(D34=\"\",\"\",IF(D34=F34,\"△\",IF(D34>F34,\"〇\",\"×\")))","v":""},{"$nulls":19},{"$f":"COUNTIF($E33:$N33,\"〇\")","v":0},{"$f":"COUNTIF($E33:$N33,\"×\")","v":0},{"$f":"COUNTIF($E33:$N33,\"△\")","v":0},{"$f":"Y33*2+AA33","v":0},{"$f":"IF(D34=\"\",\"\",D34+G34+M34+J34)","v":""},{"$f":"IF(AC33=\"\",\"\",AB33*100+AC33)","v":""},{"$f":"IF(AC33=\"\",\"\",F34+I34+L34+O34)","v":""},{"$f":"IF(AD33=\"\",\"\",RANK(AD33,AD31:AD38,0))","v":""},null,{"$f":"CONCATENATE(A29,AF33)","v":"C"},{"$f":"B33","v":"中郷ドッジボールクラブ"}]
[{"$nulls":3},{"$f":"IF(I32=\"\",\"\",I32)","v":""},"-",{"$f":"IF(G32=\"\",\"\",G32)","v":""}]
[{"$f":"CONCATENATE(A29,3)","v":"C3"},{"$f":"VLOOKUP(A35,チーム表!C:D,2,FALSE)","v":"鵜川ミラクルフェニックス"},null,null,{"$f":"IF(D36=\"\",\"\",IF(D36=F36,\"△\",IF(D36>F36,\"〇\",\"×\")))","v":""},{"$nulls":19},{"$f":"COUNTIF($E35:$N35,\"〇\")","v":0},{"$f":"COUNTIF($E35:$N35,\"×\")","v":0},{"$f":"COUNTIF($E35:$N35,\"△\")","v":0},{"$f":"Y35*2+AA35","v":0},{"$f":"IF(G36=\"\",\"\",D36+G36+M36+J36)","v":""},{"$f":"IF(AC35=\"\",\"\",AB35*100+AC35)","v":""},{"$f":"IF(AC35=\"\",\"\",F36+I36+L36+O36)","v":""},{"$f":"IF(AD35=\"\",\"\",RANK(AD35,AD31:AD38,0))","v":""},null,{"$f":"CONCATENATE(A29,AF35)","v":"C"},{"$f":"B35","v":"鵜川ミラクルフェニックス"}]
[{"$nulls":3},{"$f":"IF(L32=\"\",\"\",L32)","v":""},"-",{"$f":"IF(J32=\"\",\"\",J32)","v":""}]
[{"$f":"CONCATENATE(A29,4)","v":"C4"},{"$f":"VLOOKUP(A37,チーム表!C:D,2,FALSE)","v":"向本折クラブA"},null,null,{"$f":"IF(D38=\"\",\"\",IF(D38=F38,\"△\",IF(D38>F38,\"〇\",\"×\")))","v":""},null,null,{"$f":"IF(G38=\"\",\"\",IF(G38=I38,\"△\",IF(G38>I38,\"〇\",\"×\")))","v":""},null,null,{"$f":"IF(J38=\"\",\"\",IF(J38=L38,\"△\",IF(J38>L38,\"〇\",\"×\")))","v":""},{"$nulls":13},{"$f":"COUNTIF($E37:$N37,\"〇\")","v":0},{"$f":"COUNTIF($E37:$N37,\"×\")","v":0},{"$f":"COUNTIF($E37:$N37,\"△\")","v":0},{"$f":"Y37*2+AA37","v":0},{"$f":"IF(G38=\"\",\"\",D38+G38+M38+J38)","v":""},{"$f":"IF(AC37=\"\",\"\",AB37*100+AC37)","v":""},{"$f":"IF(AC37=\"\",\"\",F38+I38+L38+O38)","v":""},{"$f":"IF(AD37=\"\",\"\",RANK(AD37,AD31:AD38,0))","v":""},null,{"$f":"CONCATENATE(A29,AF37)","v":"C"},{"$f":"B37","v":"向本折クラブA"}]
[{"$nulls":3},{"$f":"IF(O32=\"\",\"\",O32)","v":""},"-",{"$f":"IF(M32=\"\",\"\",M32)","v":""},{"$f":"IF(O34=\"\",\"\",O34)","v":""},"-",{"$f":"IF(M34=\"\",\"\",M34)","v":""},{"$f":"IF(O36=\"\",\"\",O36)","v":""},"-",{"$f":"IF(M36=\"\",\"\",M36)","v":""}]
[]
[{"$nulls":4},{"$f":"CONCATENATE(A41,\"1\")","v":"D1"},null,null,{"$f":"CONCATENATE(A41,\"2\")","v":"D2"},null,null,{"$f":"CONCATENATE(A41,\"3\")","v":"D3"},null,null,{"$f":"CONCATENATE(A41,\"4\")","v":"D4"},null,null,{"$f":"CONCATENATE(A41,\"5\")","v":"D5"}]
["D","チーム名",null,{"$f":"B43","v":"飯野マジックス"},null,null,{"$f":"B45","v":"三馬パワフル"},null,null,{"$f":"B47","v":"寺井クラブ"},null,null,{"$f":"B49","v":"大門ドッジボールクラブ"},null,null,{"$f":"B51","v":"田上闘球DREAMS"},{"$nulls":8},"勝","負","分","点","内野","順位決定点","相手内野","順位","kaku"]
[]
[{"$f":"CONCATENATE(A41,1)","v":"D1"},{"$f":"VLOOKUP(A43,チーム表!C:D,2,FALSE)","v":"飯野マジックス"},{"$nulls":22},{"$f":"COUNTIF($E43:$Q43,\"〇\")","v":0},{"$f":"COUNTIF($E43:$Q43,\"×\")","v":0},{"$f":"COUNTIF($E43:$Q43,\"△\")","v":0},{"$f":"Y43*2+AA43","v":0},{"$f":"IF(G44=\"\",\"\",D44+G44+M44+P44+J44)","v":""},{"$f":"IF(AC43=\"\",\"\",AB43*100+AC43)","v":""},{"$f":"IF(AC43=\"\",\"\",F44+I44+L44+O44+R44)","v":""},{"$f":"IF(AD43=\"\",\"\",RANK(AD43,AD43:AD52,0))","v":""},null,{"$f":"CONCATENATE(A41,AF43)","v":"D"},{"$f":"B43","v":"飯野マジックス"}]
[]
[{"$f":"CONCATENATE(A41,2)","v":"D2"},{"$f":"VLOOKUP(A45,チーム表!C:D,2,FALSE)","v":"三馬パワフル"},null,null,{"$f":"IF(D46=\"\",\"\",IF(D46=F46,\"△\",IF(D46>F46,\"〇\",\"×\")))","v":""},{"$nulls":19},{"$f":"COUNTIF($E45:$Q45,\"〇\")","v":0},{"$f":"COUNTIF($E45:$Q45,\"×\")","v":0},{"$f":"COUNTIF($E45:$Q45,\"△\")","v":0},{"$f":"Y45*2+AA45","v":0},{"$f":"IF(D46=\"\",\"\",D46+G46+M46+P46+J46)","v":""},{"$f":"IF(AC45=\"\",\"\",AB45*100+AC45)","v":""},{"$f":"IF(AC45=\"\",\"\",F46+I46+L46+O46+R46)","v":""},{"$f":"IF(AD45=\"\",\"\",RANK(AD45,AD43:AD52,0))","v":""},null,{"$f":"CONCATENATE(A41,AF45)","v":"D"},{"$f":"B45","v":"三馬パワフル"}]
[{"$nulls":3},{"$f":"IF(I44=\"\",\"\",I44)","v":""},"-",{"$f":"IF(G44=\"\",\"\",G44)","v":""}]
[{"$f":"CONCATENATE(A41,3)","v":"D3"},{"$f":"VLOOKUP(A47,チーム表!C:D,2,FALSE)","v":"寺井クラブ"},null,null,{"$f":"IF(D48=\"\",\"\",IF(D48=F48,\"△\",IF(D48>F48,\"〇\",\"×\")))","v":""},{"$nulls":19},{"$f":"COUNTIF($E47:$Q47,\"〇\")","v":0},{"$f":"COUNTIF($E47:$Q47,\"×\")","v":0},{"$f":"COUNTIF($E47:$Q47,\"△\")","v":0},{"$f":"Y47*2+AA47","v":0},{"$f":"IF(G48=\"\",\"\",D48+G48+M48+P48+J48)","v":""},{"$f":"IF(AC47=\"\",\"\",AB47*100+AC47)","v":""},{"$f":"IF(AC47=\"\",\"\",F48+I48+L48+O48+R48)","v":""},{"$f":"IF(AD47=\"\",\"\",RANK(AD47,AD43:AD52,0))","v":""},null,{"$f":"CONCATENATE(A41,AF47)","v":"D"},{"$f":"B47","v":"寺井クラブ"}]
[{"$nulls":3},{"$f":"IF(L44=\"\",\"\",L44)","v":""},"-",{"$f":"IF(J44=\"\",\"\",J44)","v":""}]
[{"$f":"CONCATENATE(A41,4)","v":"D4"},{"$f":"VLOOKUP(A49,チーム表!C:D,2,FALSE)","v":"大門ドッジボールクラブ"},null,null,{"$f":"IF(D50=\"\",\"\",IF(D50=F50,\"△\",IF(D50>F50,\"〇\",\"×\")))","v":""},{"$nulls":19},{"$f":"COUNTIF($E49:$Q49,\"〇\")","v":0},{"$f":"COUNTIF($E49:$Q49,\"×\")","v":0},{"$f":"COUNTIF($E49:$Q49,\"△\")","v":0},{"$f":"Y49*2+AA49","v":0},{"$f":"IF(G50=\"\",\"\",D50+G50+M50+P50+J50)","v":""},{"$f":"IF(AC49=\"\",\"\",AB49*100+AC49)","v":""},{"$f":"IF(AC49=\"\",\"\",F50+I50+L50+O50+R50)","v":""},{"$f":"IF(AD49=\"\",\"\",RANK(AD49,AD43:AD52,0))","v":""},null,{"$f":"CONCATENATE(A41,AF49)","v":"D"},{"$f":"B49","v":"大門ドッジボールクラブ"}]
[{"$nulls":3},{"$f":"IF(O44=\"\",\"\",O44)","v":""},"-",{"$f":"IF(M44=\"\",\"\",M44)","v":""}]
[{"$f":"CONCATENATE(A41,5)","v":"D5"},{"$f":"VLOOKUP(A51,チーム表!C:D,2,FALSE)","v":"田上闘球DREAMS"},null,null,{"$f":"IF(D52=\"\",\"\",IF(D52=F52,\"△\",IF(D52>F52,\"〇\",\"×\")))","v":""},{"$nulls":19},{"$f":"COUNTIF($E51:$Q51,\"〇\")","v":0},{"$f":"COUNTIF($E51:$Q51,\"×\")","v":0},{"$f":"COUNTIF($E51:$Q51,\"△\")","v":0},{"$f":"Y51*2+AA51","v":0},{"$f":"IF(G52=\"\",\"\",D52+G52+M52+P52+J52)","v":""},{"$f":"IF(AC51=\"\",\"\",AB51*100+AC51)","v":""},{"$f":"IF(AC51=\"\",\"\",F52+I52+L52+O52+R52)","v":""},{"$f":"IF(AD51=\"\",\"\",RANK(AD51,AD43:AD52,0))","v":""},null,{"$f":"CONCATENATE(A41,AF51)","v":"D"},{"$f":"B51","v":"田上闘球DREAMS"}]
[{"$nulls":3},{"$f":"IF($R44=\"\",\"\",$R44)","v":""},"-",{"$f":"IF($P44=\"\",\"\",$P44)","v":""}]
[null,"ジュニアの部"]
[{"$nulls":4},{"$f":"CONCATENATE(A55,\"1\")","v":"E1"},null,null,{"$f":"CONCATENATE(A55,\"2\")","v":"E2"},null,null,{"$f":"CONCATENATE(A55,\"3\")","v":"E3"},null,null,{"$f":"CONCATENATE(A55,\"4\")","v":"E4"}]
["E","チーム名",null,{"$f":"B57","v":"鞍月アタッカーズジュニア"},null,null,{"$f":"B59","v":"鳳至ジュニア"},null,null,{"$f":"B61","v":"中郷ミラクルジュニア"},null,null,{"$f":"B63","v":"ドッジの王子様"},{"$nulls":11},"勝","負","分","点","内野","順位決定点","相手内野","順位","kaku"]
[]
[{"$f":"CONCATENATE(A55,1)","v":"E1"},{"$f":"VLOOKUP(A57,チーム表!C:D,2,FALSE)","v":"鞍月アタッカーズジュニア"},{"$nulls":22},{"$f":"COUNTIF($E57:$N57,\"〇\")","v":0},{"$f":"COUNTIF($E57:$N57,\"×\")","v":0},{"$f":"COUNTIF($E57:$N57,\"△\")","v":0},{"$f":"Y57*2+AA57","v":0},{"$f":"IF(G58=\"\",\"\",D58+G58+M58+J58)","v":""},{"$f":"IF(AC57=\"\",\"\",AB57*100+AC57)","v":""},{"$f":"IF(AC57=\"\",\"\",F58+I58+L58+O58)","v":""},{"$f":"IF(AD57=\"\",\"\",RANK(AD57,AD57:AD64,0))","v":""},null,{"$f":"CONCATENATE(A55,AF57)","v":"E"},{"$f":"B57","v":"鞍月アタッカーズジュニア"}]
[]
[{"$f":"CONCATENATE(A55,2)","v":"E2"},{"$f":"VLOOKUP(A59,チーム表!C:D,2,FALSE)","v":"鳳至ジュニア"},null,null,{"$f":"IF(D60=\"\",\"\",IF(D60=F60,\"△\",IF(D60>F60,\"〇\",\"×\")))","v":""},{"$nulls":19},{"$f":"COUNTIF($E59:$N59,\"〇\")","v":0},{"$f":"COUNTIF($E59:$N59,\"×\")","v":0},{"$f":"COUNTIF($E59:$N59,\"△\")","v":0},{"$f":"Y59*2+AA59","v":0},{"$f":"IF(D60=\"\",\"\",D60+G60+M60+J60)","v":""},{"$f":"IF(AC59=\"\",\"\",AB59*100+AC59)","v":""},{"$f":"IF(AC59=\"\",\"\",F60+I60+L60+O60)","v":""},{"$f":"IF(AD59=\"\",\"\",RANK(AD59,AD57:AD64,0))","v":""},null,{"$f":"CONCATENATE(A55,AF59)","v":"E"},{"$f":"B59","v":"鳳至ジュニア"}]
[{"$nulls":3},{"$f":"IF(I58=\"\",\"\",I58)","v":""},"-",{"$f":"IF(G58=\"\",\"\",G58)","v":""}]
[{"$f":"CONCATENATE(A55,3)","v":"E3"},{"$f":"VLOOKUP(A61,チーム表!C:D,2,FALSE)","v":"中郷ミラクルジュニア"},null,null,{"$f":"IF(D62=\"\",\"\",IF(D62=F62,\"△\",IF(D62>F62,\"〇\",\"×\")))","v":""},{"$nulls":19},{"$f":"COUNTIF($E61:$N61,\"〇\")","v":0},{"$f":"COUNTIF($E61:$N61,\"×\")","v":0},{"$f":"COUNTIF($E61:$N61,\"△\")","v":0},{"$f":"Y61*2+AA61","v":0},{"$f":"IF(G62=\"\",\"\",D62+G62+M62+J62)","v":""},{"$f":"IF(AC61=\"\",\"\",AB61*100+AC61)","v":""},{"$f":"IF(AC61=\"\",\"\",F62+I62+L62+O62)","v":""},{"$f":"IF(AD61=\"\",\"\",RANK(AD61,AD57:AD64,0))","v":""},null,{"$f":"CONCATENATE(A55,AF61)","v":"E"},{"$f":"B61","v":"中郷ミラクルジュニア"}]
[{"$nulls":3},{"$f":"IF(L58=\"\",\"\",L58)","v":""},"-",{"$f":"IF(J58=\"\",\"\",J58)","v":""}]
[{"$f":"CONCATENATE(A55,4)","v":"E4"},{"$f":"VLOOKUP(A63,チーム表!C:D,2,FALSE)","v":"ドッジの王子様"},null,null,{"$f":"IF(D64=\"\",\"\",IF(D64=F64,\"△\",IF(D64>F64,\"〇\",\"×\")))","v":""},null,null,{"$f":"IF(G64=\"\",\"\",IF(G64=I64,\"△\",IF(G64>I64,\"〇\",\"×\")))","v":""},null,null,{"$f":"IF(J64=\"\",\"\",IF(J64=L64,\"△\",IF(J64>L64,\"〇\",\"×\")))","v":""},{"$nulls":13},{"$f":"COUNTIF($E63:$N63,\"〇\")","v":0},{"$f":"COUNTIF($E63:$N63,\"×\")","v":0},{"$f":"COUNTIF($E63:$N63,\"△\")","v":0},{"$f":"Y63*2+AA63","v":0},{"$f":"IF(G64=\"\",\"\",D64+G64+M64+J64)","v":""},{"$f":"IF(AC63=\"\",\"\",AB63*100+AC63)","v":""},{"$f":"IF(AC63=\"\",\"\",F64+I64+L64+O64)","v":""},{"$f":"IF(AD63=\"\",\"\",RANK(AD63,AD57:AD64,0))","v":""},null,{"$f":"CONCATENATE(A55,AF63)","v":"E"},{"$f":"B63","v":"ドッジの王子様"}]
[{"$nulls":3},{"$f":"IF(O58=\"\",\"\",O58)","v":""},"-",{"$f":"IF(M58=\"\",\"\",M58)","v":""},{"$f":"IF(O60=\"\",\"\",O60)","v":""},"-",{"$f":"IF(M60=\"\",\"\",M60)","v":""},{"$f":"IF(O62=\"\",\"\",O62)","v":""},"-",{"$f":"IF(M62=\"\",\"\",M62)","v":""}]
[]
[{"$nulls":4},{"$f":"CONCATENATE(A67,\"1\")","v":"F1"},null,null,{"$f":"CONCATENATE(A67,\"2\")","v":"F2"},null,null,{"$f":"CONCATENATE(A67,\"3\")","v":"F3"},null,null,{"$f":"CONCATENATE(A67,\"4\")","v":"F4"}]
["F","チーム名",null,{"$f":"B69","v":"九十九クラブ"},null,null,{"$f":"B71","v":"千坂ロータスルート"},null,null,{"$f":"B73","v":"向本折クラブNew"},null,null,{"$f":"B75","v":"寺井クラブＪｒ　A"},{"$nulls":11},"勝","負","分","点","内野","順位決定点","相手内野","順位","kaku"]
[]
[{"$f":"CONCATENATE(A67,1)","v":"F1"},{"$f":"VLOOKUP(A69,チーム表!C:D,2,FALSE)","v":"九十九クラブ"},{"$nulls":22},{"$f":"COUNTIF($E69:$N69,\"〇\")","v":0},{"$f":"COUNTIF($E69:$N69,\"×\")","v":0},{"$f":"COUNTIF($E69:$N69,\"△\")","v":0},{"$f":"Y69*2+AA69","v":0},{"$f":"IF(G70=\"\",\"\",D70+G70+M70+J70)","v":""},{"$f":"IF(AC69=\"\",\"\",AB69*100+AC69)","v":""},{"$f":"IF(AC69=\"\",\"\",F70+I70+L70+O70)","v":""},{"$f":"IF(AD69=\"\",\"\",RANK(AD69,AD69:AD76,0))","v":""},null,{"$f":"CONCATENATE(A67,AF69)","v":"F"},{"$f":"B69","v":"九十九クラブ"}]
[]
[{"$f":"CONCATENATE(A67,2)","v":"F2"},{"$f":"VLOOKUP(A71,チーム表!C:D,2,FALSE)","v":"千坂ロータスルート"},null,null,{"$f":"IF(D72=\"\",\"\",IF(D72=F72,\"△\",IF(D72>F72,\"〇\",\"×\")))","v":""},{"$nulls":19},{"$f":"COUNTIF($E71:$N71,\"〇\")","v":0},{"$f":"COUNTIF($E71:$N71,\"×\")","v":0},{"$f":"COUNTIF($E71:$N71,\"△\")","v":0},{"$f":"Y71*2+AA71","v":0},{"$f":"IF(D72=\"\",\"\",D72+G72+M72+J72)","v":""},{"$f":"IF(AC71=\"\",\"\",AB71*100+AC71)","v":""},{"$f":"IF(AC71=\"\",\"\",F72+I72+L72+O72)","v":""},{"$f":"IF(AD71=\"\",\"\",RANK(AD71,AD69:AD76,0))","v":""},null,{"$f":"CONCATENATE(A67,AF71)","v":"F"},{"$f":"B71","v":"千坂ロータスルート"}]
[{"$nulls":3},{"$f":"IF(I70=\"\",\"\",I70)","v":""},"-",{"$f":"IF(G70=\"\",\"\",G70)","v":""}]
[{"$f":"CONCATENATE(A67,3)","v":"F3"},{"$f":"VLOOKUP(A73,チーム表!C:D,2,FALSE)","v":"向本折クラブNew"},null,null,{"$f":"IF(D74=\"\",\"\",IF(D74=F74,\"△\",IF(D74>F74,\"〇\",\"×\")))","v":""},{"$nulls":19},{"$f":"COUNTIF($E73:$N73,\"〇\")","v":0},{"$f":"COUNTIF($E73:$N73,\"×\")","v":0},{"$f":"COUNTIF($E73:$N73,\"△\")","v":0},{"$f":"Y73*2+AA73","v":0},{"$f":"IF(G74=\"\",\"\",D74+G74+M74+J74)","v":""},{"$f":"IF(AC73=\"\",\"\",AB73*100+AC73)","v":""},{"$f":"IF(AC73=\"\",\"\",F74+I74+L74+O74)","v":""},{"$f":"IF(AD73=\"\",\"\",RANK(AD73,AD69:AD76,0))","v":""},null,{"$f":"CONCATENATE(A67,AF73)","v":"F"},{"$f":"B73","v":"向本折クラブNew"}]
[{"$nulls":3},{"$f":"IF(L70=\"\",\"\",L70)","v":""},"-",{"$f":"IF(J70=\"\",\"\",J70)","v":""}]
[{"$f":"CONCATENATE(A67,4)","v":"F4"},{"$f":"VLOOKUP(A75,チーム表!C:D,2,FALSE)","v":"寺井クラブＪｒ　A"},null,null,{"$f":"IF(D76=\"\",\"\",IF(D76=F76,\"△\",IF(D76>F76,\"〇\",\"×\")))","v":""},null,null,{"$f":"IF(G76=\"\",\"\",IF(G76=I76,\"△\",IF(G76>I76,\"〇\",\"×\")))","v":""},null,null,{"$f":"IF(J76=\"\",\"\",IF(J76=L76,\"△\",IF(J76>L76,\"〇\",\"×\")))","v":""},{"$nulls":13},{"$f":"COUNTIF($E75:$N75,\"〇\")","v":0},{"$f":"COUNTIF($E75:$N75,\"×\")","v":0},{"$f":"COUNTIF($E75:$N75,\"△\")","v":0},{"$f":"Y75*2+AA75","v":0},{"$f":"IF(G76=\"\",\"\",D76+G76+M76+J76)","v":""},{"$f":"IF(AC75=\"\",\"\",AB75*100+AC75)","v":""},{"$f":"IF(AC75=\"\",\"\",F76+I76+L76+O76)","v":""},{"$f":"IF(AD75=\"\",\"\",RANK(AD75,AD69:AD76,0))","v":""},null,{"$f":"CONCATENATE(A67,AF75)","v":"F"},{"$f":"B75","v":"寺井クラブＪｒ　A"}]
[{"$nulls":3},{"$f":"IF(O70=\"\",\"\",O70)","v":""},"-",{"$f":"IF(M70=\"\",\"\",M70)","v":""},{"$f":"IF(O72=\"\",\"\",O72)","v":""},"-",{"$f":"IF(M72=\"\",\"\",M72)","v":""},{"$f":"IF(O74=\"\",\"\",O74)","v":""},"-",{"$f":"IF(M74=\"\",\"\",M74)","v":""}]
[]
[{"$nulls":4},{"$f":"CONCATENATE(A79,\"1\")","v":"G1"},null,null,{"$f":"CONCATENATE(A79,\"2\")","v":"G2"},null,null,{"$f":"CONCATENATE(A79,\"3\")","v":"G3"},null,null,{"$f":"CONCATENATE(A79,\"4\")","v":"G4"}]
["G","チーム名",null,{"$f":"B81","v":"鞍月アタッカーズキッズ"},null,null,{"$f":"B83","v":"松任の大魔陣Jr."},null,null,{"$f":"B85","v":"鵜川フェニックスジュニア"},null,null,{"$f":"B87","v":"大門ドッジボールクラブJr"},{"$nulls":11},"勝","負","分","点","内野","順位決定点","相手内野","順位","kaku"]
[]
[{"$f":"CONCATENATE(A79,1)","v":"G1"},{"$f":"VLOOKUP(A81,チーム表!C:D,2,FALSE)","v":"鞍月アタッカーズキッズ"},{"$nulls":22},{"$f":"COUNTIF($E81:$N81,\"〇\")","v":0},{"$f":"COUNTIF($E81:$N81,\"×\")","v":0},{"$f":"COUNTIF($E81:$N81,\"△\")","v":0},{"$f":"Y81*2+AA81","v":0},{"$f":"IF(G82=\"\",\"\",D82+G82+M82+J82)","v":""},{"$f":"IF(AC81=\"\",\"\",AB81*100+AC81)","v":""},{"$f":"IF(AC81=\"\",\"\",F82+I82+L82+O82)","v":""},{"$f":"IF(AD81=\"\",\"\",RANK(AD81,AD81:AD88,0))","v":""},null,{"$f":"CONCATENATE(A79,AF81)","v":"G"},{"$f":"B81","v":"鞍月アタッカーズキッズ"}]
[]
[{"$f":"CONCATENATE(A79,2)","v":"G2"},{"$f":"VLOOKUP(A83,チーム表!C:D,2,FALSE)","v":"松任の大魔陣Jr."},null,null,{"$f":"IF(D84=\"\",\"\",IF(D84=F84,\"△\",IF(D84>F84,\"〇\",\"×\")))","v":""},{"$nulls":19},{"$f":"COUNTIF($E83:$N83,\"〇\")","v":0},{"$f":"COUNTIF($E83:$N83,\"×\")","v":0},{"$f":"COUNTIF($E83:$N83,\"△\")","v":0},{"$f":"Y83*2+AA83","v":0},{"$f":"IF(D84=\"\",\"\",D84+G84+M84+J84)","v":""},{"$f":"IF(AC83=\"\",\"\",AB83*100+AC83)","v":""},{"$f":"IF(AC83=\"\",\"\",F84+I84+L84+O84)","v":""},{"$f":"IF(AD83=\"\",\"\",RANK(AD83,AD81:AD88,0))","v":""},null,{"$f":"CONCATENATE(A79,AF83)","v":"G"},{"$f":"B83","v":"松任の大魔陣Jr."}]
[{"$nulls":3},{"$f":"IF(I82=\"\",\"\",I82)","v":""},"-",{"$f":"IF(G82=\"\",\"\",G82)","v":""}]
[{"$f":"CONCATENATE(A79,3)","v":"G3"},{"$f":"VLOOKUP(A85,チーム表!C:D,2,FALSE)","v":"鵜川フェニックスジュニア"},null,null,{"$f":"IF(D86=\"\",\"\",IF(D86=F86,\"△\",IF(D86>F86,\"〇\",\"×\")))","v":""},{"$nulls":19},{"$f":"COUNTIF($E85:$N85,\"〇\")","v":0},{"$f":"COUNTIF($E85:$N85,\"×\")","v":0},{"$f":"COUNTIF($E85:$N85,\"△\")","v":0},{"$f":"Y85*2+AA85","v":0},{"$f":"IF(G86=\"\",\"\",D86+G86+M86+J86)","v":""},{"$f":"IF(AC85=\"\",\"\",AB85*100+AC85)","v":""},{"$f":"IF(AC85=\"\",\"\",F86+I86+L86+O86)","v":""},{"$f":"IF(AD85=\"\",\"\",RANK(AD85,AD81:AD88,0))","v":""},null,{"$f":"CONCATENATE(A79,AF85)","v":"G"},{"$f":"B85","v":"鵜川フェニックスジュニア"}]
[{"$nulls":3},{"$f":"IF(L82=\"\",\"\",L82)","v":""},"-",{"$f":"IF(J82=\"\",\"\",J82)","v":""}]
[{"$f":"CONCATENATE(A79,4)","v":"G4"},{"$f":"VLOOKUP(A87,チーム表!C:D,2,FALSE)","v":"大門ドッジボールクラブJr"},null,null,{"$f":"IF(D88=\"\",\"\",IF(D88=F88,\"△\",IF(D88>F88,\"〇\",\"×\")))","v":""},null,null,{"$f":"IF(G88=\"\",\"\",IF(G88=I88,\"△\",IF(G88>I88,\"〇\",\"×\")))","v":""},null,null,{"$f":"IF(J88=\"\",\"\",IF(J88=L88,\"△\",IF(J88>L88,\"〇\",\"×\")))","v":""},{"$nulls":13},{"$f":"COUNTIF($E87:$N87,\"〇\")","v":0},{"$f":"COUNTIF($E87:$N87,\"×\")","v":0},{"$f":"COUNTIF($E87:$N87,\"△\")","v":0},{"$f":"Y87*2+AA87","v":0},{"$f":"IF(G88=\"\",\"\",D88+G88+M88+J88)","v":""},{"$f":"IF(AC87=\"\",\"\",AB87*100+AC87)","v":""},{"$f":"IF(AC87=\"\",\"\",F88+I88+L88+O88)","v":""},{"$f":"IF(AD87=\"\",\"\",RANK(AD87,AD81:AD88,0))","v":""},null,{"$f":"CONCATENATE(A79,AF87)","v":"G"},{"$f":"B87","v":"大門ドッジボールクラブJr"}]
[{"$nulls":3},{"$f":"IF(O82=\"\",\"\",O82)","v":""},"-",{"$f":"IF(M82=\"\",\"\",M82)","v":""},{"$f":"IF(O84=\"\",\"\",O84)","v":""},"-",{"$f":"IF(M84=\"\",\"\",M84)","v":""},{"$f":"IF(O86=\"\",\"\",O86)","v":""},"-",{"$f":"IF(M86=\"\",\"\",M86)","v":""}]
[]
[{"$nulls":4},{"$f":"CONCATENATE(A91,\"1\")","v":"H1"},null,null,{"$f":"CONCATENATE(A91,\"2\")","v":"H2"},null,null,{"$f":"CONCATENATE(A91,\"3\")","v":"H3"},null,null,{"$f":"CONCATENATE(A91,\"4\")","v":"H4"}]
["H","チーム名",null,{"$f":"B93","v":"呉羽DBCジュニア"},null,null,{"$f":"B95","v":"NISHI　Jrスターズ"},null,null,{"$f":"B97","v":"寺井クラブＪｒ　B"},null,null,{"$f":"B99","v":"田上闘球FUTURES"},{"$nulls":11},"勝","負","分","点","内野","順位決定点","相手内野","順位","kaku"]
[]
[{"$f":"CONCATENATE(A91,1)","v":"H1"},{"$f":"VLOOKUP(A93,チーム表!C:D,2,FALSE)","v":"呉羽DBCジュニア"},{"$nulls":22},{"$f":"COUNTIF($E93:$N93,\"〇\")","v":0},{"$f":"COUNTIF($E93:$N93,\"×\")","v":0},{"$f":"COUNTIF($E93:$N93,\"△\")","v":0},{"$f":"Y93*2+AA93","v":0},{"$f":"IF(G94=\"\",\"\",D94+G94+M94+J94)","v":""},{"$f":"IF(AC93=\"\",\"\",AB93*100+AC93)","v":""},{"$f":"IF(AC93=\"\",\"\",F94+I94+L94+O94)","v":""},{"$f":"IF(AD93=\"\",\"\",RANK(AD93,AD93:AD100,0))","v":""},null,{"$f":"CONCATENATE(A91,AF93)","v":"H"},{"$f":"B93","v":"呉羽DBCジュニア"}]
[]
[{"$f":"CONCATENATE(A91,2)","v":"H2"},{"$f":"VLOOKUP(A95,チーム表!C:D,2,FALSE)","v":"NISHI　Jrスターズ"},null,null,{"$f":"IF(D96=\"\",\"\",IF(D96=F96,\"△\",IF(D96>F96,\"〇\",\"×\")))","v":""},{"$nulls":19},{"$f":"COUNTIF($E95:$N95,\"〇\")","v":0},{"$f":"COUNTIF($E95:$N95,\"×\")","v":0},{"$f":"COUNTIF($E95:$N95,\"△\")","v":0},{"$f":"Y95*2+AA95","v":0},{"$f":"IF(D96=\"\",\"\",D96+G96+M96+J96)","v":""},{"$f":"IF(AC95=\"\",\"\",AB95*100+AC95)","v":""},{"$f":"IF(AC95=\"\",\"\",F96+I96+L96+O96)","v":""},{"$f":"IF(AD95=\"\",\"\",RANK(AD95,AD93:AD100,0))","v":""},null,{"$f":"CONCATENATE(A91,AF95)","v":"H"},{"$f":"B95","v":"NISHI　Jrスターズ"}]
[{"$nulls":3},{"$f":"IF(I94=\"\",\"\",I94)","v":""},"-",{"$f":"IF(G94=\"\",\"\",G94)","v":""}]
[{"$f":"CONCATENATE(A91,3)","v":"H3"},{"$f":"VLOOKUP(A97,チーム表!C:D,2,FALSE)","v":"寺井クラブＪｒ　B"},null,null,{"$f":"IF(D98=\"\",\"\",IF(D98=F98,\"△\",IF(D98>F98,\"〇\",\"×\")))","v":""},{"$nulls":19},{"$f":"COUNTIF($E97:$N97,\"〇\")","v":0},{"$f":"COUNTIF($E97:$N97,\"×\")","v":0},{"$f":"COUNTIF($E97:$N97,\"△\")","v":0},{"$f":"Y97*2+AA97","v":0},{"$f":"IF(G98=\"\",\"\",D98+G98+M98+J98)","v":""},{"$f":"IF(AC97=\"\",\"\",AB97*100+AC97)","v":""},{"$f":"IF(AC97=\"\",\"\",F98+I98+L98+O98)","v":""},{"$f":"IF(AD97=\"\",\"\",RANK(AD97,AD93:AD100,0))","v":""},null,{"$f":"CONCATENATE(A91,AF97)","v":"H"},{"$f":"B97","v":"寺井クラブＪｒ　B"}]
[{"$nulls":3},{"$f":"IF(L94=\"\",\"\",L94)","v":""},"-",{"$f":"IF(J94=\"\",\"\",J94)","v":""}]
[{"$f":"CONCATENATE(A91,4)","v":"H4"},{"$f":"VLOOKUP(A99,チーム表!C:D,2,FALSE)","v":"田上闘球FUTURES"},null,null,{"$f":"IF(D100=\"\",\"\",IF(D100=F100,\"△\",IF(D100>F100,\"〇\",\"×\")))","v":""},null,null,{"$f":"IF(G100=\"\",\"\",IF(G100=I100,\"△\",IF(G100>I100,\"〇\",\"×\")))","v":""},null,null,{"$f":"IF(J100=\"\",\"\",IF(J100=L100,\"△\",IF(J100>L100,\"〇\",\"×\")))","v":""},{"$nulls":13},{"$f":"COUNTIF($E99:$N99,\"〇\")","v":0},{"$f":"COUNTIF($E99:$N99,\"×\")","v":0},{"$f":"COUNTIF($E99:$N99,\"△\")","v":0},{"$f":"Y99*2+AA99","v":0},{"$f":"IF(G100=\"\",\"\",D100+G100+M100+J100)","v":""},{"$f":"IF(AC99=\"\",\"\",AB99*100+AC99)","v":""},{"$f":"IF(AC99=\"\",\"\",F100+I100+L100+O100)","v":""},{"$f":"IF(AD99=\"\",\"\",RANK(AD99,AD93:AD100,0))","v":""},null,{"$f":"CONCATENATE(A91,AF99)","v":"H"},{"$f":"B99","v":"田上闘球FUTURES"}]
[{"$nulls":3},{"$f":"IF(O94=\"\",\"\",O94)","v":""},"-",{"$f":"IF(M94=\"\",\"\",M94)","v":""},{"$f":"IF(O96=\"\",\"\",O96)","v":""},"-",{"$f":"IF(M96=\"\",\"\",M96)","v":""},{"$f":"IF(O98=\"\",\"\",O98)","v":""},"-",{"$f":"IF(M98=\"\",\"\",M98)","v":""}]

{"sheet":"トーナメント表","index":3,"n_rows":121,"n_cols":41,"rows_kept":121,"merged":[[4,0,5,0],[6,10,7,11],[8,0,9,0],[10,13,11,14],[12,0,13,0],[14,10,15,11],[15,20,16,21],[16,0,17,0],[17,16,18,17],[20,0,21,0],[22,10,23,11],[24,0,25,0],[26,13,27,14],[28,0,29,0],[30,10,31,11],[32,0,33,0],[38,16,39,17],[47,0,48,0],[49,12,50,13],[51,0,52,0],[54,15,55,16],[55,0,56,0],[58,12,59,13],[59,0,60,0],[60,22,61,24],[61,9,62,10],[63,0,64,0],[63,18,64,19],[67,0,68,0],[69,12,70,13],[71,0,72,0],[73,15,74,16],[75,0,76,0],[77,12,78,13],[79,0,80,0],[86,0,87,0],[88,10,89,11],[90,0,91,0],[92,13,93,14],[94,0,95,0],[96,10,97,11],[98,0,99,0],[99,16,100,17],[102,0,103,0],[104,10,105,11],[106,0,107,0],[108,13,109,14],[110,0,111,0],[112,10,113,11],[114,0,115,0],[120,16,121,17]]}
[null,"レギュラーの部",{"$nulls":5},"決勝トーナメント"]
[]
[]
[]
["Ａ1位"]
[{"$nulls":39},"A1",{"$f":"VLOOKUP(AN6,リーグ戦表!AH:AI,2,0)","v":{"$error":"#N/A"}}]
[{"$nulls":10},"A⑦",{"$nulls":28},"A2",{"$f":"VLOOKUP(AN7,リーグ戦表!AH:AI,2,0)","v":{"$error":"#N/A"}}]
[{"$nulls":39},"B1",{"$f":"VLOOKUP(AN8,リーグ戦表!AH:AI,2,0)","v":{"$error":"#N/A"}}]
["D２位",{"$nulls":38},"B2",{"$f":"VLOOKUP(AN9,リーグ戦表!AH:AI,2,0)","v":{"$error":"#N/A"}}]
[{"$nulls":39},"C1",{"$f":"VLOOKUP(AN10,リーグ戦表!AH:AI,2,0)","v":{"$error":"#N/A"}}]
[{"$nulls":13},"A⑫",{"$nulls":25},"C2",{"$f":"VLOOKUP(AN11,リーグ戦表!AH:AI,2,0)","v":{"$error":"#N/A"}}]
[{"$nulls":39},"D1",{"$f":"VLOOKUP(AN12,リーグ戦表!AH:AI,2,0)","v":{"$error":"#N/A"}}]
["B２位",{"$nulls":38},"D2",{"$f":"VLOOKUP(AN13,リーグ戦表!AH:AI,2,0)","v":{"$error":"#N/A"}}]
[]
[{"$nulls":10},"A⑧"]
[{"$nulls":20},"優　勝"]
["C１位"]
[{"$nulls":16},"A⑬"]
[]
[]
["D１位"]
[]
[{"$nulls":10},"B⑦"]
[]
["A２位"]
[]
[{"$nulls":13},"B⑫"]
[]
["C２位"]
[]
[{"$nulls":10},"B⑧"]
[]
["Ｂ1位"]
[]
[]
[]
[{"$nulls":21},"３位"]
[]
[{"$nulls":16},"B⑬"]
[]
[]
[]
[]
[]
[null,null,"交流トーナメント"]
[]
[]
["A３位"]
[{"$nulls":39},"A1",{"$f":"VLOOKUP(AN49,リーグ戦表!AH:AI,2,0)","v":{"$error":"#N/A"}}]
[{"$nulls":12},"A④",{"$nulls":26},"A2",{"$f":"VLOOKUP(AN50,リーグ戦表!AH:AI,2,0)","v":{"$error":"#N/A"}}]
[{"$nulls":39},"B1",{"$f":"VLOOKUP(AN51,リーグ戦表!AH:AI,2,0)","v":{"$error":"#N/A"}}]
["D４位",{"$nulls":38},"B2",{"$f":"VLOOKUP(AN52,リーグ戦表!AH:AI,2,0)","v":{"$error":"#N/A"}}]
[{"$nulls":39},"C1",{"$f":"VLOOKUP(AN53,リーグ戦表!AH:AI,2,0)","v":{"$error":"#N/A"}}]
[{"$nulls":39},"C2",{"$f":"VLOOKUP(AN54,リーグ戦表!AH:AI,2,0)","v":{"$error":"#N/A"}}]
[{"$nulls":15},"A⑨",{"$nulls":23},"D1",{"$f":"VLOOKUP(AN55,リーグ戦表!AH:AI,2,0)","v":{"$error":"#N/A"}}]
["B３位",{"$nulls":38},"D2",{"$f":"VLOOKUP(AN56,リーグ戦表!AH:AI,2,0)","v":{"$error":"#N/A"}}]
[]
[]
[{"$nulls":12},"A⑤"]
["C４位"]
[{"$nulls":22},"敢闘賞"]
[{"$nulls":9},"A③"]
[]
["D５位",{"$nulls":17},"B⑪"]
[]
[]
[]
["D３位"]
[]
[{"$nulls":12},"B④"]
[]
["A４位"]
[]
[{"$nulls":15},"B⑨"]
[]
["C４位"]
[]
[{"$nulls":12},"B⑤"]
[]
["B３位"]
[]
[]
[]
[]
[null,null,"ジュニアの部　決勝トーナメント"]
[]
["E１位"]
[{"$nulls":39},"A1",{"$f":"VLOOKUP(AN88,リーグ戦表!AH:AI,2,0)","v":{"$error":"#N/A"}}]
[{"$nulls":10},"A①",{"$nulls":28},"A2",{"$f":"VLOOKUP(AN89,リーグ戦表!AH:AI,2,0)","v":{"$error":"#N/A"}}]
[{"$nulls":39},"B1",{"$f":"VLOOKUP(AN90,リーグ戦表!AH:AI,2,0)","v":{"$error":"#N/A"}}]
["H２位",{"$nulls":38},"B2",{"$f":"VLOOKUP(AN91,リーグ戦表!AH:AI,2,0)","v":{"$error":"#N/A"}}]
[{"$nulls":39},"C1",{"$f":"VLOOKUP(AN92,リーグ戦表!AH:AI,2,0)","v":{"$error":"#N/A"}}]
[{"$nulls":13},"A⑥",{"$nulls":25},"C2",{"$f":"VLOOKUP(AN93,リーグ戦表!AH:AI,2,0)","v":{"$error":"#N/A"}}]
[{"$nulls":39},"D1",{"$f":"VLOOKUP(AN94,リーグ戦表!AH:AI,2,0)","v":{"$error":"#N/A"}}]
["F２位",{"$nulls":38},"D2",{"$f":"VLOOKUP(AN95,リーグ戦表!AH:AI,2,0)","v":{"$error":"#N/A"}}]
[]
[{"$nulls":10},"A②"]
[{"$nulls":21},"優　勝"]
["G１位"]
[{"$nulls":16},"B⑩"]
[]
[]
["H１位"]
[]
[{"$nulls":10},"B①"]
[]
["E２位"]
[]
[{"$nulls":13},"B⑥"]
[]
["G２位"]
[]
[{"$nulls":10},"B②"]
[]
["F１位"]
[]
[]
[]
[{"$nulls":21},"３　位"]
[]
[{"$nulls":16},"A⑩"]

{"sheet":"優秀選手","index":4,"n_rows":45,"n_cols":7,"rows_kept":45,"merged":[[0,1,0,6],[1,1,1,5]]}
[null,"第２０回　加賀地域少年少女ドッジボール大会優秀選手"]
[]
[null,"番号","ﾌﾞﾛｯｸ","チ　ー　ム　名","氏名","ふりがな","学年"]
[null,{"$f":"チーム表!B4","v":1},{"$f":"チーム表!C4","v":"A1"},{"$f":"チーム表!D4","v":"鞍月アタッカーズ"}]
[null,{"$f":"チーム表!B5","v":2},{"$f":"チーム表!C5","v":"A2"},{"$f":"チーム表!D5","v":"針原パイレーツ"}]
[null,{"$f":"チーム表!B6","v":3},{"$f":"チーム表!C6","v":"A3"},{"$f":"チーム表!D6","v":"小木クラブ"}]
[null,{"$f":"チーム表!B7","v":4},{"$f":"チーム表!C7","v":"A4"},{"$f":"チーム表!D7","v":"NISHIファイヤースターズ"}]
[null,{"$f":"チーム表!B8","v":5},{"$f":"チーム表!C8","v":"B1"},{"$f":"チーム表!D8","v":"呉羽ドッジボールクラブ"}]
[null,{"$f":"チーム表!B9","v":6},{"$f":"チーム表!C9","v":"B2"},{"$f":"チーム表!D9","v":"鳳至ドッジボールクラブ"}]
[null,{"$f":"チーム表!B10","v":7},{"$f":"チーム表!C10","v":"B3"},{"$f":"チーム表!D10","v":"千坂ドッジファイヤーズ"}]
[null,{"$f":"チーム表!B11","v":8},{"$f":"チーム表!C11","v":"B4"},{"$f":"チーム表!D11","v":"松任の大魔陣"}]
[null,{"$f":"チーム表!B12","v":9},{"$f":"チーム表!C12","v":"C1"},{"$f":"チーム表!D12","v":"光陽マーリンズ"}]
[null,{"$f":"チーム表!B13","v":10},{"$f":"チーム表!C13","v":"C2"},{"$f":"チーム表!D13","v":"中郷ドッジボールクラブ"}]
[null,{"$f":"チーム表!B14","v":11},{"$f":"チーム表!C14","v":"C3"},{"$f":"チーム表!D14","v":"鵜川ミラクルフェニックス"}]
[null,{"$f":"チーム表!B15","v":12},{"$f":"チーム表!C15","v":"C4"},{"$f":"チーム表!D15","v":"向本折クラブA"}]
[null,{"$f":"チーム表!B16","v":13},{"$f":"チーム表!C16","v":"D1"},{"$f":"チーム表!D16","v":"飯野マジックス"}]
[null,{"$f":"チーム表!B17","v":14},{"$f":"チーム表!C17","v":"D2"},{"$f":"チーム表!D17","v":"三馬パワフル"}]
[null,{"$f":"チーム表!B18","v":15},{"$f":"チーム表!C18","v":"D3"},{"$f":"チーム表!D18","v":"寺井クラブ"}]
[null,{"$f":"チーム表!B19","v":16},{"$f":"チーム表!C19","v":"D4"},{"$f":"チーム表!D19","v":"大門ドッジボールクラブ"}]
[null,{"$f":"チーム表!B20","v":17},{"$f":"チーム表!C20","v":"D5"},{"$f":"チーム表!D20","v":"田上闘球DREAMS"}]
[null,{"$f":"チーム表!B21","v":"Jr1"},{"$f":"チーム表!C21","v":"E1"},{"$f":"チーム表!D21","v":"鞍月アタッカーズジュニア"}]
[null,{"$f":"チーム表!B22","v":"Jr2"},{"$f":"チーム表!C22","v":"E2"},{"$f":"チーム表!D22","v":"鳳至ジュニア"}]
[null,{"$f":"チーム表!B23","v":"Jr3"},{"$f":"チーム表!C23","v":"E3"},{"$f":"チーム表!D23","v":"中郷ミラクルジュニア"}]
[null,{"$f":"チーム表!B24","v":"Jr4"},{"$f":"チーム表!C24","v":"E4"},{"$f":"チーム表!D24","v":"ドッジの王子様"}]
[null,{"$f":"チーム表!B25","v":"Jr5"},{"$f":"チーム表!C25","v":"F1"},{"$f":"チーム表!D25","v":"九十九クラブ"}]
[null,{"$f":"チーム表!B26","v":"Jr6"},{"$f":"チーム表!C26","v":"F2"},{"$f":"チーム表!D26","v":"千坂ロータスルート"}]
[null,{"$f":"チーム表!B27","v":"Jr7"},{"$f":"チーム表!C27","v":"F3"},{"$f":"チーム表!D27","v":"向本折クラブNew"}]
[null,{"$f":"チーム表!B28","v":"Jr8"},{"$f":"チーム表!C28","v":"F4"},{"$f":"チーム表!D28","v":"寺井クラブＪｒ　A"}]
[null,{"$f":"チーム表!B29","v":"Jr9"},{"$f":"チーム表!C29","v":"G1"},{"$f":"チーム表!D29","v":"鞍月アタッカーズキッズ"}]
[null,{"$f":"チーム表!B30","v":"Jr10"},{"$f":"チーム表!C30","v":"G2"},{"$f":"チーム表!D30","v":"松任の大魔陣Jr."}]
[null,{"$f":"チーム表!B31","v":"Jr11"},{"$f":"チーム表!C31","v":"G3"},{"$f":"チーム表!D31","v":"鵜川フェニックスジュニア"}]
[null,{"$f":"チーム表!B32","v":"Jr12"},{"$f":"チーム表!C32","v":"G4"},{"$f":"チーム表!D32","v":"大門ドッジボールクラブJr"}]
[null,{"$f":"チーム表!B33","v":"Jr13"},{"$f":"チーム表!C33","v":"H1"},{"$f":"チーム表!D33","v":"呉羽DBCジュニア"}]
[null,{"$f":"チーム表!B34","v":"Jr14"},{"$f":"チーム表!C34","v":"H2"},{"$f":"チーム表!D34","v":"NISHI　Jrスターズ"}]
[null,{"$f":"チーム表!B35","v":"Jr15"},{"$f":"チーム表!C35","v":"H3"},{"$f":"チーム表!D35","v":"寺井クラブＪｒ　B"}]
[null,{"$f":"チーム表!B36","v":"Jr16"},{"$f":"チーム表!C36","v":"H4"},{"$f":"チーム表!D36","v":"田上闘球FUTURES"}]
[null,"一5","G5","魔陣一家",null,"由水　伸弥"]
[null,"女１","H1","鞍月マミーズ",null,"廣岡　俊和"]
[null,"女２","H2","NISHIヤングスターズ",null,"足滝　信雄"]
[null,"女３","H3","山中Oba",null,"中田　勝博"]
[null,"女４","H4","田上闘球HAPPYS",null,"盛一　純平"]
[null,"女５","I1","チーム新米ママ",null,"山田　ユカ子"]
[null,"女６","I2","千坂Ｍファイヤーズ",null,"下野　高広"]
[null,"女７","I3","寺井Ｐ．P♪",null,"山田　幸嗣"]
[null,"女８","I4","魔舞陣",null,"由水　伸弥"]

{"sheet":"DATA1","index":5,"n_rows":0,"n_cols":0,"rows_kept":0}

{"sheet":"DATA","index":6,"n_rows":0,"n_cols":0,"rows_kept":0}

{"sheet":"対戦表1","index":7,"n_rows":0,"n_cols":0,"rows_kept":0}

{"sheet":"対戦表2","index":8,"n_rows":0,"n_cols":0,"rows_kept":0}

{"sheet":"対戦表3","index":9,"n_rows":0,"n_cols":0,"rows_kept":0}

{"sheet":"組合表","index":10,"n_rows":55,"n_cols":39,"rows_kept":55,"merged":[[2,32,2,33],[2,34,2,35],[2,36,2,37]]}
[{"$nulls":25},26]
[{"$nulls":25},52]
[1,2,3,4,5,6,7,8,9,10,11,12,13,14,15,16,17,18,19,20,21,22,23,24,25,{"$nulls":7},"Aコート",null,"Ｂコート",null,"Ｃコート"]
[null,5,"D","D1D2","D3D4","D1D5","D2D3","D4D5","D1D4","D2D5","D1D3","D2D4","D3D5",{"$nulls":13},"D1D2",null,"D1D2","A1A2",null,null,{"$f":"LEFT(AC4,2)","v":"D1"},{"$f":"RIGHT(AC4,2)","v":"D2"},{"$f":"LEFT(AD4,2)","v":"A1"},{"$f":"RIGHT(AD4,2)","v":"A2"},{"$f":"LEFT(AE4,2)","v":""},{"$f":"RIGHT(AE4,2)","v":""},1]
[null,4,"A","A1A2","A3A4","A2A3","A1A4","A1A3","A2A4",{"$nulls":17},"A1A2",null,"B1B2","C1C2",null,null,{"$f":"LEFT(AC5,2)","v":"B1"},{"$f":"RIGHT(AC5,2)","v":"B2"},{"$f":"LEFT(AD5,2)","v":"C1"},{"$f":"RIGHT(AD5,2)","v":"C2"},{"$f":"LEFT(AE5,2)","v":""},{"$f":"RIGHT(AE5,2)","v":""},2]
[null,4,"B","B1B2","B3B4","B2B3","B1B4","B1B3","B2B4",{"$nulls":17},"B1B2",null,"E1E2","F1F2",null,null,"E1","E2","F1","F2","","",3]
[null,4,"C","C1C2","C3C4","C2C3","C1C4","C1C3","C2C4",{"$nulls":17},"C1C2",null,"G1G2","H1H2",null,null,"G1","G2","H1","H2","","",4]
[null,4,"E","E1E2","E3E4","E2E3","E1E4","E1E3","E2E4",{"$nulls":17},"E1E2",null,"D3D4","A3A4",null,null,"D3","D4","A3","A4","","",5]
[null,4,"F","F1F2","F3F4","F2F3","F1F4","F1F3","F2F4",{"$nulls":17},"F1F2",null,"B3B4","C3C4",null,null,"B3","B4","C3","C4","","",6]
[null,4,"G","G1G2","G3G4","G2G3","G1G4","G1G3","G2G4",{"$nulls":17},"G1G2",null,"E3E4","F3F4",null,null,"E3","E4","F3","F4","","",7]
[null,4,"H","H1H2","H3H4","H2H3","H1H4","H1H3","H2H4",{"$nulls":17},"H1H2",null,"G3G4","H3H4",null,null,"G3","G4","H3","H4","","",8]
[{"$nulls":26},"D3D4",null,"D1D5","A2A3",null,null,"D1","D5","A2","A3","","",9]
[{"$nulls":26},"A3A4",null,"B2B3","C2C3",null,null,"B2","B3","C2","C3","","",10]
[{"$nulls":26},"B3B4",null,"E2E3","F2F3",null,null,"E2","E3","F2","F3","","",11]
[{"$nulls":26},"C3C4",null,"G2G3","H2H3",null,null,"G2","G3","H2","H3","","",12]
[{"$nulls":26},"E3E4",null,"D2D3","A1A4",null,null,"D2","D3","A1","A4","","",13]
[{"$nulls":26},"F3F4",null,"B1B4","C1C4",null,null,"B1","B4","C1","C4","","",14]
[{"$nulls":26},"G3G4",null,"E1E4","F1F4",null,null,"E1","E4","F1","F4","","",15]
[{"$nulls":26},"H3H4",null,"G1G4","H1H4",null,null,"G1","G4","H1","H4","","",16]
[{"$nulls":26},"D1D5",null,"D4D5","A1A3",null,null,"D4","D5","A1","A3","","",17]
[{"$nulls":26},"A2A3",null,"B1B3","C1C3",null,null,"B1","B3","C1","C3","","",18]
[{"$nulls":26},"B2B3",null,"E1E3","F1F3",null,null,"E1","E3","F1","F3","","",19]
[{"$nulls":26},"C2C3",null,"G1G3","H1H3",null,null,"G1","G3","H1","H3","","",20]
[{"$nulls":26},"E2E3",null,"D1D4","A2A4",null,null,"D1","D4","A2","A4","","",21]
[{"$nulls":26},"F2F3",null,"B2B4","C2C4",null,null,"B2","B4","C2","C4","","",22]
[{"$nulls":26},"G2G3",null,"E2E4","F2F4",null,null,"E2","E4","F2","F4","","",23]
[{"$nulls":3},1,2,3,4,5,6,7,8,9,10,11,12,13,14,15,16,17,18,19,20,"21",null,null,"H2H3",null,"G2G4","H2H4",null,null,"G2","G4","H2","H4","","",24]
["７チーム",null,"B",{"$f":"CONCATENATE(C28,1,C28,2)","v":"B1B2"},{"$f":"CONCATENATE(C28,3,C28,4)","v":"B3B4"},{"$f":"CONCATENATE(C28,5,C28,6)","v":"B5B6"},{"$f":"CONCATENATE(C28,1,C28,7)","v":"B1B7"},{"$f":"CONCATENATE(C28,2,C28,3)","v":"B2B3"},{"$f":"CONCATENATE(C28,4,C28,5)","v":"B4B5"},{"$f":"CONCATENATE(C28,6,C28,7)","v":"B6B7"},{"$f":"CONCATENATE(C28,1,C28,4)","v":"B1B4"},{"$f":"CONCATENATE(C28,2,C28,5)","v":"B2B5"},{"$f":"CONCATENATE(C28,3,C28,6)","v":"B3B6"},{"$f":"CONCATENATE(C28,4,C28,7)","v":"B4B7"},{"$f":"CONCATENATE(C28,1,C28,6)","v":"B1B6"},{"$f":"CONCATENATE(C28,5,C28,7)","v":"B5B7"},{"$f":"CONCATENATE(C28,1,C28,3)","v":"B1B3"},{"$f":"CONCATENATE(C28,2,C28,4)","v":"B2B4"},{"$f":"CONCATENATE(C28,3,C28,5)","v":"B3B5"},{"$f":"CONCATENATE(C28,4,C28,6)","v":"B4B6"},{"$f":"CONCATENATE(C28,2,C28,7)","v":"B2B7"},{"$f":"CONCATENATE(C28,1,C28,5)","v":"B1B5"},{"$f":"CONCATENATE(C28,2,C28,6)","v":"B2B6"},{"$f":"CONCATENATE(C28,3,C28,7)","v":"B3B7"},null,null,"D2D3",null,"D2D5","D1D3",null,null,"D2","D5","D1","D3","","",25]
["6チーム",null,"A",{"$f":"CONCATENATE(C29,1,C29,2)","v":"A1A2"},{"$f":"CONCATENATE(C29,3,C29,4)","v":"A3A4"},{"$f":"CONCATENATE(C29,5,C29,6)","v":"A5A6"},{"$f":"CONCATENATE(C29,1,C29,3)","v":"A1A3"},{"$f":"CONCATENATE(C29,2,C29,4)","v":"A2A4"},{"$f":"CONCATENATE(C29,3,C29,5)","v":"A3A5"},{"$f":"CONCATENATE(C29,4,C29,6)","v":"A4A6"},{"$f":"CONCATENATE(C29,1,C29,5)","v":"A1A5"},{"$f":"CONCATENATE(C29,2,C29,6)","v":"A2A6"},{"$f":"CONCATENATE(C29,1,C29,4)","v":"A1A4"},{"$f":"CONCATENATE(C29,2,C29,5)","v":"A2A5"},{"$f":"CONCATENATE(C29,3,C29,6)","v":"A3A6"},{"$f":"CONCATENATE(C29,4,C29,5)","v":"A4A5"},{"$f":"CONCATENATE(C29,2,C29,3)","v":"A2A3"},{"$f":"CONCATENATE(C29,1,C29,6)","v":"A1A6"},{"$nulls":8},"A1A4",null,"D2D4","D3D5",null,null,"D2","D4","D3","D5","","",26]
["5チーム",null,"D",{"$f":"CONCATENATE(C30,1,C30,2)","v":"D1D2"},{"$f":"CONCATENATE(C30,3,C30,4)","v":"D3D4"},{"$f":"CONCATENATE(C30,1,C30,5)","v":"D1D5"},{"$f":"CONCATENATE(C30,2,C30,3)","v":"D2D3"},{"$f":"CONCATENATE(C30,4,C30,5)","v":"D4D5"},{"$f":"CONCATENATE(C30,1,C30,4)","v":"D1D4"},{"$f":"CONCATENATE(C30,2,C30,5)","v":"D2D5"},{"$f":"CONCATENATE(C30,1,C30,3)","v":"D1D3"},{"$f":"CONCATENATE(C30,2,C30,4)","v":"D2D4"},{"$f":"CONCATENATE(C30,3,C30,5)","v":"D3D5"},{"$nulls":13},"B1B4",{"$nulls":5},"","","","","","",27]
["4チーム",null,"H",{"$f":"CONCATENATE(C31,1,C31,2)","v":"H1H2"},{"$f":"CONCATENATE(C31,3,C31,4)","v":"H3H4"},{"$f":"CONCATENATE(C31,2,C31,3)","v":"H2H3"},{"$f":"CONCATENATE(C31,1,C31,4)","v":"H1H4"},{"$f":"CONCATENATE(C31,1,C31,3)","v":"H1H3"},{"$f":"CONCATENATE(C31,2,C31,4)","v":"H2H4"},{"$nulls":17},"C1C4",{"$nulls":5},"","","","","","",28]
["3チーム",null,"D",{"$f":"CONCATENATE(C32,1,C32,2)","v":"D1D2"},{"$f":"CONCATENATE(C32,2,C32,3)","v":"D2D3"},{"$f":"CONCATENATE(C32,1,C32,3)","v":"D1D3"},{"$nulls":20},"E1E4",{"$nulls":5},"","","","","","",29]
[{"$nulls":26},"F1F4",{"$nulls":5},"","","","","","",30]
[{"$nulls":26},"G1G4",{"$nulls":5},"","","","","","",31]
[{"$nulls":26},"H1H4",{"$nulls":5},"","","","","","",32]
[{"$nulls":26},"D4D5",{"$nulls":5},"","","","","","",33]
[{"$nulls":26},"A1A3",{"$nulls":5},"","","","","","",34]
[{"$nulls":26},"B1B3",{"$nulls":5},{"$f":"LEFT(AC38,2)","v":""},{"$f":"RIGHT(AC38,2)","v":""},{"$f":"LEFT(AD38,2)","v":""},{"$f":"RIGHT(AD38,2)","v":""},{"$f":"LEFT(AE38,2)","v":""},{"$f":"RIGHT(AE38,2)","v":""},35]
[{"$nulls":26},"C1C3",{"$nulls":5},"","","","","","",36]
[{"$nulls":26},"E1E3",{"$nulls":5},"","","","","","",37]
[{"$nulls":26},"F1F3",{"$nulls":5},"","","","","","",38]
[{"$nulls":26},"G1G3",{"$nulls":5},"","","","","","",39]
[{"$nulls":26},"H1H3",{"$nulls":5},"","","","","","",40]
[{"$nulls":26},"D1D4"]
[{"$nulls":26},"A2A4"]
[{"$nulls":26},"B2B4"]
[{"$nulls":26},"C2C4"]
[{"$nulls":26},"E2E4"]
[{"$nulls":26},"F2F4"]
[{"$nulls":26},"G2G4"]
[{"$nulls":26},"H2H4"]
[{"$nulls":26},"D2D5"]
[{"$nulls":26},"D1D3"]
[{"$nulls":26},"D2D4"]
[{"$nulls":26},"D3D5"]