{"text_format":"3","workbook":"xlsx","n_sheets":11,"sheets":["チーム表","対戦表","リーグ戦表","トーナメント表","表彰状","DATA","DATA1","対戦表1","対戦表2","対戦表3","組合表"],"not_rendered":{"images":9,"macros":1,"defined_names":4},"read":"whole","date_system":"1900"}

{"sheet":"チーム表","index":0,"n_rows":58,"n_cols":7,"rows_kept":58,"merged":[[0,1,0,5],[1,1,1,5]]}
[null,"第２７回　いしかわスポーツ・レクリエーション交流大会\n「第１１回ふれあいドッジボール大会」"]
[null,"参　加　チ　ー　ム"]
[null,"番号","ﾌﾞﾛｯｸ","チ　ー　ム　名","代表者名","県　名"]
[null,1,"A1","下関福光サンダージュニア","中澤　美樹子","富　山"]
[null,2,"A2","NISHIファイヤースターズ","足滝　信雄","石　川"]
[null,3,"A3","小木クラブ","福田　陽三","石　川"]
[null,4,"A4","松任の大魔陣","吉岡　正敏","石　川"]
[null,5,"B1","杉っ子ドッジファイターズ","大井　孝弘","富　山"]
[null,6,"B2","鵜川ミラクルフェニックス","新谷　信之","石　川"]
[null,7,"B3","向本折クラブA","中嶋　大樹","石　川"]
[null,8,"B4","鞍月アタッカーズ","廣岡　俊和","石　川"]
[null,9,"C1","田上闘球DREAMS","盛一　純平","石　川"]
[null,10,"C2","千坂ドッジファイヤーズ","成瀬　章宏","石　川"]
[null,11,"C3","あさひスーパーファイターズ","飯田　真由美","富　山","欠場"]
[null,12,"C4","寺井クラブ","端野　智博","石　川"]
[null,13,"D1","大門ドッジボールクラブ","大橋　潤子","富　山"]
[null,14,"D2","鳳至ドッジボールクラブ","中野　悟","石　川"]
[null,15,"D3","山中SPARS","中田　勝博","石　川"]
[null,16,"D4","三馬パワフル","石田　一栄","石　川"]
[null,"Jr1","E1","鵜川フェニックスｷｯｽﾞ","新谷　信之","石　川"]
[null,"Jr2","E2","千坂ロータスルート","成瀬　章宏","石　川"]
[null,"Jr3","E3","寺井クラブJr","端野　智博","石　川"]
[null,"Jr4","F1","鳳至ジュニア","中野　悟","石　川"]
[null,"Jr5","F2","向本折クラブNew","中嶋　大樹","石　川"]
[null,"Jr6","F3","鞍月アタッカーズジュニア","廣岡　俊和","石　川"]
[null,"Jr7","G1","九十九クラブ","福田　陽三","石　川"]
[null,"Jr8","G2","松任の大魔陣Jr","吉岡　正敏","石　川"]
[null,"Jr9","G3","ドッジの王子様","石田　一栄","石　川"]
[null,"一1","H1","THUNDER(ｻﾝﾀﾞｰ)","寺岡　佑香","富　山"]
[null,"一2","H2","ＳＫＩＰＰＥＲＳ","成瀬　章宏","石　川"]
[null,"一3","H3","山中SPAーS","中田　勝博","石　川"]
[null,"一4","I1","ペヤング","吉岡　正敏","石　川"]
[null,"一5","I2","鞍月アタッカーズＯＮＥ","廣岡　俊和","石　川"]
[null,"一6","I3","新撰組","石田　一栄","石　川"]
[null,"パ1","J1","杉っ子ダディー","大井　孝弘","富　山"]
[null,"パ2","J2","松任の大魔陣オールディーズ","吉岡　正敏","石　川"]
[null,"パ3","J3","パパ合同チーム",null,"石　川"]
[null,"マ1","K1","松任の大魔陣Ladies","吉岡　正敏","石　川"]
[null,"マ2","K2","鞍月マミ～ズ","廣岡　俊和","石　川"]
[null,"マ3","K3","田上闘球HAPPYS","盛一　純平","石　川"]
[null,"マ4","K4","ママ合同チーム",null,"石　川"]
[null,"親１","L1","田上闘球親子","盛一　純平","石　川"]
[null,"親２","L2","フェニックスと頑固なお父さん","新谷　信之","石　川"]
[null,"親３","L3","松任の大魔陣ファミリー","吉岡　正敏","石　川"]
[null,"親４","L4","三馬パワフルファミリー","石田　一栄","石　川"]
[null,"親５","M1","NISHIファミリーズ","足滝　信雄","石　川"]
[null,"親６","M2","鳳至ファミリーズ","中野　悟","石　川"]
[null,"親７","M3","テライFamily’＄","端野　智博","石　川"]
[null,"親８","M4","鞍月ファミリーズ","廣岡　俊和","石　川"]
[null,"ミ親１","N1","田上闘球ミドル","盛一　純平","石　川"]
[null,"ミ親２","N2","鳳至あまさんず","中野　悟","石　川"]
[null,"ミ親３","N3","松任の大魔陣ミドルファミリー","吉岡　正敏","石　川"]
[null,"ミ親４","O1","宇出津っ子と優しいお母さん","新谷　信之","石　川"]
[null,"ミ親５","O2","向本折ファミリー","中嶋　大樹","石　川"]
[null,"ミ親６","O3","鞍月ミドルファミリーズ","廣岡　俊和","石　川"]
[null,"ミ親７","P1","千坂ゼブラーズG","成瀬　章宏","石　川"]
[null,"ミ親８","P2","小木クLOVE♡楽球会","福田　奈央","石　川"]
[null,"ミ親９","P3","Ｊ－テライｆａｍｉｌｙ’＄","端野　智博","石　川"]

{"sheet":"対戦表","index":1,"n_rows":166,"n_cols":34,"rows_kept":166,"merged":[[0,0,0,20],[1,0,1,20],[38,5,38,10],[38,15,38,20],[38,25,38,30],[39,5,39,10],[39,15,39,20],[39,25,39,30],[40,5,40,10],[40,15,40,20],[40,25,40,30],[41,5,41,10],[41,15,41,20],[42,5,42,10],[42,15,42,20],[42,25,42,30],[43,5,43,10],[43,25,43,30],[44,5,44,10],[44,15,44,20],[44,25,44,30],[45,5,45,10],[45,15,45,20],[46,5,46,10],[46,15,46,20],[47,5,47,10],[47,15,47,20],[48,5,48,10],[48,15,48,20],[48,25,48,30]]}
[{"$f":"チーム表!$B$1","v":"第２７回　いしかわスポーツ・レクリエーション交流大会\n「第１１回ふれあいドッジボール大会」"},{"$nulls":28},"予選試合数",31]
["　試合スケジュール",{"$nulls":24},"最大試合数４０",{"$nulls":3},"注意：",null,null,"行挿入は行わないで下さい。"]
[null,"時間",null,null,"点","Ａコート",{"$nulls":3},"点","Ａコート",{"$nulls":3},"点","Ｂコート",{"$nulls":3},"点","Ｂコート"]
[1,"09:30:00",{"$f":"組合表!AG4","v":"A1"},{"$f":"CONCATENATE(C4,H4)","v":"A1A2"},11,{"$f":"VLOOKUP(C4,チーム表!C:D,2,FALSE)","v":"下関福光サンダージュニア"},"×",{"$f":"組合表!AH4","v":"A2"},{"$f":"CONCATENATE(H4,C4)","v":"A2A1"},4,{"$f":"VLOOKUP(H4,チーム表!C:D,2,FALSE)","v":"NISHIファイヤースターズ"},null,{"$f":"組合表!AI4","v":"B1"},{"$f":"CONCATENATE(M4,R4)","v":"B1B2"},8,{"$f":"VLOOKUP(M4,チーム表!C:D,2,FALSE)","v":"杉っ子ドッジファイターズ"},"×",{"$f":"組合表!AJ4","v":"B2"},{"$f":"CONCATENATE(R4,M4)","v":"B2B1"},4,{"$f":"VLOOKUP(R4,チーム表!C:D,2,FALSE)","v":"鵜川ミラクルフェニックス"}]
[2,"09:40:00",{"$f":"組合表!AG5","v":"C1"},{"$f":"CONCATENATE(C5,H5)","v":"C1C2"},3,{"$f":"VLOOKUP(C5,チーム表!C:D,2,FALSE)","v":"田上闘球DREAMS"},"×",{"$f":"組合表!AH5","v":"C2"},{"$f":"CONCATENATE(H5,C5)","v":"C2C1"},9,{"$f":"VLOOKUP(H5,チーム表!C:D,2,FALSE)","v":"千坂ドッジファイヤーズ"},null,{"$f":"組合表!AI5","v":"D1"},{"$f":"CONCATENATE(M5,R5)","v":"D1D2"},8,{"$f":"VLOOKUP(M5,チーム表!C:D,2,FALSE)","v":"大門ドッジボールクラブ"},"×",{"$f":"組合表!AJ5","v":"D2"},{"$f":"CONCATENATE(R5,M5)","v":"D2D1"},6,{"$f":"VLOOKUP(R5,チーム表!C:D,2,FALSE)","v":"鳳至ドッジボールクラブ"}]
[3,"09:50:00",{"$f":"組合表!AG6","v":"K1"},"K1K2",0,{"$f":"VLOOKUP(C6,チーム表!C:D,2,FALSE)","v":"松任の大魔陣Ladies"},"×",{"$f":"組合表!AH6","v":"K2"},"K2K1",7,{"$f":"VLOOKUP(H6,チーム表!C:D,2,FALSE)","v":"鞍月マミ～ズ"},null,"E1","E1E2",4,{"$f":"VLOOKUP(M6,チーム表!C:D,2,FALSE)","v":"鵜川フェニックスｷｯｽﾞ"},"×","E2","E2E1",5,{"$f":"VLOOKUP(R6,チーム表!C:D,2,FALSE)","v":"千坂ロータスルート"},{"$nulls":11},{"$f":"D4","v":"A1A2"},{"$f":"IF(E4=\"\",\"\",E4)","v":11}]
[4,"10:00:00","F1","F1F2",0,{"$f":"VLOOKUP(C7,チーム表!C:D,2,FALSE)","v":"鳳至ジュニア"},"×","F2","F2F1",6,{"$f":"VLOOKUP(H7,チーム表!C:D,2,FALSE)","v":"向本折クラブNew"},null,"G1","G1G2",null,{"$f":"VLOOKUP(M7,チーム表!C:D,2,FALSE)","v":"九十九クラブ"},"×","G2","G2G1",null,{"$f":"VLOOKUP(R7,チーム表!C:D,2,FALSE)","v":"松任の大魔陣Jr"},{"$nulls":11},"C1C2",{"$f":"IF(E5=\"\",\"\",E5)","v":3}]
[5,"10:10:00","H1","H1H2",7,{"$f":"VLOOKUP(C8,チーム表!C:D,2,FALSE)","v":"THUNDER(ｻﾝﾀﾞｰ)"},"×","H2","H2H1",1,{"$f":"VLOOKUP(H8,チーム表!C:D,2,FALSE)","v":"ＳＫＩＰＰＥＲＳ"},null,"I1","I1I2",8,{"$f":"VLOOKUP(M8,チーム表!C:D,2,FALSE)","v":"ペヤング"},"×","I2","I2I1",0,{"$f":"VLOOKUP(R8,チーム表!C:D,2,FALSE)","v":"鞍月アタッカーズＯＮＥ"},{"$nulls":11},"K1K2","00:00:00"]
[6,"10:20:00","J1","J1J2",5,{"$f":"VLOOKUP(C9,チーム表!C:D,2,FALSE)","v":"杉っ子ダディー"},"×","J2","J2J1",3,{"$f":"VLOOKUP(H9,チーム表!C:D,2,FALSE)","v":"松任の大魔陣オールディーズ"},null,"E2","E2E3",4,{"$f":"VLOOKUP(M9,チーム表!C:D,2,FALSE)","v":"千坂ロータスルート"},"×","E3","E3E2",0,{"$f":"VLOOKUP(R9,チーム表!C:D,2,FALSE)","v":"寺井クラブJr"},{"$nulls":11},"F1F2","00:00:00"]
[7,"10:30:00","A3","A3A4",8,{"$f":"VLOOKUP(C10,チーム表!C:D,2,FALSE)","v":"小木クラブ"},"×","A4","A4A3",6,{"$f":"VLOOKUP(H10,チーム表!C:D,2,FALSE)","v":"松任の大魔陣"},null,"D3","D3D4",9,{"$f":"VLOOKUP(M10,チーム表!C:D,2,FALSE)","v":"山中SPARS"},"×","D4","D4D3",1,{"$f":"VLOOKUP(R10,チーム表!C:D,2,FALSE)","v":"三馬パワフル"},{"$nulls":11},"H1H2",7]
[8,"10:40:00","C3","C3C4",null,{"$f":"VLOOKUP(C11,チーム表!C:D,2,FALSE)","v":"あさひスーパーファイターズ"},"×","C4","C4C3",null,{"$f":"VLOOKUP(H11,チーム表!C:D,2,FALSE)","v":"寺井クラブ"},null,"B3","B3B4",9,{"$f":"VLOOKUP(M11,チーム表!C:D,2,FALSE)","v":"向本折クラブA"},"×","B4","B4B3",9,{"$f":"VLOOKUP(R11,チーム表!C:D,2,FALSE)","v":"鞍月アタッカーズ"},{"$nulls":11},"J1J2",5]
[9,"10:50:00","K3","K3K4",0,{"$f":"VLOOKUP(C12,チーム表!C:D,2,FALSE)","v":"田上闘球HAPPYS"},"×","K4","K4K3",5,{"$f":"VLOOKUP(H12,チーム表!C:D,2,FALSE)","v":"ママ合同チーム"},null,"G2","G2G3",4,{"$f":"VLOOKUP(M12,チーム表!C:D,2,FALSE)","v":"松任の大魔陣Jr"},"×","G3","G3G2",2,{"$f":"VLOOKUP(R12,チーム表!C:D,2,FALSE)","v":"ドッジの王子様"},{"$nulls":11},"A3A4",8]
[10,"11:00:00","F2","F2F3",7,{"$f":"VLOOKUP(C13,チーム表!C:D,2,FALSE)","v":"向本折クラブNew"},"×","F3","F3F2",0,{"$f":"VLOOKUP(H13,チーム表!C:D,2,FALSE)","v":"鞍月アタッカーズジュニア"},null,"D2","D2D3",8,{"$f":"VLOOKUP(M13,チーム表!C:D,2,FALSE)","v":"鳳至ドッジボールクラブ"},"×","D3","D3D2",9,{"$f":"VLOOKUP(R13,チーム表!C:D,2,FALSE)","v":"山中SPARS"},{"$nulls":11},"C3C4",""]
[11,"11:10:00","H2","H2H3",0,{"$f":"VLOOKUP(C14,チーム表!C:D,2,FALSE)","v":"ＳＫＩＰＰＥＲＳ"},"×","H3","H3H2",6,{"$f":"VLOOKUP(H14,チーム表!C:D,2,FALSE)","v":"山中SPAーS"},null,"B2","B2B3",8,{"$f":"VLOOKUP(M14,チーム表!C:D,2,FALSE)","v":"鵜川ミラクルフェニックス"},"×","B3","B3B2",8,{"$f":"VLOOKUP(R14,チーム表!C:D,2,FALSE)","v":"向本折クラブA"},{"$nulls":11},"K3K4","00:00:00"]
[12,"11:20:00","J2","J2J3",7,{"$f":"VLOOKUP(C15,チーム表!C:D,2,FALSE)","v":"松任の大魔陣オールディーズ"},"×","J3","J3J2",3,{"$f":"VLOOKUP(H15,チーム表!C:D,2,FALSE)","v":"パパ合同チーム"},null,"I2","I2I3",4,{"$f":"VLOOKUP(M15,チーム表!C:D,2,FALSE)","v":"鞍月アタッカーズＯＮＥ"},"×","I3","I3I2",4,{"$f":"VLOOKUP(R15,チーム表!C:D,2,FALSE)","v":"新撰組"},{"$nulls":11},"F2F3",7]
[13,"11:30:00","A2","A2A3",6,{"$f":"VLOOKUP(C16,チーム表!C:D,2,FALSE)","v":"NISHIファイヤースターズ"},"×","A3","A3A2",5,{"$f":"VLOOKUP(H16,チーム表!C:D,2,FALSE)","v":"小木クラブ"},null,"E1","E1E3",4,{"$f":"VLOOKUP(M16,チーム表!C:D,2,FALSE)","v":"鵜川フェニックスｷｯｽﾞ"},"×","E3","E3E1",3,{"$f":"VLOOKUP(R16,チーム表!C:D,2,FALSE)","v":"寺井クラブJr"},{"$nulls":11},"H2H3","00:00:00"]
[14,"11:40:00","C2","C2C3",null,{"$f":"VLOOKUP(C17,チーム表!C:D,2,FALSE)","v":"千坂ドッジファイヤーズ"},"×","C3","C3C2",null,{"$f":"VLOOKUP(H17,チーム表!C:D,2,FALSE)","v":"あさひスーパーファイターズ"},null,"G1","G1G3",null,{"$f":"VLOOKUP(M17,チーム表!C:D,2,FALSE)","v":"九十九クラブ"},"×","G3","G3G1",null,{"$f":"VLOOKUP(R17,チーム表!C:D,2,FALSE)","v":"ドッジの王子様"},{"$nulls":11},"J2J3",7]
[15,"11:50:00","K2","K2K3",5,{"$f":"VLOOKUP(C18,チーム表!C:D,2,FALSE)","v":"鞍月マミ～ズ"},"×","K3","K3K2",0,{"$f":"VLOOKUP(H18,チーム表!C:D,2,FALSE)","v":"田上闘球HAPPYS"},null,"I1","I1I3",3,{"$f":"VLOOKUP(M18,チーム表!C:D,2,FALSE)","v":"ペヤング"},"×","I3","I3I1",4,{"$f":"VLOOKUP(R18,チーム表!C:D,2,FALSE)","v":"新撰組"},{"$nulls":11},"A2A3",6]
[16,"12:00:00","F1","F1F3",3,{"$f":"VLOOKUP(C19,チーム表!C:D,2,FALSE)","v":"鳳至ジュニア"},"×","F3","F3F1",4,{"$f":"VLOOKUP(H19,チーム表!C:D,2,FALSE)","v":"鞍月アタッカーズジュニア"},null,"B1","B1B4",10,{"$f":"VLOOKUP(M19,チーム表!C:D,2,FALSE)","v":"杉っ子ドッジファイターズ"},"×","B4","B4B1",7,{"$f":"VLOOKUP(R19,チーム表!C:D,2,FALSE)","v":"鞍月アタッカーズ"},{"$nulls":11},"C2C3",""]
[17,"12:10:00","H1","H1H3",6,{"$f":"VLOOKUP(C20,チーム表!C:D,2,FALSE)","v":"THUNDER(ｻﾝﾀﾞｰ)"},"×","H3","H3H1",5,{"$f":"VLOOKUP(H20,チーム表!C:D,2,FALSE)","v":"山中SPAーS"},null,"D1","D1D4",9,{"$f":"VLOOKUP(M20,チーム表!C:D,2,FALSE)","v":"大門ドッジボールクラブ"},"×","D4","D4D1",5,{"$f":"VLOOKUP(R20,チーム表!C:D,2,FALSE)","v":"三馬パワフル"},{"$nulls":11},"K2K3",5]
[18,"12:20:00","J1","J1J3",5,{"$f":"VLOOKUP(C21,チーム表!C:D,2,FALSE)","v":"杉っ子ダディー"},"×","J3","J3J1",5,{"$f":"VLOOKUP(H21,チーム表!C:D,2,FALSE)","v":"パパ合同チーム"},null,"A1","A1A3",9,{"$f":"VLOOKUP(M21,チーム表!C:D,2,FALSE)","v":"下関福光サンダージュニア"},"×","A3","A3A1",3,{"$f":"VLOOKUP(R21,チーム表!C:D,2,FALSE)","v":"小木クラブ"},{"$nulls":11},"F1F3",3]
[19,"12:30:00","A1","A1A4",10,{"$f":"VLOOKUP(C22,チーム表!C:D,2,FALSE)","v":"下関福光サンダージュニア"},"×","A4","A4A1",5,{"$f":"VLOOKUP(H22,チーム表!C:D,2,FALSE)","v":"松任の大魔陣"},null,"C1","C1C3",null,{"$f":"VLOOKUP(M22,チーム表!C:D,2,FALSE)","v":"田上闘球DREAMS"},"×","C3","C3C1",null,{"$f":"VLOOKUP(R22,チーム表!C:D,2,FALSE)","v":"あさひスーパーファイターズ"},{"$nulls":11},"H1H3",6]
[20,"12:40:00","C1","C1C4",8,{"$f":"VLOOKUP(C23,チーム表!C:D,2,FALSE)","v":"田上闘球DREAMS"},"×","C4","C4C1",8,{"$f":"VLOOKUP(H23,チーム表!C:D,2,FALSE)","v":"寺井クラブ"},null,"B2","B2B4",1,{"$f":"VLOOKUP(M23,チーム表!C:D,2,FALSE)","v":"鵜川ミラクルフェニックス"},"×","B4","B4B2",11,{"$f":"VLOOKUP(R23,チーム表!C:D,2,FALSE)","v":"鞍月アタッカーズ"},{"$nulls":11},"J1J3",5]
[21,"12:50:00","D1","D1D3",6,{"$f":"VLOOKUP(C24,チーム表!C:D,2,FALSE)","v":"大門ドッジボールクラブ"},"×","D3","D3D1",8,{"$f":"VLOOKUP(H24,チーム表!C:D,2,FALSE)","v":"山中SPARS"},null,"K1","K1K3",3,{"$f":"VLOOKUP(M24,チーム表!C:D,2,FALSE)","v":"松任の大魔陣Ladies"},"×","K3","K3K1",5,{"$f":"VLOOKUP(R24,チーム表!C:D,2,FALSE)","v":"田上闘球HAPPYS"},{"$nulls":11},"A1A4",10]
[22,"13:00:00","B1","B1B3",9,{"$f":"VLOOKUP(C25,チーム表!C:D,2,FALSE)","v":"杉っ子ドッジファイターズ"},"×","B3","B3B1",7,{"$f":"VLOOKUP(H25,チーム表!C:D,2,FALSE)","v":"向本折クラブA"},null,"D2","D2D4",10,{"$f":"VLOOKUP(M25,チーム表!C:D,2,FALSE)","v":"鳳至ドッジボールクラブ"},"×","D4","D4D2",3,{"$f":"VLOOKUP(R25,チーム表!C:D,2,FALSE)","v":"三馬パワフル"},{"$nulls":11},"C1C4",8]
[23,"13:10:00","K1","K1K4",3,{"$f":"VLOOKUP(C26,チーム表!C:D,2,FALSE)","v":"松任の大魔陣Ladies"},"×","K4","K4K1",2,{"$f":"VLOOKUP(H26,チーム表!C:D,2,FALSE)","v":"ママ合同チーム"},null,"L1","L1L2",4,{"$f":"VLOOKUP(M26,チーム表!C:D,2,FALSE)","v":"田上闘球親子"},"×","L2","L2L1",3,{"$f":"VLOOKUP(R26,チーム表!C:D,2,FALSE)","v":"フェニックスと頑固なお父さん"},{"$nulls":11},"D1D3",6]
[24,"13:20:00","A2","A2A4",9,{"$f":"VLOOKUP(C27,チーム表!C:D,2,FALSE)","v":"NISHIファイヤースターズ"},"×","A4","A4A2",8,{"$f":"VLOOKUP(H27,チーム表!C:D,2,FALSE)","v":"松任の大魔陣"},null,"P1","P1P2",5,{"$f":"VLOOKUP(M27,チーム表!C:D,2,FALSE)","v":"千坂ゼブラーズG"},"×","P2","P2P1",6,{"$f":"VLOOKUP(R27,チーム表!C:D,2,FALSE)","v":"小木クLOVE♡楽球会"},{"$nulls":11},"B1B3",9]
[25,"13:30:00","C2","C2C4",10,{"$f":"VLOOKUP(C28,チーム表!C:D,2,FALSE)","v":"千坂ドッジファイヤーズ"},"×","C4","C4C2",5,{"$f":"VLOOKUP(H28,チーム表!C:D,2,FALSE)","v":"寺井クラブ"},null,"N1","N1N2",8,{"$f":"VLOOKUP(M28,チーム表!C:D,2,FALSE)","v":"田上闘球ミドル"},"×","N2","N2N1",0,{"$f":"VLOOKUP(R28,チーム表!C:D,2,FALSE)","v":"鳳至あまさんず"},{"$nulls":11},"K1K4",3]
[26,"13:40:00","K2","K2K4",1,{"$f":"VLOOKUP(C29,チーム表!C:D,2,FALSE)","v":"鞍月マミ～ズ"},"×","K4","K4K2",2,{"$f":"VLOOKUP(H29,チーム表!C:D,2,FALSE)","v":"ママ合同チーム"},null,"L3","L3L4",7,{"$f":"VLOOKUP(M29,チーム表!C:D,2,FALSE)","v":"松任の大魔陣ファミリー"},"×","L4","L4L3",0,{"$f":"VLOOKUP(R29,チーム表!C:D,2,FALSE)","v":"三馬パワフルファミリー"},{"$nulls":11},"A2A4",9]
[27,"13:50:00","M1","M1M2",3,{"$f":"VLOOKUP(C30,チーム表!C:D,2,FALSE)","v":"NISHIファミリーズ"},"×","M2","M2M1",0,{"$f":"VLOOKUP(H30,チーム表!C:D,2,FALSE)","v":"鳳至ファミリーズ"},null,"N2","N2N3",2,{"$f":"VLOOKUP(M30,チーム表!C:D,2,FALSE)","v":"鳳至あまさんず"},"×","N3","N3N2",5,{"$f":"VLOOKUP(R30,チーム表!C:D,2,FALSE)","v":"松任の大魔陣ミドルファミリー"},{"$nulls":11},"C2C4",10]
[28,"14:00:00","O1","O1O2",4,{"$f":"VLOOKUP(C31,チーム表!C:D,2,FALSE)","v":"宇出津っ子と優しいお母さん"},"×","O2","O2O1",6,{"$f":"VLOOKUP(H31,チーム表!C:D,2,FALSE)","v":"向本折ファミリー"},null,"P2","P2P3",8,{"$f":"VLOOKUP(M31,チーム表!C:D,2,FALSE)","v":"小木クLOVE♡楽球会"},"×","P3","P3P2",0,{"$f":"VLOOKUP(R31,チーム表!C:D,2,FALSE)","v":"Ｊ－テライｆａｍｉｌｙ’＄"},{"$nulls":11},"K2K4",1]
[29,"14:10:00","M3","M3M4",3,{"$f":"VLOOKUP(C32,チーム表!C:D,2,FALSE)","v":"テライFamily’＄"},"×","M4","M4M3",4,{"$f":"VLOOKUP(H32,チーム表!C:D,2,FALSE)","v":"鞍月ファミリーズ"},null,"L2","L2L3",3,{"$f":"VLOOKUP(M32,チーム表!C:D,2,FALSE)","v":"フェニックスと頑固なお父さん"},"×","L3","L3L2",3,{"$f":"VLOOKUP(R32,チーム表!C:D,2,FALSE)","v":"松任の大魔陣ファミリー"},{"$nulls":11},"M1M2",3]
[30,"14:20:00","O2","O2O3",2,{"$f":"VLOOKUP(C33,チーム表!C:D,2,FALSE)","v":"向本折ファミリー"},"×","O3","O3O2",4,{"$f":"VLOOKUP(H33,チーム表!C:D,2,FALSE)","v":"鞍月ミドルファミリーズ"},null,"N1","N1N3",3,{"$f":"VLOOKUP(M33,チーム表!C:D,2,FALSE)","v":"田上闘球ミドル"},"×","N3","N3N1",5,{"$f":"VLOOKUP(R33,チーム表!C:D,2,FALSE)","v":"松任の大魔陣ミドルファミリー"},{"$nulls":11},"O1O2",4]
[31,"14:30:00","M2","M2M3",5,{"$f":"VLOOKUP(C34,チーム表!C:D,2,FALSE)","v":"鳳至ファミリーズ"},"×","M3","M3M2",1,{"$f":"VLOOKUP(H34,チーム表!C:D,2,FALSE)","v":"テライFamily’＄"},null,"L1","L1L4",5,{"$f":"VLOOKUP(M34,チーム表!C:D,2,FALSE)","v":"田上闘球親子"},"×","L4","L4L1",3,{"$f":"VLOOKUP(R34,チーム表!C:D,2,FALSE)","v":"三馬パワフルファミリー"},{"$nulls":11},"M3M4",3]
[32,"14:40:00","O1","O1O3",0,{"$f":"VLOOKUP(C35,チーム表!C:D,2,FALSE)","v":"宇出津っ子と優しいお母さん"},"×","O3","O3O1",6,{"$f":"VLOOKUP(H35,チーム表!C:D,2,FALSE)","v":"鞍月ミドルファミリーズ"},null,"P1","P1P3",2,{"$f":"VLOOKUP(M35,チーム表!C:D,2,FALSE)","v":"千坂ゼブラーズG"},"×","P3","P3P1",6,{"$f":"VLOOKUP(R35,チーム表!C:D,2,FALSE)","v":"Ｊ－テライｆａｍｉｌｙ’＄"},{"$nulls":11},"O2O3",2]
[33,"14:50:00","M1","M1M4",1,{"$f":"VLOOKUP(C36,チーム表!C:D,2,FALSE)","v":"NISHIファミリーズ"},"×","M4","M4M1",6,{"$f":"VLOOKUP(H36,チーム表!C:D,2,FALSE)","v":"鞍月ファミリーズ"},null,"L2","L2L4",6,{"$f":"VLOOKUP(M36,チーム表!C:D,2,FALSE)","v":"フェニックスと頑固なお父さん"},"×","L4","L4L2",2,{"$f":"VLOOKUP(R36,チーム表!C:D,2,FALSE)","v":"三馬パワフルファミリー"},{"$nulls":11},"M2M3",5]
[34,"15:00:00","L1",{"$f":"CONCATENATE(C37,H37)","v":"L1L3"},1,{"$f":"VLOOKUP(C37,チーム表!C:D,2,FALSE)","v":"田上闘球親子"},"×","L3",{"$f":"CONCATENATE(H37,C37)","v":"L3L1"},5,{"$f":"VLOOKUP(H37,チーム表!C:D,2,FALSE)","v":"松任の大魔陣ファミリー"},null,"M1",{"$f":"CONCATENATE(M37,R37)","v":"M1M3"},3,{"$f":"VLOOKUP(M37,チーム表!C:D,2,FALSE)","v":"NISHIファミリーズ"},"×","M3",{"$f":"CONCATENATE(R37,M37)","v":"M3M1"},2,{"$f":"VLOOKUP(R37,チーム表!C:D,2,FALSE)","v":"テライFamily’＄"},{"$nulls":11},"O1O3","00:00:00"]
[35,"15:10:00","M2",{"$f":"CONCATENATE(C38,H38)","v":"M2M4"},3,{"$f":"VLOOKUP(C38,チーム表!C:D,2,FALSE)","v":"鳳至ファミリーズ"},"×","M4",{"$f":"CONCATENATE(H38,C38)","v":"M4M2"},6,{"$f":"VLOOKUP(H38,チーム表!C:D,2,FALSE)","v":"鞍月ファミリーズ"},null,{"$f":"組合表!AI38","v":""},{"$f":"CONCATENATE(M38,R38)","v":""},null,{"$f":"VLOOKUP(M38,チーム表!C:D,2,FALSE)","v":{"$error":"#N/A"}},"×",{"$f":"組合表!AJ38","v":""},{"$f":"CONCATENATE(R38,M38)","v":""},null,{"$f":"VLOOKUP(R38,チーム表!C:D,2,FALSE)","v":{"$error":"#N/A"}},{"$nulls":11},"M1M4",1]
[36,"15:20:00",1,null,null,"決勝トーナメント　一般の部　１回戦",{"$nulls":6},1,null,null,"決勝トーナメント　ｼﾞｭﾆｱ･ｷｯｽﾞの部　準決勝",{"$nulls":16},"L1L3",1]
[37,"15:30:00",2,null,null,"決勝トーナメント　一般の部　１回戦",{"$nulls":6},2,null,null,"決勝トーナメント　ｼﾞｭﾆｱ･ｷｯｽﾞの部　決勝",{"$nulls":16},"M2M4",3]
[38,"15:40:00",3,null,null,"決勝トーナメント　一般の部　準決勝",{"$nulls":6},3,null,null,"決勝トーナメント　一般の部　準決勝",{"$nulls":16},{"$f":"#REF!","v":{"$error":"#REF!"}},{"$f":"IF(#REF!=\"\",\"\",#REF!)","v":{"$error":"#REF!"}}]
[39,"15:50:00",4,null,null,"決勝トーナメント　一般の部　決勝",{"$nulls":6},4,null,null,"決勝トーナメント　一般の部　３位決定戦",{"$nulls":16},{"$f":"#REF!","v":{"$error":"#REF!"}},{"$f":"IF(#REF!=\"\",\"\",#REF!)","v":{"$error":"#REF!"}}]
[40,"16:00:00",5,null,null,"決勝トーナメント　親子の部　準決勝",{"$nulls":6},5,null,null,"決勝トーナメント　親子の部　準決勝",{"$nulls":16},{"$f":"#REF!","v":{"$error":"#REF!"}},{"$f":"IF(#REF!=\"\",\"\",#REF!)","v":{"$error":"#REF!"}}]
[41,"16:10:00",6,null,null,"決勝トーナメント　親子の部　決勝",{"$nulls":6},6,{"$nulls":19},{"$f":"#REF!","v":{"$error":"#REF!"}},{"$f":"IF(#REF!=\"\",\"\",#REF!)","v":{"$error":"#REF!"}}]
[42,"16:20:00",7,null,null,"決勝トーナメント　ミドル親子の部　１回戦",{"$nulls":6},7,null,null,"決勝トーナメント　ミドル親子の部　１回戦",{"$nulls":16},{"$f":"#REF!","v":{"$error":"#REF!"}},{"$f":"IF(#REF!=\"\",\"\",#REF!)","v":{"$error":"#REF!"}}]
[43,"16:30:00",8,null,null,"決勝トーナメント　ミドル親子の部　準決勝",{"$nulls":6},8,null,null,"決勝トーナメント　ミドル親子の部　準決勝",{"$nulls":16},{"$f":"I4","v":"A2A1"},{"$f":"IF(J4=\"\",\"\",J4)","v":4}]
[44,"16:40:00",9,{"$nulls":9},9,null,null,"決勝トーナメント　ミドル親子の部　決勝",{"$nulls":16},{"$f":"I5","v":"C2C1"},{"$f":"IF(J5=\"\",\"\",J5)","v":9}]
[45,"16:50:00",10,null,null,"決勝トーナメント　小学生の部　準決勝",{"$nulls":6},10,null,null,"決勝トーナメント　小学生の部　準決勝"]
[46,"17:00:00",11,null,null,"決勝トーナメント　小学生の部　決勝",{"$nulls":6},11,null,null,"決勝トーナメント　小学生の部　３位決定戦",{"$nulls":16},{"$f":"I6","v":"K2K1"},{"$f":"IF(J6=\"\",\"\",J6)","v":7}]
[{"$nulls":32},"F2F1",6]
[{"$nulls":32},"H2H1",1]
[{"$nulls":32},"J2J1",3]
[{"$nulls":32},"A4A3",6]
[{"$nulls":32},"C4C3",""]
[{"$nulls":32},"K4K3",5]
[{"$nulls":32},"F3F2",0]
[{"$nulls":32},"H3H2",6]
[{"$nulls":32},"J3J2",3]
[{"$nulls":32},"A3A2",5]
[{"$nulls":32},"C3C2",""]
[{"$nulls":32},"K3K2",0]
[{"$nulls":32},"F3F1",4]
[{"$nulls":32},"H3H1",5]
[{"$nulls":32},"J3J1",5]
[{"$nulls":32},"A4A1",5]
[{"$nulls":32},"C4C1",8]
[{"$nulls":32},"D3D1",8]
[{"$nulls":32},"B3B1",7]
[{"$nulls":32},"K4K1",2]
[{"$nulls":32},"A4A2",8]
[{"$nulls":32},"C4C2",5]
[{"$nulls":32},"K4K2",2]
[{"$nulls":32},"M2M1",0]
[{"$nulls":32},"O2O1",6]
[{"$nulls":32},"M4M3",4]
[{"$nulls":32},"O3O2",4]
[{"$nulls":32},"M3M2",1]
[{"$nulls":32},"O3O1",6]
[{"$nulls":32},"M4M1",6]
[{"$nulls":32},"L3L1",5]
[{"$nulls":32},"M4M2",6]
[{"$nulls":32},{"$f":"#REF!","v":{"$error":"#REF!"}},{"$f":"IF(#REF!=\"\",\"\",#REF!)","v":{"$error":"#REF!"}}]
[{"$nulls":32},{"$f":"#REF!","v":{"$error":"#REF!"}},{"$f":"IF(#REF!=\"\",\"\",#REF!)","v":{"$error":"#REF!"}}]
[{"$nulls":32},{"$f":"#REF!","v":{"$error":"#REF!"}},{"$f":"IF(#REF!=\"\",\"\",#REF!)","v":{"$error":"#REF!"}}]
[{"$nulls":32},{"$f":"#REF!","v":{"$error":"#REF!"}},{"$f":"IF(#REF!=\"\",\"\",#REF!)","v":{"$error":"#REF!"}}]
[{"$nulls":32},{"$f":"#REF!","v":{"$error":"#REF!"}},{"$f":"IF(#REF!=\"\",\"\",#REF!)","v":{"$error":"#REF!"}}]
[{"$nulls":32},{"$f":"N4","v":"B1B2"},{"$f":"IF(O4=\"\",\"\",O4)","v":8}]
[{"$nulls":32},"D1D2",{"$f":"IF(O5=\"\",\"\",O5)","v":8}]
[{"$nulls":32},"E1E2",4]
[{"$nulls":32},"G1G2",""]
[{"$nulls":32},"I1I2",8]
[{"$nulls":32},"E2E3",4]
[{"$nulls":32},"D3D4",9]
[{"$nulls":32},"B3B4",9]
[{"$nulls":32},"G2G3",4]
[{"$nulls":32},"D2D3",8]
[{"$nulls":32},"B2B3",8]
[{"$nulls":32},"I2I3",4]
[{"$nulls":32},"E1E3",4]
[{"$nulls":32},"G1G3",""]
[{"$nulls":32},"I1I3",3]
[{"$nulls":32},"B1B4",10]
[{"$nulls":32},"D1D4",9]
[{"$nulls":32},"A1A3",9]
[{"$nulls":32},"C1C3",""]
[{"$nulls":32},"B2B4",1]
[{"$nulls":32},"K1K3",3]
[{"$nulls":32},"D2D4",10]
[{"$nulls":32},"L1L2",4]
[{"$nulls":32},"P1P2",5]
[{"$nulls":32},"N1N2",8]
[{"$nulls":32},"L3L4",7]
[{"$nulls":32},"N2N3",2]
[{"$nulls":32},"P2P3",8]
[{"$nulls":32},"L2L3",3]
[{"$nulls":32},"N1N3",3]
[{"$nulls":32},"L1L4",5]
[{"$nulls":32},"P1P3",2]
[{"$nulls":32},"L2L4",6]
[{"$nulls":32},"M1M3",3]
[{"$nulls":32},"",""]
[{"$nulls":32},{"$f":"#REF!","v":{"$error":"#REF!"}},{"$f":"IF(#REF!=\"\",\"\",#REF!)","v":{"$error":"#REF!"}}]
[{"$nulls":32},{"$f":"#REF!","v":{"$error":"#REF!"}},{"$f":"IF(#REF!=\"\",\"\",#REF!)","v":{"$error":"#REF!"}}]
[{"$nulls":32},{"$f":"#REF!","v":{"$error":"#REF!"}},{"$f":"IF(#REF!=\"\",\"\",#REF!)","v":{"$error":"#REF!"}}]
[{"$nulls":32},{"$f":"#REF!","v":{"$error":"#REF!"}},{"$f":"IF(#REF!=\"\",\"\",#REF!)","v":{"$error":"#REF!"}}]
[{"$nulls":32},{"$f":"#REF!","v":{"$error":"#REF!"}},{"$f":"IF(#REF!=\"\",\"\",#REF!)","v":{"$error":"#REF!"}}]
[{"$nulls":32},{"$f":"S4","v":"B2B1"},{"$f":"IF(T4=\"\",\"\",T4)","v":4}]
[{"$nulls":32},"D2D1",{"$f":"IF(T5=\"\",\"\",T5)","v":6}]
[{"$nulls":32},"E2E1",5]
[{"$nulls":32},"G2G1",""]
[{"$nulls":32},"I2I1",0]
[{"$nulls":32},"E3E2",0]
[{"$nulls":32},"D4D3",1]
[{"$nulls":32},"B4B3",9]
[{"$nulls":32},"G3G2",2]
[{"$nulls":32},"D3D2",9]
[{"$nulls":32},"B3B2",8]
[{"$nulls":32},"I3I2",4]
[{"$nulls":32},"E3E1",3]
[{"$nulls":32},"G3G1",""]
[{"$nulls":32},"I3I1",4]
[{"$nulls":32},"B4B1",7]
[{"$nulls":32},"D4D1",5]
[{"$nulls":32},"A3A1",3]
[{"$nulls":32},"C3C1",""]
[{"$nulls":32},"B4B2",11]
[{"$nulls":32},"K3K1",5]
[{"$nulls":32},"D4D2",3]
[{"$nulls":32},"L2L1",3]
[{"$nulls":32},"P2P1",6]
[{"$nulls":32},"N2N1",0]
[{"$nulls":32},"L4L3",0]
[{"$nulls":32},"N3N2",5]
[{"$nulls":32},"P3P2",0]
[{"$nulls":32},"L3L2",3]
[{"$nulls":32},"N3N1",5]
[{"$nulls":32},"L4L1",3]
[{"$nulls":32},"P3P1",6]
[{"$nulls":32},"L4L2",2]
[{"$nulls":32},"M3M1",2]
[{"$nulls":32},"",""]
[{"$nulls":32},{"$f":"#REF!","v":{"$error":"#REF!"}},{"$f":"IF(#REF!=\"\",\"\",#REF!)","v":{"$error":"#REF!"}}]
[{"$nulls":32},{"$f":"#REF!","v":{"$error":"#REF!"}},{"$f":"IF(#REF!=\"\",\"\",#REF!)","v":{"$error":"#REF!"}}]
[{"$nulls":32},{"$f":"#REF!","v":{"$error":"#REF!"}},{"$f":"IF(#REF!=\"\",\"\",#REF!)","v":{"$error":"#REF!"}}]
[{"$nulls":32},{"$f":"#REF!","v":{"$error":"#REF!"}},{"$f":"IF(#REF!=\"\",\"\",#REF!)","v":{"$error":"#REF!"}}]
[{"$nulls":32},{"$f":"#REF!","v":{"$error":"#REF!"}},{"$f":"IF(#REF!=\"\",\"\",#REF!)","v":{"$error":"#REF!"}}]

{"sheet":"リーグ戦表","index":2,"n_rows":176,"n_cols":36,"rows_kept":176,"merged":[[4,0,5,0],[4,1,5,2],[4,3,5,5],[4,6,5,8],[4,9,5,11],[4,12,5,14],[4,15,5,17],[4,18,5,20],[4,21,5,23],[4,24,5,24],[4,25,5,25],[4,26,5,26],[4,27,5,27],[4,28,5,28],[4,29,5,29],[4,30,5,30],[4,31,5,31],[4,32,5,32],[6,0,7,0],[6,1,7,2],[6,3,7,5],[6,24,7,24],[6,25,7,25],[6,26,7,26],[6,27,7,27],[6,28,7,28],[6,29,7,29],[6,30,7,30],[6,31,7,31],[6,32,7,32],[8,0,9,0],[8,1,9,2],[8,6,9,8],[8,24,9,24],[8,25,9,25],[8,26,9,26],[8,27,9,27],[8,28,9,28],[8,29,9,29],[8,30,9,30],[8,31,9,31],[8,32,9,32],[10,0,11,0],[10,1,11,2],[10,9,11,11],[10,24,11,24],[10,25,11,25],[10,26,11,26],[10,27,11,27],[10,28,11,28],[10,29,11,29],[10,30,11,30],[10,31,11,31],[10,32,11,32],[12,0,13,0],[12,1,13,2],[12,12,13,14],[12,24,13,24],[12,25,13,25],[12,26,13,26],[12,27,13,27],[12,28,13,28],[12,29,13,29],[12,30,13,30],[12,31,13,31],[12,32,13,32],[16,0,17,0],[16,1,17,2],[16,3,17,5],[16,6,17,8],[16,9,17,11],[16,12,17,14],[16,15,17,17],[16,18,17,20],[16,21,17,23],[16,24,17,24],[16,25,17,25],[16,26,17,26],[16,27,17,27],[16,28,17,28],[16,29,17,29],[16,30,17,30],[16,31,17,31],[16,32,17,32],[18,0,19,0],[18,1,19,2],[18,3,19,5],[18,24,19,24],[18,25,19,25],[18,26,19,26],[18,27,19,27],[18,28,19,28],[18,29,19,29],[18,30,19,30],[18,31,19,31],[18,32,19,32],[20,0,21,0],[20,1,21,2],[20,6,21,8],[20,24,21,24],[20,25,21,25],[20,26,21,26],[20,27,21,27],[20,28,21,28],[20,29,21,29],[20,30,21,30],[20,31,21,31],[20,32,21,32],[22,0,23,0],[22,1,23,2],[22,9,23,11],[22,24,23,24],[22,25,23,25],[22,26,23,26],[22,27,23,27],[22,28,23,28],[22,29,23,29],[22,30,23,30],[22,31,23,31],[22,32,23,32],[24,0,25,0],[24,1,25,2],[24,12,25,14],[24,24,25,24],[24,25,25,25],[24,26,25,26],[24,27,25,27],[24,28,25,28],[24,29,25,29],[24,30,25,30],[24,31,25,31],[24,32,25,32],[28,0,29,0],[28,1,29,2],[28,3,29,5],[28,6,29,8],[28,9,29,11],[28,12,29,14],[28,15,29,17],[28,18,29,20],[28,21,29,23],[28,24,29,24],[28,25,29,25],[28,26,29,26],[28,27,29,27],[28,28,29,28],[28,29,29,29],[28,30,29,30],[28,31,29,31],[28,32,29,32],[30,0,31,0],[30,1,31,2],[30,3,31,5],[30,24,31,24],[30,25,31,25],[30,26,31,26],[30,27,31,27],[30,28,31,28],[30,29,31,29],[30,30,31,30],[30,31,31,31],[30,32,31,32],[32,0,33,0],[32,1,33,2],[32,6,33,8],[32,24,33,24],[32,25,33,25],[32,26,33,26],[32,27,33,27],[32,28,33,28],[32,29,33,29],[32,30,33,30],[32,31,33,31],[32,32,33,32],[34,0,35,0],[34,1,35,2],[34,9,35,11],[34,24,35,24],[34,25,35,25],[34,26,35,26],[34,27,35,27],[34,28,35,28],[34,29,35,29],[34,30,35,30],[34,31,35,31],[34,32,35,32],[34,35,35,35],[36,0,37,0],[36,1,37,2],[36,12,37,14],[36,24,37,24],[36,25,37,25],[36,26,37,26],[36,27,37,27],[36,28,37,28],[36,29,37,29],[36,30,37,30],[36,31,37,31],[36,32,37,32],[40,0,41,0],[40,1,41,2],[40,3,41,5],[40,6,41,8],[40,9,41,11],[40,12,41,14],[40,15,41,17],[40,18,41,20],[40,21,41,23],[40,24,41,24],[40,25,41,25],[40,26,41,26],[40,27,41,27],[40,28,41,28],[40,29,41,29],[40,30,41,30],[40,31,41,31],[40,32,41,32],[42,0,43,0],[42,1,43,2],[42,3,43,5],[42,24,43,24],[42,25,43,25],[42,26,43,26],[42,27,43,27],[42,28,43,28],[42,29,43,29],[42,30,43,30],[42,31,43,31],[42,32,43,32],[44,0,45,0],[44,1,45,2],[44,6,45,8],[44,24,45,24],[44,25,45,25],[44,26,45,26],[44,27,45,27],[44,28,45,28],[44,29,45,29],[44,30,45,30],[44,31,45,31],[44,32,45,32],[46,0,47,0],[46,1,47,2],[46,9,47,11],[46,24,47,24],[46,25,47,25],[46,26,47,26],[46,27,47,27],[46,28,47,28],[46,29,47,29],[46,30,47,30],[46,31,47,31],[46,32,47,32],[48,0,49,0],[48,1,49,2],[48,12,49,14],[48,24,49,24],[48,25,49,25],[48,26,49,26],[48,27,49,27],[48,28,49,28],[48,29,49,29],[48,30,49,30],[48,31,49,31],[48,32,49,32],[50,1,50,2],[52,0,53,0],[52,1,53,2],[52,3,53,5],[52,6,53,8],[52,9,53,11],[52,12,53,14],[52,15,53,17],[52,18,53,20],[52,21,53,23],[52,24,53,24],[52,25,53,25],[52,26,53,26],[52,27,53,27],[52,28,53,28],[52,29,53,29],[52,30,53,30],[52,31,53,31],[52,32,53,32],[54,0,55,0],[54,1,55,2],[54,3,55,5],[54,24,55,24],[54,25,55,25],[54,26,55,26],[54,27,55,27],[54,28,55,28],[54,29,55,29],[54,30,55,30],[54,31,55,31],[54,32,55,32],[56,0,57,0],[56,1,57,2],[56,6,57,8],[56,24,57,24],[56,25,57,25],[56,26,57,26],[56,27,57,27],[56,28,57,28],[56,29,57,29],[56,30,57,30],[56,31,57,31],[56,32,57,32],[58,0,59,0],[58,1,59,2],[58,9,59,11],[58,24,59,24],[58,25,59,25],[58,26,59,26],[58,27,59,27],[58,28,59,28],[58,29,59,29],[58,30,59,30],[58,31,59,31],[58,32,59,32],[62,0,63,0],[62,1,63,2],[62,3,63,5],[62,6,63,8],[62,9,63,11],[62,12,63,14],[62,15,63,17],[62,18,63,20],[62,21,63,23],[62,24,63,24],[62,25,63,25],[62,26,63,26],[62,27,63,27],[62,28,63,28],[62,29,63,29],[62,30,63,30],[62,31,63,31],[62,32,63,32],[64,0,65,0],[64,1,65,2],[64,3,65,5],[64,24,65,24],[64,25,65,25],[64,26,65,26],[64,27,65,27],[64,28,65,28],[64,29,65,29],[64,30,65,30],[64,31,65,31],[64,32,65,32],[66,0,67,0],[66,1,67,2],[66,6,67,8],[66,24,67,24],[66,25,67,25],[66,26,67,26],[66,27,67,27],[66,28,67,28],[66,29,67,29],[66,30,67,30],[66,31,67,31],[66,32,67,32],[68,0,69,0],[68,1,69,2],[68,9,69,11],[68,24,69,24],[68,25,69,25],[68,26,69,26],[68,27,69,27],[68,28,69,28],[68,29,69,29],[68,30,69,30],[68,31,69,31],[68,32,69,32],[72,0,73,0],[72,1,73,2],[72,3,73,5],[72,6,73,8],[72,9,73,11],[72,12,73,14],[72,15,73,17],[72,18,73,20],[72,21,73,23],[72,24,73,24],[72,25,73,25],[72,26,73,26],[72,27,73,27],[72,28,73,28],[72,29,73,29],[72,30,73,30],[72,31,73,31],[72,32,73,32],[74,0,75,0],[74,1,75,2],[74,3,75,5],[74,24,75,24],[74,25,75,25],[74,26,75,26],[74,27,75,27],[74,28,75,28],[74,29,75,29],[74,30,75,30],[74,31,75,31],[74,32,75,32],[76,0,77,0],[76,1,77,2],[76,6,77,8],[76,24,77,24],[76,25,77,25],[76,26,77,26],[76,27,77,27],[76,28,77,28],[76,29,77,29],[76,30,77,30],[76,31,77,31],[76,32,77,32],[78,0,79,0],[78,1,79,2],[78,9,79,11],[78,24,79,24],[78,25,79,25],[78,26,79,26],[78,27,79,27],[78,28,79,28],[78,29,79,29],[78,30,79,30],[78,31,79,31],[78,32,79,32],[82,0,83,0],[82,1,83,2],[82,3,83,5],[82,6,83,8],[82,9,83,11],[82,12,83,14],[82,15,83,17],[82,18,83,20],[82,21,83,23],[82,24,83,24],[82,25,83,25],[82,26,83,26],[82,27,83,27],[82,28,83,28],[82,29,83,29],[82,30,83,30],[82,31,83,31],[82,32,83,32],[84,0,85,0],[84,1,85,2],[84,3,85,5],[84,24,85,24],[84,25,85,25],[84,26,85,26],[84,27,85,27],[84,28,85,28],[84,29,85,29],[84,30,85,30],[84,31,85,31],[84,32,85,32],[86,0,87,0],[86,1,87,2],[86,6,87,8],[86,24,87,24],[86,25,87,25],[86,26,87,26],[86,27,87,27],[86,28,87,28],[86,29,87,29],[86,30,87,30],[86,31,87,31],[86,32,87,32],[88,0,89,0],[88,1,89,2],[88,9,89,11],[88,24,89,24],[88,25,89,25],[88,26,89,26],[88,27,89,27],[88,28,89,28],[88,29,89,29],[88,30,89,30],[88,31,89,31],[88,32,89,32],[92,0,93,0],[92,1,93,2],[92,3,93,5],[92,6,93,8],[92,9,93,11],[92,12,93,14],[92,15,93,17],[92,18,93,20],[92,21,93,23],[92,24,93,24],[92,25,93,25],[92,26,93,26],[92,27,93,27],[92,28,93,28],[92,29,93,29],[92,30,93,30],[92,31,93,31],[92,32,93,32],[94,0,95,0],[94,1,95,2],[94,3,95,5],[94,24,95,24],[94,25,95,25],[94,26,95,26],[94,27,95,27],[94,28,95,28],[94,29,95,29],[94,30,95,30],[94,31,95,31],[94,32,95,32],[96,0,97,0],[96,1,97,2],[96,6,97,8],[96,24,97,24],[96,25,97,25],[96,26,97,26],[96,27,97,27],[96,28,97,28],[96,29,97,29],[96,30,97,30],[96,31,97,31],[96,32,97,32],[98,0,99,0],[98,1,99,2],[98,9,99,11],[98,24,99,24],[98,25,99,25],[98,26,99,26],[98,27,99,27],[98,28,99,28],[98,29,99,29],[98,30,99,30],[98,31,99,31],[98,32,99,32],[102,0,103,0],[102,1,103,2],[102,3,103,5],[102,6,103,8],[102,9,103,11],[102,12,103,14],[102,15,103,17],[102,18,103,20],[102,21,103,23],[102,24,103,24],[102,25,103,25],[102,26,103,26],[102,27,103,27],[102,28,103,28],[102,29,103,29],[102,30,103,30],[102,31,103,31],[102,32,103,32],[104,0,105,0],[104,1,105,2],[104,3,105,5],[104,24,105,24],[104,25,105,25],[104,26,105,26],[104,27,105,27],[104,28,105,28],[104,29,105,29],[104,30,105,30],[104,31,105,31],[104,32,105,32],[106,0,107,0],[106,1,107,2],[106,6,107,8],[106,24,107,24],[106,25,107,25],[106,26,107,26],[106,27,107,27],[106,28,107,28],[106,29,107,29],[106,30,107,30],[106,31,107,31],[106,32,107,32],[108,0,109,0],[108,1,109,2],[108,9,109,11],[108,24,109,24],[108,25,109,25],[108,26,109,26],[108,27,109,27],[108,28,109,28],[108,29,109,29],[108,30,109,30],[108,31,109,31],[108,32,109,32],[112,0,113,0],[112,1,113,2],[112,3,113,5],[112,6,113,8],[112,9,113,11],[112,12,113,14],[112,15,113,17],[112,18,113,20],[112,21,113,23],[112,24,113,24],[112,25,113,25],[112,26,113,26],[112,27,113,27],[112,28,113,28],[112,29,113,29],[112,30,113,30],[112,31,113,31],[112,32,113,32],[114,0,115,0],[114,1,115,2],[114,3,115,5],[114,24,115,24],[114,25,115,25],[114,26,115,26],[114,27,115,27],[114,28,115,28],[114,29,115,29],[114,30,115,30],[114,31,115,31],[114,32,115,32],[116,0,117,0],[116,1,117,2],[116,6,117,8],[116,24,117,24],[116,25,117,25],[116,26,117,26],[116,27,117,27],[116,28,117,28],[116,29,117,29],[116,30,117,30],[116,31,117,31],[116,32,117,32],[118,0,119,0],[118,1,119,2],[118,9,119,11],[118,24,119,24],[118,25,119,25],[118,26,119,26],[118,27,119,27],[118,28,119,28],[118,29,119,29],[118,30,119,30],[118,31,119,31],[118,32,119,32],[120,0,121,0],[120,1,121,2],[120,12,121,14],[120,24,121,24],[120,25,121,25],[120,26,121,26],[120,27,121,27],[120,28,121,28],[120,29,121,29],[120,30,121,30],[120,31,121,31],[120,32,121,32],[124,0,125,0],[124,1,125,2],[124,3,125,5],[124,6,125,8],[124,9,125,11],[124,12,125,14],[124,15,125,17],[124,18,125,20],[124,21,125,23],[124,24,125,24],[124,25,125,25],[124,26,125,26],[124,27,125,27],[124,28,125,28],[124,29,125,29],[124,30,125,30],[124,31,125,31],[124,32,125,32],[126,0,127,0],[126,1,127,2],[126,3,127,5],[126,24,127,24],[126,25,127,25],[126,26,127,26],[126,27,127,27],[126,28,127,28],[126,29,127,29],[126,30,127,30],[126,31,127,31],[126,32,127,32],[128,0,129,0],[128,1,129,2],[128,6,129,8],[128,24,129,24],[128,25,129,25],[128,26,129,26],[128,27,129,27],[128,28,129,28],[128,29,129,29],[128,30,129,30],[128,31,129,31],[128,32,129,32],[130,0,131,0],[130,1,131,2],[130,9,131,11],[130,24,131,24],[130,25,131,25],[130,26,131,26],[130,27,131,27],[130,28,131,28],[130,29,131,29],[130,30,131,30],[130,31,131,31],[130,32,131,32],[132,0,133,0],[132,1,133,2],[132,12,133,14],[132,24,133,24],[132,25,133,25],[132,26,133,26],[132,27,133,27],[132,28,133,28],[132,29,133,29],[132,30,133,30],[132,31,133,31],[132,32,133,32],[136,0,137,0],[136,1,137,2],[136,3,137,5],[136,6,137,8],[136,9,137,11],[136,12,137,14],[136,15,137,17],[136,18,137,20],[136,21,137,23],[136,24,137,24],[136,25,137,25],[136,26,137,26],[136,27,137,27],[136,28,137,28],[136,29,137,29],[136,30,137,30],[136,31,137,31],[136,32,137,32],[138,0,139,0],[138,1,139,2],[138,3,139,5],[138,24,139,24],[138,25,139,25],[138,26,139,26],[138,27,139,27],[138,28,139,28],[138,29,139,29],[138,30,139,30],[138,31,139,31],[138,32,139,32],[140,0,141,0],[140,1,141,2],[140,6,141,8],[140,24,141,24],[140,25,141,25],[140,26,141,26],[140,27,141,27],[140,28,141,28],[140,29,141,29],[140,30,141,30],[140,31,141,31],[140,32,141,32],[142,0,143,0],[142,1,143,2],[142,9,143,11],[142,24,143,24],[142,25,143,25],[142,26,143,26],[142,27,143,27],[142,28,143,28],[142,29,143,29],[142,30,143,30],[142,31,143,31],[142,32,143,32],[144,0,145,0],[144,1,145,2],[144,12,145,14],[144,24,145,24],[144,25,145,25],[144,26,145,26],[144,27,145,27],[144,28,145,28],[144,29,145,29],[144,30,145,30],[144,31,145,31],[144,32,145,32],[146,1,146,2],[148,0,149,0],[148,1,149,2],[148,3,149,5],[148,6,149,8],[148,9,149,11],[148,12,149,14],[148,15,149,17],[148,18,149,20],[148,21,149,23],[148,24,149,24],[148,25,149,25],[148,26,149,26],[148,27,149,27],[148,28,149,28],[148,29,149,29],[148,30,149,30],[148,31,149,31],[148,32,149,32],[150,0,151,0],[150,1,151,2],[150,3,151,5],[150,24,151,24],[150,25,151,25],[150,26,151,26],[150,27,151,27],[150,28,151,28],[150,29,151,29],[150,30,151,30],[150,31,151,31],[150,32,151,32],[152,0,153,0],[152,1,153,2],[152,6,153,8],[152,24,153,24],[152,25,153,25],[152,26,153,26],[152,27,153,27],[152,28,153,28],[152,29,153,29],[152,30,153,30],[152,31,153,31],[152,32,153,32],[154,0,155,0],[154,1,155,2],[154,9,155,11],[154,24,155,24],[154,25,155,25],[154,26,155,26],[154,27,155,27],[154,28,155,28],[154,29,155,29],[154,30,155,30],[154,31,155,31],[154,32,155,32],[158,0,159,0],[158,1,159,2],[158,3,159,5],[158,6,159,8],[158,9,159,11],[158,12,159,14],[158,15,159,17],[158,18,159,20],[158,21,159,23],[158,24,159,24],[158,25,159,25],[158,26,159,26],[158,27,159,27],[158,28,159,28],[158,29,159,29],[158,30,159,30],[158,31,159,31],[158,32,159,32],[160,0,161,0],[160,1,161,2],[160,3,161,5],[160,24,161,24],[160,25,161,25],[160,26,161,26],[160,27,161,27],[160,28,161,28],[160,29,161,29],[160,30,161,30],[160,31,161,31],[160,32,161,32],[162,0,163,0],[162,1,163,2],[162,6,163,8],[162,24,163,24],[162,25,163,25],[162,26,163,26],[162,27,163,27],[162,28,163,28],[162,29,163,29],[162,30,163,30],[162,31,163,31],[162,32,163,32],[164,0,165,0],[164,1,165,2],[164,9,165,11],[164,24,165,24],[164,25,165,25],[164,26,165,26],[164,27,165,27],[164,28,165,28],[164,29,165,29],[164,30,165,30],[164,31,165,31],[164,32,165,32],[168,0,169,0],[168,1,169,2],[168,3,169,5],[168,6,169,8],[168,9,169,11],[168,12,169,14],[168,15,169,17],[168,18,169,20],[168,21,169,23],[168,24,169,24],[168,25,169,25],[168,26,169,26],[168,27,169,27],[168,28,169,28],[168,29,169,29],[168,30,169,30],[168,31,169,31],[168,32,169,32],[170,0,171,0],[170,1,171,2],[170,3,171,5],[170,24,171,24],[170,25,171,25],[170,26,171,26],[170,27,171,27],[170,28,171,28],[170,29,171,29],[170,30,171,30],[170,31,171,31],[170,32,171,32],[172,0,173,0],[172,1,173,2],[172,6,173,8],[172,24,173,24],[172,25,173,25],[172,26,173,26],[172,27,173,27],[172,28,173,28],[172,29,173,29],[172,30,173,30],[172,31,173,31],[172,32,173,32],[174,0,175,0],[174,1,175,2],[174,9,175,11],[174,24,175,24],[174,25,175,25],[174,26,175,26],[174,27,175,27],[174,28,175,28],[174,29,175,29],[174,30,175,30],[174,31,175,31],[174,32,175,32]]}
[null,{"$f":"チーム表!$B$1","v":"第２７回　いしかわスポーツ・レクリエーション交流大会\n「第１１回ふれあいドッジボール大会」"}]
[null,null,"リーグ戦表"]
[null,"小学生の部"]
[{"$nulls":4},{"$f":"CONCATENATE(A5,\"1\")","v":"A1"},null,null,{"$f":"CONCATENATE(A5,\"2\")","v":"A2"},null,null,{"$f":"CONCATENATE(A5,\"3\")","v":"A3"},null,null,{"$f":"CONCATENATE(A5,\"4\")","v":"A4"}]
["A","チーム名",null,{"$f":"B7","v":"下関福光サンダージュニア"},null,null,{"$f":"B9","v":"NISHIファイヤースターズ"},null,null,{"$f":"B11","v":"小木クラブ"},null,null,{"$f":"B13","v":"松任の大魔陣"},{"$nulls":11},"勝","負","分","点","内野","順位決定点","相手内野","順位","kaku"]
[]
[{"$f":"CONCATENATE(A5,1)","v":"A1"},{"$f":"VLOOKUP(A7,チーム表!C:D,2,FALSE)","v":"下関福光サンダージュニア"},{"$nulls":4},{"$f":"CONCATENATE($A7,H4)","v":"A1A2"},{"$f":"IF(G8=\"\",\"\",IF(G8=I8,\"△\",IF(G8>I8,\"〇\",\"×\")))","v":"〇"},{"$f":"CONCATENATE(H4,$A7)","v":"A2A1"},{"$f":"CONCATENATE($A7,K4)","v":"A1A3"},{"$f":"IF(J8=\"\",\"\",IF(J8=L8,\"△\",IF(J8>L8,\"〇\",\"×\")))","v":"〇"},{"$f":"CONCATENATE(K4,$A7)","v":"A3A1"},{"$f":"CONCATENATE($A7,N4)","v":"A1A4"},{"$f":"IF(M8=\"\",\"\",IF(M8=O8,\"△\",IF(M8>O8,\"〇\",\"×\")))","v":"〇"},{"$f":"CONCATENATE(N4,$A7)","v":"A4A1"},{"$nulls":9},{"$f":"COUNTIF($E7:$N7,\"〇\")","v":3},{"$f":"COUNTIF($E7:$N7,\"×\")","v":0},{"$f":"COUNTIF($E7:$N7,\"△\")","v":0},{"$f":"Y7*2+AA7","v":6},{"$f":"IF(G8=\"\",\"\",D8+G8+M8+J8)","v":30},{"$f":"IF(AC7=\"\",\"\",AB7*100+AC7)","v":630},{"$f":"IF(AC7=\"\",\"\",F8+I8+L8+O8)","v":12},{"$f":"IF(AD7=\"\",\"\",RANK(AD7,AD7:AD14,0))","v":1},null,{"$f":"CONCATENATE(A5,AF7)","v":"A1"},{"$f":"B7","v":"下関福光サンダージュニア"}]
[{"$nulls":6},{"$f":"VLOOKUP(G7,対戦表!$AG:$AH,2,0)","v":11},"-",{"$f":"VLOOKUP(I7,対戦表!$AG:$AH,2,0)","v":4},{"$f":"VLOOKUP(J7,対戦表!$AG:$AH,2,0)","v":9},"-",{"$f":"VLOOKUP(L7,対戦表!$AG:$AH,2,0)","v":3},{"$f":"VLOOKUP(M7,対戦表!$AG:$AH,2,0)","v":10},"-",{"$f":"VLOOKUP(O7,対戦表!$AG:$AH,2,0)","v":5}]
[{"$f":"CONCATENATE(A5,2)","v":"A2"},{"$f":"VLOOKUP(A9,チーム表!C:D,2,FALSE)","v":"NISHIファイヤースターズ"},null,null,{"$f":"IF(D10=\"\",\"\",IF(D10=F10,\"△\",IF(D10>F10,\"〇\",\"×\")))","v":"×"},{"$nulls":4},{"$f":"CONCATENATE($A9,K4)","v":"A2A3"},{"$f":"IF(J10=\"\",\"\",IF(J10=L10,\"△\",IF(J10>L10,\"〇\",\"×\")))","v":"〇"},{"$f":"CONCATENATE(K4,$A9)","v":"A3A2"},{"$f":"CONCATENATE($A9,N4)","v":"A2A4"},{"$f":"IF(M10=\"\",\"\",IF(M10=O10,\"△\",IF(M10>O10,\"〇\",\"×\")))","v":"〇"},{"$f":"CONCATENATE(N4,$A9)","v":"A4A2"},{"$nulls":9},{"$f":"COUNTIF($E9:$N9,\"〇\")","v":2},{"$f":"COUNTIF($E9:$N9,\"×\")","v":1},{"$f":"COUNTIF($E9:$N9,\"△\")","v":0},{"$f":"Y9*2+AA9","v":4},{"$f":"IF(D10=\"\",\"\",D10+G10+M10+J10)","v":19},{"$f":"IF(AC9=\"\",\"\",AB9*100+AC9)","v":419},{"$f":"IF(AC9=\"\",\"\",F10+I10+L10+O10)","v":24},{"$f":"IF(AD9=\"\",\"\",RANK(AD9,AD7:AD14,0))","v":2},null,{"$f":"CONCATENATE(A5,AF9)","v":"A2"},{"$f":"B9","v":"NISHIファイヤースターズ"}]
[{"$nulls":3},{"$f":"IF(I8=\"\",\"\",I8)","v":4},"-",{"$f":"IF(G8=\"\",\"\",G8)","v":11},{"$nulls":3},{"$f":"VLOOKUP(J9,対戦表!$AG:$AH,2,0)","v":6},"-",{"$f":"VLOOKUP(L9,対戦表!$AG:$AH,2,0)","v":5},{"$f":"VLOOKUP(M9,対戦表!$AG:$AH,2,0)","v":9},"-",{"$f":"VLOOKUP(O9,対戦表!$AG:$AH,2,0)","v":8}]
[{"$f":"CONCATENATE(A5,3)","v":"A3"},{"$f":"VLOOKUP(A11,チーム表!C:D,2,FALSE)","v":"小木クラブ"},null,null,{"$f":"IF(D12=\"\",\"\",IF(D12=F12,\"△\",IF(D12>F12,\"〇\",\"×\")))","v":"×"},null,null,{"$f":"IF(G12=\"\",\"\",IF(G12=I12,\"△\",IF(G12>I12,\"〇\",\"×\")))","v":"×"},{"$nulls":4},{"$f":"CONCATENATE($A11,N4)","v":"A3A4"},{"$f":"IF(M12=\"\",\"\",IF(M12=O12,\"△\",IF(M12>O12,\"〇\",\"×\")))","v":"〇"},{"$f":"CONCATENATE(N4,$A11)","v":"A4A3"},{"$nulls":9},{"$f":"COUNTIF($E11:$N11,\"〇\")","v":1},{"$f":"COUNTIF($E11:$N11,\"×\")","v":2},{"$f":"COUNTIF($E11:$N11,\"△\")","v":0},{"$f":"Y11*2+AA11","v":2},{"$f":"IF(G12=\"\",\"\",D12+G12+M12+J12)","v":16},{"$f":"IF(AC11=\"\",\"\",AB11*100+AC11)","v":216},{"$f":"IF(AC11=\"\",\"\",F12+I12+L12+O12)","v":21},{"$f":"IF(AD11=\"\",\"\",RANK(AD11,AD7:AD14,0))","v":3},null,{"$f":"CONCATENATE(A5,AF11)","v":"A3"},{"$f":"B11","v":"小木クラブ"}]
[{"$nulls":3},{"$f":"IF(L8=\"\",\"\",L8)","v":3},"-",{"$f":"IF(J8=\"\",\"\",J8)","v":9},{"$f":"IF(L10=\"\",\"\",L10)","v":5},"-",{"$f":"IF(J10=\"\",\"\",J10)","v":6},{"$nulls":3},{"$f":"VLOOKUP(M11,対戦表!$AG:$AH,2,0)","v":8},"-",{"$f":"VLOOKUP(O11,対戦表!$AG:$AH,2,0)","v":6}]
[{"$f":"CONCATENATE(A5,4)","v":"A4"},{"$f":"VLOOKUP(A13,チーム表!C:D,2,FALSE)","v":"松任の大魔陣"},null,null,{"$f":"IF(D14=\"\",\"\",IF(D14=F14,\"△\",IF(D14>F14,\"〇\",\"×\")))","v":"×"},null,null,{"$f":"IF(G14=\"\",\"\",IF(G14=I14,\"△\",IF(G14>I14,\"〇\",\"×\")))","v":"×"},null,null,{"$f":"IF(J14=\"\",\"\",IF(J14=L14,\"△\",IF(J14>L14,\"〇\",\"×\")))","v":"×"},{"$nulls":13},{"$f":"COUNTIF($E13:$N13,\"〇\")","v":0},{"$f":"COUNTIF($E13:$N13,\"×\")","v":3},{"$f":"COUNTIF($E13:$N13,\"△\")","v":0},{"$f":"Y13*2+AA13","v":0},{"$f":"IF(G14=\"\",\"\",D14+G14+M14+J14)","v":19},{"$f":"IF(AC13=\"\",\"\",AB13*100+AC13)","v":19},{"$f":"IF(AC13=\"\",\"\",F14+I14+L14+O14)","v":27},{"$f":"IF(AD13=\"\",\"\",RANK(AD13,AD7:AD14,0))","v":4},null,{"$f":"CONCATENATE(A5,AF13)","v":"A4"},{"$f":"B13","v":"松任の大魔陣"}]
[{"$nulls":3},{"$f":"IF(O8=\"\",\"\",O8)","v":5},"-",{"$f":"IF(M8=\"\",\"\",M8)","v":10},{"$f":"IF(O10=\"\",\"\",O10)","v":8},"-",{"$f":"IF(M10=\"\",\"\",M10)","v":9},{"$f":"IF(O12=\"\",\"\",O12)","v":6},"-",{"$f":"IF(M12=\"\",\"\",M12)","v":8}]
[]
[{"$nulls":4},{"$f":"CONCATENATE(A17,\"1\")","v":"B1"},null,null,{"$f":"CONCATENATE(A17,\"2\")","v":"B2"},null,null,{"$f":"CONCATENATE(A17,\"3\")","v":"B3"},null,null,{"$f":"CONCATENATE(A17,\"4\")","v":"B4"}]
["B","チーム名",null,{"$f":"B19","v":"杉っ子ドッジファイターズ"},null,null,{"$f":"B21","v":"鵜川ミラクルフェニックス"},null,null,{"$f":"B23","v":"向本折クラブA"},null,null,{"$f":"B25","v":"鞍月アタッカーズ"},{"$nulls":11},"勝","負","分","点","内野","順位決定点","相手内野","順位","kaku"]
[]
[{"$f":"CONCATENATE(A17,1)","v":"B1"},{"$f":"VLOOKUP(A19,チーム表!C:D,2,FALSE)","v":"杉っ子ドッジファイターズ"},{"$nulls":4},{"$f":"CONCATENATE($A19,H16)","v":"B1B2"},{"$f":"IF(G20=\"\",\"\",IF(G20=I20,\"△\",IF(G20>I20,\"〇\",\"×\")))","v":"〇"},{"$f":"CONCATENATE(H16,$A19)","v":"B2B1"},{"$f":"CONCATENATE($A19,K16)","v":"B1B3"},{"$f":"IF(J20=\"\",\"\",IF(J20=L20,\"△\",IF(J20>L20,\"〇\",\"×\")))","v":"〇"},{"$f":"CONCATENATE(K16,$A19)","v":"B3B1"},{"$f":"CONCATENATE($A19,N16)","v":"B1B4"},{"$f":"IF(M20=\"\",\"\",IF(M20=O20,\"△\",IF(M20>O20,\"〇\",\"×\")))","v":"〇"},{"$f":"CONCATENATE(N16,$A19)","v":"B4B1"},{"$nulls":9},{"$f":"COUNTIF($E19:$N19,\"〇\")","v":3},{"$f":"COUNTIF($E19:$N19,\"×\")","v":0},{"$f":"COUNTIF($E19:$N19,\"△\")","v":0},{"$f":"Y19*2+AA19","v":6},{"$f":"IF(G20=\"\",\"\",D20+G20+M20+J20)","v":27},{"$f":"IF(AC19=\"\",\"\",AB19*100+AC19)","v":627},{"$f":"IF(AC19=\"\",\"\",F20+I20+L20+O20)","v":18},{"$f":"IF(AD19=\"\",\"\",RANK(AD19,AD19:AD26,0))","v":1},null,{"$f":"CONCATENATE(A17,AF19)","v":"B1"},{"$f":"B19","v":"杉っ子ドッジファイターズ"}]
[{"$nulls":6},{"$f":"VLOOKUP(G19,対戦表!$AG:$AH,2,0)","v":8},"-",{"$f":"VLOOKUP(I19,対戦表!$AG:$AH,2,0)","v":4},{"$f":"VLOOKUP(J19,対戦表!$AG:$AH,2,0)","v":9},"-",{"$f":"VLOOKUP(L19,対戦表!$AG:$AH,2,0)","v":7},{"$f":"VLOOKUP(M19,対戦表!$AG:$AH,2,0)","v":10},"-",{"$f":"VLOOKUP(O19,対戦表!$AG:$AH,2,0)","v":7}]
[{"$f":"CONCATENATE(A17,2)","v":"B2"},{"$f":"VLOOKUP(A21,チーム表!C:D,2,FALSE)","v":"鵜川ミラクルフェニックス"},null,null,{"$f":"IF(D22=\"\",\"\",IF(D22=F22,\"△\",IF(D22>F22,\"〇\",\"×\")))","v":"×"},{"$nulls":4},{"$f":"CONCATENATE($A21,K16)","v":"B2B3"},{"$f":"IF(J22=\"\",\"\",IF(J22=L22,\"△\",IF(J22>L22,\"〇\",\"×\")))","v":"△"},{"$f":"CONCATENATE(K16,$A21)","v":"B3B2"},{"$f":"CONCATENATE($A21,N16)","v":"B2B4"},{"$f":"IF(M22=\"\",\"\",IF(M22=O22,\"△\",IF(M22>O22,\"〇\",\"×\")))","v":"×"},{"$f":"CONCATENATE(N16,$A21)","v":"B4B2"},{"$nulls":9},{"$f":"COUNTIF($E21:$N21,\"〇\")","v":0},{"$f":"COUNTIF($E21:$N21,\"×\")","v":2},{"$f":"COUNTIF($E21:$N21,\"△\")","v":1},{"$f":"Y21*2+AA21","v":1},{"$f":"IF(D22=\"\",\"\",D22+G22+M22+J22)","v":13},{"$f":"IF(AC21=\"\",\"\",AB21*100+AC21)","v":113},{"$f":"IF(AC21=\"\",\"\",F22+I22+L22+O22)","v":27},{"$f":"IF(AD21=\"\",\"\",RANK(AD21,AD19:AD26,0))","v":4},null,{"$f":"CONCATENATE(A17,AF21)","v":"B4"},{"$f":"B21","v":"鵜川ミラクルフェニックス"}]
[{"$nulls":3},{"$f":"IF(I20=\"\",\"\",I20)","v":4},"-",{"$f":"IF(G20=\"\",\"\",G20)","v":8},{"$nulls":3},{"$f":"VLOOKUP(J21,対戦表!$AG:$AH,2,0)","v":8},"-",{"$f":"VLOOKUP(L21,対戦表!$AG:$AH,2,0)","v":8},{"$f":"VLOOKUP(M21,対戦表!$AG:$AH,2,0)","v":1},"-",{"$f":"VLOOKUP(O21,対戦表!$AG:$AH,2,0)","v":11}]
[{"$f":"CONCATENATE(A17,3)","v":"B3"},{"$f":"VLOOKUP(A23,チーム表!C:D,2,FALSE)","v":"向本折クラブA"},null,null,{"$f":"IF(D24=\"\",\"\",IF(D24=F24,\"△\",IF(D24>F24,\"〇\",\"×\")))","v":"×"},null,null,{"$f":"IF(G24=\"\",\"\",IF(G24=I24,\"△\",IF(G24>I24,\"〇\",\"×\")))","v":"△"},{"$nulls":4},{"$f":"CONCATENATE($A23,N16)","v":"B3B4"},{"$f":"IF(M24=\"\",\"\",IF(M24=O24,\"△\",IF(M24>O24,\"〇\",\"×\")))","v":"△"},{"$f":"CONCATENATE(N16,$A23)","v":"B4B3"},{"$nulls":9},{"$f":"COUNTIF($E23:$N23,\"〇\")","v":0},{"$f":"COUNTIF($E23:$N23,\"×\")","v":1},{"$f":"COUNTIF($E23:$N23,\"△\")","v":2},{"$f":"Y23*2+AA23","v":2},{"$f":"IF(G24=\"\",\"\",D24+G24+M24+J24)","v":24},{"$f":"IF(AC23=\"\",\"\",AB23*100+AC23)","v":224},{"$f":"IF(AC23=\"\",\"\",F24+I24+L24+O24)","v":26},{"$f":"IF(AD23=\"\",\"\",RANK(AD23,AD19:AD26,0))","v":3},null,{"$f":"CONCATENATE(A17,AF23)","v":"B3"},{"$f":"B23","v":"向本折クラブA"}]
[{"$nulls":3},{"$f":"IF(L20=\"\",\"\",L20)","v":7},"-",{"$f":"IF(J20=\"\",\"\",J20)","v":9},{"$f":"IF(L22=\"\",\"\",L22)","v":8},"-",{"$f":"IF(J22=\"\",\"\",J22)","v":8},{"$nulls":3},{"$f":"VLOOKUP(M23,対戦表!$AG:$AH,2,0)","v":9},"-",{"$f":"VLOOKUP(O23,対戦表!$AG:$AH,2,0)","v":9}]
[{"$f":"CONCATENATE(A17,4)","v":"B4"},{"$f":"VLOOKUP(A25,チーム表!C:D,2,FALSE)","v":"鞍月アタッカーズ"},null,null,{"$f":"IF(D26=\"\",\"\",IF(D26=F26,\"△\",IF(D26>F26,\"〇\",\"×\")))","v":"×"},null,null,{"$f":"IF(G26=\"\",\"\",IF(G26=I26,\"△\",IF(G26>I26,\"〇\",\"×\")))","v":"〇"},null,null,{"$f":"IF(J26=\"\",\"\",IF(J26=L26,\"△\",IF(J26>L26,\"〇\",\"×\")))","v":"△"},{"$nulls":13},{"$f":"COUNTIF($E25:$N25,\"〇\")","v":1},{"$f":"COUNTIF($E25:$N25,\"×\")","v":1},{"$f":"COUNTIF($E25:$N25,\"△\")","v":1},{"$f":"Y25*2+AA25","v":3},{"$f":"IF(G26=\"\",\"\",D26+G26+M26+J26)","v":27},{"$f":"IF(AC25=\"\",\"\",AB25*100+AC25)","v":327},{"$f":"IF(AC25=\"\",\"\",F26+I26+L26+O26)","v":20},{"$f":"IF(AD25=\"\",\"\",RANK(AD25,AD19:AD26,0))","v":2},null,{"$f":"CONCATENATE(A17,AF25)","v":"B2"},{"$f":"B25","v":"鞍月アタッカーズ"}]
[{"$nulls":3},{"$f":"IF(O20=\"\",\"\",O20)","v":7},"-",{"$f":"IF(M20=\"\",\"\",M20)","v":10},{"$f":"IF(O22=\"\",\"\",O22)","v":11},"-",{"$f":"IF(M22=\"\",\"\",M22)","v":1},{"$f":"IF(O24=\"\",\"\",O24)","v":9},"-",{"$f":"IF(M24=\"\",\"\",M24)","v":9}]
[]
[{"$nulls":4},{"$f":"CONCATENATE(A29,\"1\")","v":"C1"},null,null,{"$f":"CONCATENATE(A29,\"2\")","v":"C2"},null,null,{"$f":"CONCATENATE(A29,\"3\")","v":"C3"},null,null,{"$f":"CONCATENATE(A29,\"4\")","v":"C4"}]
["C","チーム名",null,{"$f":"B31","v":"田上闘球DREAMS"},null,null,{"$f":"B33","v":"千坂ドッジファイヤーズ"},null,null,{"$f":"B35","v":"あさひスーパーファイターズ"},null,null,{"$f":"B37","v":"寺井クラブ"},{"$nulls":11},"勝","負","分","点","内野","順位決定点","相手内野","順位","kaku"]
[]
[{"$f":"CONCATENATE(A29,1)","v":"C1"},{"$f":"VLOOKUP(A31,チーム表!C:D,2,FALSE)","v":"田上闘球DREAMS"},{"$nulls":4},{"$f":"CONCATENATE($A31,H28)","v":"C1C2"},{"$f":"IF(G32=\"\",\"\",IF(G32=I32,\"△\",IF(G32>I32,\"〇\",\"×\")))","v":"×"},{"$f":"CONCATENATE(H28,$A31)","v":"C2C1"},{"$f":"CONCATENATE($A31,K28)","v":"C1C3"},{"$f":"IF(J32=\"\",\"\",IF(J32=L32,\"△\",IF(J32>L32,\"〇\",\"×\")))","v":""},{"$f":"CONCATENATE(K28,$A31)","v":"C3C1"},{"$f":"CONCATENATE($A31,N28)","v":"C1C4"},{"$f":"IF(M32=\"\",\"\",IF(M32=O32,\"△\",IF(M32>O32,\"〇\",\"×\")))","v":"△"},{"$f":"CONCATENATE(N28,$A31)","v":"C4C1"},{"$nulls":9},{"$f":"COUNTIF($E31:$N31,\"〇\")","v":0},{"$f":"COUNTIF($E31:$N31,\"×\")","v":1},{"$f":"COUNTIF($E31:$N31,\"△\")","v":1},{"$f":"Y31*2+AA31","v":1},{"$f":"IF(G32=\"\",\"\",D32+G32+M32)","v":11},{"$f":"IF(AC31=\"\",\"\",AB31*100+AC31)","v":111},{"$f":"IF(AC31=\"\",\"\",F32+I32+O32)","v":17},{"$f":"IF(AD31=\"\",\"\",RANK(AD31,AD31:AD38,0))","v":3},null,{"$f":"CONCATENATE(A29,AF31)","v":"C3"},{"$f":"B31","v":"田上闘球DREAMS"}]
[{"$nulls":6},{"$f":"VLOOKUP(G31,対戦表!$AG:$AH,2,0)","v":3},"-",{"$f":"VLOOKUP(I31,対戦表!$AG:$AH,2,0)","v":9},{"$f":"VLOOKUP(J31,対戦表!$AG:$AH,2,0)","v":""},"-",{"$f":"VLOOKUP(L31,対戦表!$AG:$AH,2,0)","v":""},{"$f":"VLOOKUP(M31,対戦表!$AG:$AH,2,0)","v":8},"-",{"$f":"VLOOKUP(O31,対戦表!$AG:$AH,2,0)","v":8}]
[{"$f":"CONCATENATE(A29,2)","v":"C2"},{"$f":"VLOOKUP(A33,チーム表!C:D,2,FALSE)","v":"千坂ドッジファイヤーズ"},null,null,{"$f":"IF(D34=\"\",\"\",IF(D34=F34,\"△\",IF(D34>F34,\"〇\",\"×\")))","v":"〇"},{"$nulls":4},{"$f":"CONCATENATE($A33,K28)","v":"C2C3"},{"$f":"IF(J34=\"\",\"\",IF(J34=L34,\"△\",IF(J34>L34,\"〇\",\"×\")))","v":""},{"$f":"CONCATENATE(K28,$A33)","v":"C3C2"},{"$f":"CONCATENATE($A33,N28)","v":"C2C4"},{"$f":"IF(M34=\"\",\"\",IF(M34=O34,\"△\",IF(M34>O34,\"〇\",\"×\")))","v":"〇"},{"$f":"CONCATENATE(N28,$A33)","v":"C4C2"},{"$nulls":9},{"$f":"COUNTIF($E33:$N33,\"〇\")","v":2},{"$f":"COUNTIF($E33:$N33,\"×\")","v":0},{"$f":"COUNTIF($E33:$N33,\"△\")","v":0},{"$f":"Y33*2+AA33","v":4},{"$f":"IF(D34=\"\",\"\",D34+G34+M34)","v":19},{"$f":"IF(AC33=\"\",\"\",AB33*100+AC33)","v":419},{"$f":"IF(AC33=\"\",\"\",F34+I34+O34)","v":8},{"$f":"IF(AD33=\"\",\"\",RANK(AD33,AD31:AD38,0))","v":1},null,{"$f":"CONCATENATE(A29,AF33)","v":"C1"},{"$f":"B33","v":"千坂ドッジファイヤーズ"}]
[{"$nulls":3},{"$f":"IF(I32=\"\",\"\",I32)","v":9},"-",{"$f":"IF(G32=\"\",\"\",G32)","v":3},{"$nulls":3},{"$f":"VLOOKUP(J33,対戦表!$AG:$AH,2,0)","v":""},"-",{"$f":"VLOOKUP(L33,対戦表!$AG:$AH,2,0)","v":""},{"$f":"VLOOKUP(M33,対戦表!$AG:$AH,2,0)","v":10},"-",{"$f":"VLOOKUP(O33,対戦表!$AG:$AH,2,0)","v":5}]
[{"$f":"CONCATENATE(A29,3)","v":"C3"},{"$f":"VLOOKUP(A35,チーム表!C:D,2,FALSE)","v":"あさひスーパーファイターズ"},null,null,{"$f":"IF(D36=\"\",\"\",IF(D36=F36,\"△\",IF(D36>F36,\"〇\",\"×\")))","v":""},null,null,{"$f":"IF(G36=\"\",\"\",IF(G36=I36,\"△\",IF(G36>I36,\"〇\",\"×\")))","v":""},{"$nulls":4},{"$f":"CONCATENATE($A35,N28)","v":"C3C4"},{"$f":"IF(M36=\"\",\"\",IF(M36=O36,\"△\",IF(M36>O36,\"〇\",\"×\")))","v":""},{"$f":"CONCATENATE(N28,$A35)","v":"C4C3"},{"$nulls":9},{"$f":"COUNTIF($E35:$N35,\"〇\")","v":0},{"$f":"COUNTIF($E35:$N35,\"×\")","v":0},{"$f":"COUNTIF($E35:$N35,\"△\")","v":0},{"$f":"Y35*2+AA35","v":0},{"$f":"IF(G36=\"\",\"\",D36+G36+M36+J36)","v":""},{"$f":"IF(AC35=\"\",\"\",AB35*100+AC35)","v":""},{"$f":"IF(AC35=\"\",\"\",F36+I36+L36+O36)","v":""},{"$f":"IF(AD35=\"\",\"\",RANK(AD35,AD31:AD38,0))","v":""},null,{"$f":"CONCATENATE(A29,AF35)","v":"C"},{"$f":"B35","v":"あさひスーパーファイターズ"},"欠場"]
[{"$nulls":3},{"$f":"IF(L32=\"\",\"\",L32)","v":""},"-",{"$f":"IF(J32=\"\",\"\",J32)","v":""},{"$f":"IF(L34=\"\",\"\",L34)","v":""},"-",{"$f":"IF(J34=\"\",\"\",J34)","v":""},{"$nulls":3},{"$f":"VLOOKUP(M35,対戦表!$AG:$AH,2,0)","v":""},"-",{"$f":"VLOOKUP(O35,対戦表!$AG:$AH,2,0)","v":""}]
[{"$f":"CONCATENATE(A29,4)","v":"C4"},{"$f":"VLOOKUP(A37,チーム表!C:D,2,FALSE)","v":"寺井クラブ"},null,null,{"$f":"IF(D38=\"\",\"\",IF(D38=F38,\"△\",IF(D38>F38,\"〇\",\"×\")))","v":"△"},null,null,{"$f":"IF(G38=\"\",\"\",IF(G38=I38,\"△\",IF(G38>I38,\"〇\",\"×\")))","v":"×"},null,null,{"$f":"IF(J38=\"\",\"\",IF(J38=L38,\"△\",IF(J38>L38,\"〇\",\"×\")))","v":""},{"$nulls":13},{"$f":"COUNTIF($E37:$N37,\"〇\")","v":0},{"$f":"COUNTIF($E37:$N37,\"×\")","v":1},{"$f":"COUNTIF($E37:$N37,\"△\")","v":1},{"$f":"Y37*2+AA37","v":1},{"$f":"IF(G38=\"\",\"\",D38+G38+M38)","v":13},{"$f":"IF(AC37=\"\",\"\",AB37*100+AC37)","v":113},{"$f":"IF(AC37=\"\",\"\",F38+I38+O38)","v":18},{"$f":"IF(AD37=\"\",\"\",RANK(AD37,AD31:AD38,0))","v":2},null,{"$f":"CONCATENATE(A29,AF37)","v":"C2"},{"$f":"B37","v":"寺井クラブ"}]
[{"$nulls":3},{"$f":"IF(O32=\"\",\"\",O32)","v":8},"-",{"$f":"IF(M32=\"\",\"\",M32)","v":8},{"$f":"IF(O34=\"\",\"\",O34)","v":5},"-",{"$f":"IF(M34=\"\",\"\",M34)","v":10},{"$f":"IF(O36=\"\",\"\",O36)","v":""},"-",{"$f":"IF(M36=\"\",\"\",M36)","v":""}]
[]
[{"$nulls":4},{"$f":"CONCATENATE(A41,\"1\")","v":"D1"},null,null,{"$f":"CONCATENATE(A41,\"2\")","v":"D2"},null,null,{"$f":"CONCATENATE(A41,\"3\")","v":"D3"},null,null,{"$f":"CONCATENATE(A41,\"4\")","v":"D4"}]
["D","チーム名",null,{"$f":"B43","v":"大門ドッジボールクラブ"},null,null,{"$f":"B45","v":"鳳至ドッジボールクラブ"},null,null,{"$f":"B47","v":"山中SPARS"},null,null,{"$f":"B49","v":"三馬パワフル"},{"$nulls":11},"勝","負","分","点","内野","順位決定点","相手内野","順位","kaku"]
[]
[{"$f":"CONCATENATE(A41,1)","v":"D1"},{"$f":"VLOOKUP(A43,チーム表!C:D,2,FALSE)","v":"大門ドッジボールクラブ"},{"$nulls":4},{"$f":"CONCATENATE($A43,H40)","v":"D1D2"},{"$f":"IF(G44=\"\",\"\",IF(G44=I44,\"△\",IF(G44>I44,\"〇\",\"×\")))","v":"〇"},{"$f":"CONCATENATE(H40,$A43)","v":"D2D1"},{"$f":"CONCATENATE($A43,K40)","v":"D1D3"},{"$f":"IF(J44=\"\",\"\",IF(J44=L44,\"△\",IF(J44>L44,\"〇\",\"×\")))","v":"×"},{"$f":"CONCATENATE(K40,$A43)","v":"D3D1"},{"$f":"CONCATENATE($A43,N40)","v":"D1D4"},{"$f":"IF(M44=\"\",\"\",IF(M44=O44,\"△\",IF(M44>O44,\"〇\",\"×\")))","v":"〇"},{"$f":"CONCATENATE(N40,$A43)","v":"D4D1"},{"$nulls":9},{"$f":"COUNTIF($E43:$N43,\"〇\")","v":2},{"$f":"COUNTIF($E43:$N43,\"×\")","v":1},{"$f":"COUNTIF($E43:$N43,\"△\")","v":0},{"$f":"Y43*2+AA43","v":4},{"$f":"IF(G44=\"\",\"\",D44+G44+M44+J44)","v":23},{"$f":"IF(AC43=\"\",\"\",AB43*100+AC43)","v":423},{"$f":"IF(AC43=\"\",\"\",F44+I44+L44+O44)","v":19},{"$f":"IF(AD43=\"\",\"\",RANK(AD43,AD43:AD50,0))","v":2},null,{"$f":"CONCATENATE(A41,AF43)","v":"D2"},{"$f":"B43","v":"大門ドッジボールクラブ"}]
[{"$nulls":6},{"$f":"VLOOKUP(G43,対戦表!$AG:$AH,2,0)","v":8},"-",{"$f":"VLOOKUP(I43,対戦表!$AG:$AH,2,0)","v":6},{"$f":"VLOOKUP(J43,対戦表!$AG:$AH,2,0)","v":6},"-",{"$f":"VLOOKUP(L43,対戦表!$AG:$AH,2,0)","v":8},{"$f":"VLOOKUP(M43,対戦表!$AG:$AH,2,0)","v":9},"-",{"$f":"VLOOKUP(O43,対戦表!$AG:$AH,2,0)","v":5}]
[{"$f":"CONCATENATE(A41,2)","v":"D2"},{"$f":"VLOOKUP(A45,チーム表!C:D,2,FALSE)","v":"鳳至ドッジボールクラブ"},null,null,{"$f":"IF(D46=\"\",\"\",IF(D46=F46,\"△\",IF(D46>F46,\"〇\",\"×\")))","v":"×"},{"$nulls":4},{"$f":"CONCATENATE($A45,K40)","v":"D2D3"},{"$f":"IF(J46=\"\",\"\",IF(J46=L46,\"△\",IF(J46>L46,\"〇\",\"×\")))","v":"×"},{"$f":"CONCATENATE(K40,$A45)","v":"D3D2"},{"$f":"CONCATENATE($A45,N40)","v":"D2D4"},{"$f":"IF(M46=\"\",\"\",IF(M46=O46,\"△\",IF(M46>O46,\"〇\",\"×\")))","v":"〇"},{"$f":"CONCATENATE(N40,$A45)","v":"D4D2"},{"$nulls":9},{"$f":"COUNTIF($E45:$N45,\"〇\")","v":1},{"$f":"COUNTIF($E45:$N45,\"×\")","v":2},{"$f":"COUNTIF($E45:$N45,\"△\")","v":0},{"$f":"Y45*2+AA45","v":2},{"$f":"IF(D46=\"\",\"\",D46+G46+M46+J46)","v":24},{"$f":"IF(AC45=\"\",\"\",AB45*100+AC45)","v":224},{"$f":"IF(AC45=\"\",\"\",F46+I46+L46+O46)","v":20},{"$f":"IF(AD45=\"\",\"\",RANK(AD45,AD43:AD50,0))","v":3},null,{"$f":"CONCATENATE(A41,AF45)","v":"D3"},{"$f":"B45","v":"鳳至ドッジボールクラブ"}]
[{"$nulls":3},{"$f":"IF(I44=\"\",\"\",I44)","v":6},"-",{"$f":"IF(G44=\"\",\"\",G44)","v":8},{"$nulls":3},{"$f":"VLOOKUP(J45,対戦表!$AG:$AH,2,0)","v":8},"-",{"$f":"VLOOKUP(L45,対戦表!$AG:$AH,2,0)","v":9},{"$f":"VLOOKUP(M45,対戦表!$AG:$AH,2,0)","v":10},"-",{"$f":"VLOOKUP(O45,対戦表!$AG:$AH,2,0)","v":3}]
[{"$f":"CONCATENATE(A41,3)","v":"D3"},{"$f":"VLOOKUP(A47,チーム表!C:D,2,FALSE)","v":"山中SPARS"},null,null,{"$f":"IF(D48=\"\",\"\",IF(D48=F48,\"△\",IF(D48>F48,\"〇\",\"×\")))","v":"〇"},null,null,{"$f":"IF(G48=\"\",\"\",IF(G48=I48,\"△\",IF(G48>I48,\"〇\",\"×\")))","v":"〇"},{"$nulls":4},{"$f":"CONCATENATE($A47,N40)","v":"D3D4"},{"$f":"IF(M48=\"\",\"\",IF(M48=O48,\"△\",IF(M48>O48,\"〇\",\"×\")))","v":"〇"},{"$f":"CONCATENATE(N40,$A47)","v":"D4D3"},{"$nulls":9},{"$f":"COUNTIF($E47:$N47,\"〇\")","v":3},{"$f":"COUNTIF($E47:$N47,\"×\")","v":0},{"$f":"COUNTIF($E47:$N47,\"△\")","v":0},{"$f":"Y47*2+AA47","v":6},{"$f":"IF(G48=\"\",\"\",D48+G48+M48+J48)","v":26},{"$f":"IF(AC47=\"\",\"\",AB47*100+AC47)","v":626},{"$f":"IF(AC47=\"\",\"\",F48+I48+L48+O48)","v":15},{"$f":"IF(AD47=\"\",\"\",RANK(AD47,AD43:AD50,0))","v":1},null,{"$f":"CONCATENATE(A41,AF47)","v":"D1"},{"$f":"B47","v":"山中SPARS"}]
[{"$nulls":3},{"$f":"IF(L44=\"\",\"\",L44)","v":8},"-",{"$f":"IF(J44=\"\",\"\",J44)","v":6},{"$f":"IF(L46=\"\",\"\",L46)","v":9},"-",{"$f":"IF(J46=\"\",\"\",J46)","v":8},{"$nulls":3},{"$f":"VLOOKUP(M47,対戦表!$AG:$AH,2,0)","v":9},"-",{"$f":"VLOOKUP(O47,対戦表!$AG:$AH,2,0)","v":1}]
[{"$f":"CONCATENATE(A41,4)","v":"D4"},{"$f":"VLOOKUP(A49,チーム表!C:D,2,FALSE)","v":"三馬パワフル"},null,null,{"$f":"IF(D50=\"\",\"\",IF(D50=F50,\"△\",IF(D50>F50,\"〇\",\"×\")))","v":"×"},null,null,{"$f":"IF(G50=\"\",\"\",IF(G50=I50,\"△\",IF(G50>I50,\"〇\",\"×\")))","v":"×"},null,null,{"$f":"IF(J50=\"\",\"\",IF(J50=L50,\"△\",IF(J50>L50,\"〇\",\"×\")))","v":"×"},{"$nulls":13},{"$f":"COUNTIF($E49:$N49,\"〇\")","v":0},{"$f":"COUNTIF($E49:$N49,\"×\")","v":3},{"$f":"COUNTIF($E49:$N49,\"△\")","v":0},{"$f":"Y49*2+AA49","v":0},{"$f":"IF(G50=\"\",\"\",D50+G50+M50+J50)","v":9},{"$f":"IF(AC49=\"\",\"\",AB49*100+AC49)","v":9},{"$f":"IF(AC49=\"\",\"\",F50+I50+L50+O50)","v":28},{"$f":"IF(AD49=\"\",\"\",RANK(AD49,AD43:AD50,0))","v":4},null,{"$f":"CONCATENATE(A41,AF49)","v":"D4"},{"$f":"B49","v":"三馬パワフル"}]
[{"$nulls":3},{"$f":"IF(O44=\"\",\"\",O44)","v":5},"-",{"$f":"IF(M44=\"\",\"\",M44)","v":9},{"$f":"IF(O46=\"\",\"\",O46)","v":3},"-",{"$f":"IF(M46=\"\",\"\",M46)","v":10},{"$f":"IF(O48=\"\",\"\",O48)","v":1},"-",{"$f":"IF(M48=\"\",\"\",M48)","v":9}]
[null,"ｼﾞｭﾆｱ･ｷｯｽﾞの部"]
[{"$nulls":4},{"$f":"CONCATENATE(A53,\"1\")","v":"E1"},null,null,{"$f":"CONCATENATE(A53,\"2\")","v":"E2"},null,null,{"$f":"CONCATENATE(A53,\"3\")","v":"E3"}]
["E","チーム名",null,{"$f":"B55","v":"鵜川フェニックスｷｯｽﾞ"},null,null,{"$f":"B57","v":"千坂ロータスルート"},null,null,{"$f":"B59","v":"寺井クラブJr"},{"$nulls":14},"勝","負","分","点","内野","順位決定点","相手内野","順位","kaku"]
[]
[{"$f":"CONCATENATE(A53,1)","v":"E1"},{"$f":"VLOOKUP(A55,チーム表!C:D,2,FALSE)","v":"鵜川フェニックスｷｯｽﾞ"},{"$nulls":4},{"$f":"CONCATENATE($A55,H52)","v":"E1E2"},{"$f":"IF(G56=\"\",\"\",IF(G56=I56,\"△\",IF(G56>I56,\"〇\",\"×\")))","v":"×"},{"$f":"CONCATENATE(H52,$A55)","v":"E2E1"},{"$f":"CONCATENATE($A55,K52)","v":"E1E3"},{"$f":"IF(J56=\"\",\"\",IF(J56=L56,\"△\",IF(J56>L56,\"〇\",\"×\")))","v":"〇"},{"$f":"CONCATENATE(K52,$A55)","v":"E3E1"},{"$nulls":12},{"$f":"COUNTIF($E55:$K55,\"〇\")","v":1},{"$f":"COUNTIF($E55:$K55,\"×\")","v":1},{"$f":"COUNTIF($E55:$W55,\"△\")","v":0},{"$f":"Y55*2+AA55","v":2},{"$f":"IF(G56=\"\",\"\",D56+G56+J56)","v":8},{"$f":"IF(AC55=\"\",\"\",AB55*100+AC55)","v":208},{"$f":"IF(AC55=\"\",\"\",F56+I56+L56)","v":8},{"$f":"IF(AD55=\"\",\"\",RANK(AD55,AD55:AD60,0))","v":2},null,{"$f":"CONCATENATE(A53,AF55)","v":"E2"},{"$f":"B55","v":"鵜川フェニックスｷｯｽﾞ"}]
[{"$nulls":6},{"$f":"VLOOKUP(G55,対戦表!$AG:$AH,2,0)","v":4},"-",{"$f":"VLOOKUP(I55,対戦表!$AG:$AH,2,0)","v":5},{"$f":"VLOOKUP(J55,対戦表!$AG:$AH,2,0)","v":4},"-",{"$f":"VLOOKUP(L55,対戦表!$AG:$AH,2,0)","v":3}]
[{"$f":"CONCATENATE(A53,2)","v":"E2"},{"$f":"VLOOKUP(A57,チーム表!C:D,2,FALSE)","v":"千坂ロータスルート"},null,null,{"$f":"IF(D58=\"\",\"\",IF(D58=F58,\"△\",IF(D58>F58,\"〇\",\"×\")))","v":"〇"},{"$nulls":4},{"$f":"CONCATENATE($A57,K52)","v":"E2E3"},{"$f":"IF(J58=\"\",\"\",IF(J58=L58,\"△\",IF(J58>L58,\"〇\",\"×\")))","v":"〇"},{"$f":"CONCATENATE(K52,$A57)","v":"E3E2"},{"$nulls":12},{"$f":"COUNTIF($E57:$K57,\"〇\")","v":2},{"$f":"COUNTIF($E57:$K57,\"×\")","v":0},{"$f":"COUNTIF($E57:$W57,\"△\")","v":0},{"$f":"Y57*2+AA57","v":4},{"$f":"IF(D58=\"\",\"\",D58+G58+J58)","v":9},{"$f":"IF(AC57=\"\",\"\",AB57*100+AC57)","v":409},{"$f":"IF(AC57=\"\",\"\",F58+I58+L58)","v":4},{"$f":"IF(AD57=\"\",\"\",RANK(AD57,AD55:AD60,0))","v":1},null,{"$f":"CONCATENATE(A53,AF57)","v":"E1"},{"$f":"B57","v":"千坂ロータスルート"}]
[{"$nulls":3},{"$f":"IF(I56=\"\",\"\",I56)","v":5},"-",{"$f":"IF(G56=\"\",\"\",G56)","v":4},{"$nulls":3},{"$f":"VLOOKUP(J57,対戦表!$AG:$AH,2,0)","v":4},"-",{"$f":"VLOOKUP(L57,対戦表!$AG:$AH,2,0)","v":0}]
[{"$f":"CONCATENATE(A53,3)","v":"E3"},{"$f":"VLOOKUP(A59,チーム表!C:D,2,FALSE)","v":"寺井クラブJr"},null,null,{"$f":"IF(D60=\"\",\"\",IF(D60=F60,\"△\",IF(D60>F60,\"〇\",\"×\")))","v":"×"},null,null,{"$f":"IF(G60=\"\",\"\",IF(G60=I60,\"△\",IF(G60>I60,\"〇\",\"×\")))","v":"×"},{"$nulls":16},{"$f":"COUNTIF($E59:$K59,\"〇\")","v":0},{"$f":"COUNTIF($E59:$K59,\"×\")","v":2},{"$f":"COUNTIF($E59:$W59,\"△\")","v":0},{"$f":"Y59*2+AA59","v":0},{"$f":"IF(G60=\"\",\"\",D60+G60+J60)","v":3},{"$f":"IF(AC59=\"\",\"\",AB59*100+AC59)","v":3},{"$f":"IF(AC59=\"\",\"\",F60+I60+L60)","v":8},{"$f":"IF(AD59=\"\",\"\",RANK(AD59,AD55:AD60,0))","v":3},null,{"$f":"CONCATENATE(A53,AF59)","v":"E3"},{"$f":"B59","v":"寺井クラブJr"}]
[{"$nulls":3},{"$f":"IF(L56=\"\",\"\",L56)","v":3},"-",{"$f":"IF(J56=\"\",\"\",J56)","v":4},{"$f":"IF(L58=\"\",\"\",L58)","v":0},"-",{"$f":"IF(J58=\"\",\"\",J58)","v":4}]
[]
[{"$nulls":4},{"$f":"CONCATENATE(A63,\"1\")","v":"F1"},null,null,{"$f":"CONCATENATE(A63,\"2\")","v":"F2"},null,null,{"$f":"CONCATENATE(A63,\"3\")","v":"F3"}]
["F","チーム名",null,{"$f":"B65","v":"鳳至ジュニア"},null,null,{"$f":"B67","v":"向本折クラブNew"},null,null,{"$f":"B69","v":"鞍月アタッカーズジュニア"},{"$nulls":14},"勝","負","分","点","内野","順位決定点","相手内野","順位","kaku"]
[]
[{"$f":"CONCATENATE(A63,1)","v":"F1"},{"$f":"VLOOKUP(A65,チーム表!C:D,2,FALSE)","v":"鳳至ジュニア"},{"$nulls":4},{"$f":"CONCATENATE($A65,H62)","v":"F1F2"},{"$f":"IF(G66=\"\",\"\",IF(G66=I66,\"△\",IF(G66>I66,\"〇\",\"×\")))","v":"×"},{"$f":"CONCATENATE(H62,$A65)","v":"F2F1"},{"$f":"CONCATENATE($A65,K62)","v":"F1F3"},{"$f":"IF(J66=\"\",\"\",IF(J66=L66,\"△\",IF(J66>L66,\"〇\",\"×\")))","v":"×"},{"$f":"CONCATENATE(K62,$A65)","v":"F3F1"},{"$nulls":12},{"$f":"COUNTIF($E65:$K65,\"〇\")","v":0},{"$f":"COUNTIF($E65:$K65,\"×\")","v":2},{"$f":"COUNTIF($E65:$W65,\"△\")","v":0},{"$f":"Y65*2+AA65","v":0},{"$f":"IF(G66=\"\",\"\",D66+G66+J66)","v":3},{"$f":"IF(AC65=\"\",\"\",AB65*100+AC65)","v":3},{"$f":"IF(AC65=\"\",\"\",F66+I66+L66)","v":10},{"$f":"IF(AD65=\"\",\"\",RANK(AD65,AD65:AD70,0))","v":3},null,{"$f":"CONCATENATE(A63,AF65)","v":"F3"},{"$f":"B65","v":"鳳至ジュニア"}]
[{"$nulls":6},{"$f":"VLOOKUP(G65,対戦表!$AG:$AH,2,0)","v":0},"-",{"$f":"VLOOKUP(I65,対戦表!$AG:$AH,2,0)","v":6},{"$f":"VLOOKUP(J65,対戦表!$AG:$AH,2,0)","v":3},"-",{"$f":"VLOOKUP(L65,対戦表!$AG:$AH,2,0)","v":4}]
[{"$f":"CONCATENATE(A63,2)","v":"F2"},{"$f":"VLOOKUP(A67,チーム表!C:D,2,FALSE)","v":"向本折クラブNew"},null,null,{"$f":"IF(D68=\"\",\"\",IF(D68=F68,\"△\",IF(D68>F68,\"〇\",\"×\")))","v":"〇"},{"$nulls":4},{"$f":"CONCATENATE($A67,K62)","v":"F2F3"},{"$f":"IF(J68=\"\",\"\",IF(J68=L68,\"△\",IF(J68>L68,\"〇\",\"×\")))","v":"〇"},{"$f":"CONCATENATE(K62,$A67)","v":"F3F2"},{"$nulls":12},{"$f":"COUNTIF($E67:$K67,\"〇\")","v":2},{"$f":"COUNTIF($E67:$K67,\"×\")","v":0},{"$f":"COUNTIF($E67:$W67,\"△\")","v":0},{"$f":"Y67*2+AA67","v":4},{"$f":"IF(D68=\"\",\"\",D68+G68+J68)","v":13},{"$f":"IF(AC67=\"\",\"\",AB67*100+AC67)","v":413},{"$f":"IF(AC67=\"\",\"\",F68+I68+L68)","v":0},{"$f":"IF(AD67=\"\",\"\",RANK(AD67,AD65:AD70,0))","v":1},null,{"$f":"CONCATENATE(A63,AF67)","v":"F1"},{"$f":"B67","v":"向本折クラブNew"}]
[{"$nulls":3},{"$f":"IF(I66=\"\",\"\",I66)","v":6},"-",{"$f":"IF(G66=\"\",\"\",G66)","v":0},{"$nulls":3},{"$f":"VLOOKUP(J67,対戦表!$AG:$AH,2,0)","v":7},"-",{"$f":"VLOOKUP(L67,対戦表!$AG:$AH,2,0)","v":0}]
[{"$f":"CONCATENATE(A63,3)","v":"F3"},{"$f":"VLOOKUP(A69,チーム表!C:D,2,FALSE)","v":"鞍月アタッカーズジュニア"},null,null,{"$f":"IF(D70=\"\",\"\",IF(D70=F70,\"△\",IF(D70>F70,\"〇\",\"×\")))","v":"〇"},null,null,{"$f":"IF(G70=\"\",\"\",IF(G70=I70,\"△\",IF(G70>I70,\"〇\",\"×\")))","v":"×"},{"$nulls":16},{"$f":"COUNTIF($E69:$K69,\"〇\")","v":1},{"$f":"COUNTIF($E69:$K69,\"×\")","v":1},{"$f":"COUNTIF($E69:$W69,\"△\")","v":0},{"$f":"Y69*2+AA69","v":2},{"$f":"IF(G70=\"\",\"\",D70+G70+J70)","v":4},{"$f":"IF(AC69=\"\",\"\",AB69*100+AC69)","v":204},{"$f":"IF(AC69=\"\",\"\",F70+I70+L70)","v":10},{"$f":"IF(AD69=\"\",\"\",RANK(AD69,AD65:AD70,0))","v":2},null,{"$f":"CONCATENATE(A63,AF69)","v":"F2"},{"$f":"B69","v":"鞍月アタッカーズジュニア"}]
[{"$nulls":3},{"$f":"IF(L66=\"\",\"\",L66)","v":4},"-",{"$f":"IF(J66=\"\",\"\",J66)","v":3},{"$f":"IF(L68=\"\",\"\",L68)","v":0},"-",{"$f":"IF(J68=\"\",\"\",J68)","v":7}]
[]
[{"$nulls":4},{"$f":"CONCATENATE(A73,\"1\")","v":"G1"},null,null,{"$f":"CONCATENATE(A73,\"2\")","v":"G2"},null,null,{"$f":"CONCATENATE(A73,\"3\")","v":"G3"}]
["G","チーム名",null,{"$f":"B75","v":"九十九クラブ"},null,null,{"$f":"B77","v":"松任の大魔陣Jr"},null,null,{"$f":"B79","v":"ドッジの王子様"},{"$nulls":14},"勝","負","分","点","内野","順位決定点","相手内野","順位","kaku"]
[]
[{"$f":"CONCATENATE(A73,1)","v":"G1"},{"$f":"VLOOKUP(A75,チーム表!C:D,2,FALSE)","v":"九十九クラブ"},{"$nulls":4},{"$f":"CONCATENATE($A75,H72)","v":"G1G2"},{"$f":"IF(G76=\"\",\"\",IF(G76=I76,\"△\",IF(G76>I76,\"〇\",\"×\")))","v":""},{"$f":"CONCATENATE(H72,$A75)","v":"G2G1"},{"$f":"CONCATENATE($A75,K72)","v":"G1G3"},{"$f":"IF(J76=\"\",\"\",IF(J76=L76,\"△\",IF(J76>L76,\"〇\",\"×\")))","v":""},{"$f":"CONCATENATE(K72,$A75)","v":"G3G1"},{"$nulls":12},{"$f":"COUNTIF($E75:$K75,\"〇\")","v":0},{"$f":"COUNTIF($E75:$K75,\"×\")","v":0},{"$f":"COUNTIF($E75:$W75,\"△\")","v":0},{"$f":"Y75*2+AA75","v":0},{"$f":"IF(G76=\"\",\"\",D76+G76+J76)","v":""},{"$f":"IF(AC75=\"\",\"\",AB75*100+AC75)","v":""},{"$f":"IF(AC75=\"\",\"\",F76+I76+L76)","v":""},{"$f":"IF(AD75=\"\",\"\",RANK(AD75,AD75:AD80,0))","v":""},null,{"$f":"CONCATENATE(A73,AF75)","v":"G"},{"$f":"B75","v":"九十九クラブ"}]
[{"$nulls":6},{"$f":"VLOOKUP(G75,対戦表!$AG:$AH,2,0)","v":""},"-",{"$f":"VLOOKUP(I75,対戦表!$AG:$AH,2,0)","v":""},{"$f":"VLOOKUP(J75,対戦表!$AG:$AH,2,0)","v":""},"-",{"$f":"VLOOKUP(L75,対戦表!$AG:$AH,2,0)","v":""}]
[{"$f":"CONCATENATE(A73,2)","v":"G2"},{"$f":"VLOOKUP(A77,チーム表!C:D,2,FALSE)","v":"松任の大魔陣Jr"},null,null,{"$f":"IF(D78=\"\",\"\",IF(D78=F78,\"△\",IF(D78>F78,\"〇\",\"×\")))","v":""},{"$nulls":4},{"$f":"CONCATENATE($A77,K72)","v":"G2G3"},{"$f":"IF(J78=\"\",\"\",IF(J78=L78,\"△\",IF(J78>L78,\"〇\",\"×\")))","v":"〇"},{"$f":"CONCATENATE(K72,$A77)","v":"G3G2"},{"$nulls":12},{"$f":"COUNTIF($E77:$K77,\"〇\")","v":1},{"$f":"COUNTIF($E77:$K77,\"×\")","v":0},{"$f":"COUNTIF($E77:$W77,\"△\")","v":0},{"$f":"Y77*2+AA77","v":2},{"$f":"IF(D78=\"\",\"\",D78+G78+J78)","v":""},{"$f":"IF(AC77=\"\",\"\",AB77*100+AC77)","v":""},{"$f":"IF(AC77=\"\",\"\",F78+I78+L78)","v":""},1,null,{"$f":"CONCATENATE(A73,AF77)","v":"G1"},{"$f":"B77","v":"松任の大魔陣Jr"}]
[{"$nulls":3},{"$f":"IF(I76=\"\",\"\",I76)","v":""},"-",{"$f":"IF(G76=\"\",\"\",G76)","v":""},{"$nulls":3},{"$f":"VLOOKUP(J77,対戦表!$AG:$AH,2,0)","v":4},"-",{"$f":"VLOOKUP(L77,対戦表!$AG:$AH,2,0)","v":2}]
[{"$f":"CONCATENATE(A73,3)","v":"G3"},{"$f":"VLOOKUP(A79,チーム表!C:D,2,FALSE)","v":"ドッジの王子様"},null,null,{"$f":"IF(D80=\"\",\"\",IF(D80=F80,\"△\",IF(D80>F80,\"〇\",\"×\")))","v":""},null,null,{"$f":"IF(G80=\"\",\"\",IF(G80=I80,\"△\",IF(G80>I80,\"〇\",\"×\")))","v":"×"},{"$nulls":16},{"$f":"COUNTIF($E79:$K79,\"〇\")","v":0},{"$f":"COUNTIF($E79:$K79,\"×\")","v":1},{"$f":"COUNTIF($E79:$W79,\"△\")","v":0},{"$f":"Y79*2+AA79","v":0},{"$f":"IF(G80=\"\",\"\",D80+G80+J80)","v":{"$error":"#VALUE!"}},{"$f":"IF(AC79=\"\",\"\",AB79*100+AC79)","v":{"$error":"#VALUE!"}},{"$f":"IF(AC79=\"\",\"\",F80+I80+L80)","v":{"$error":"#VALUE!"}},2,null,{"$f":"CONCATENATE(A73,AF79)","v":"G2"},{"$f":"B79","v":"ドッジの王子様"}]
[{"$nulls":3},{"$f":"IF(L76=\"\",\"\",L76)","v":""},"-",{"$f":"IF(J76=\"\",\"\",J76)","v":""},{"$f":"IF(L78=\"\",\"\",L78)","v":2},"-",{"$f":"IF(J78=\"\",\"\",J78)","v":4}]
[null,"一般の部"]
[{"$nulls":4},{"$f":"CONCATENATE(A83,\"1\")","v":"H1"},null,null,{"$f":"CONCATENATE(A83,\"2\")","v":"H2"},null,null,{"$f":"CONCATENATE(A83,\"3\")","v":"H3"}]
["H","チーム名",null,{"$f":"B85","v":"THUNDER(ｻﾝﾀﾞｰ)"},null,null,{"$f":"B87","v":"ＳＫＩＰＰＥＲＳ"},null,null,{"$f":"B89","v":"山中SPAーS"},{"$nulls":14},"勝","負","分","点","内野","順位決定点","相手内野","順位","kaku"]
[]
[{"$f":"CONCATENATE(A83,1)","v":"H1"},{"$f":"VLOOKUP(A85,チーム表!C:D,2,FALSE)","v":"THUNDER(ｻﾝﾀﾞｰ)"},{"$nulls":4},{"$f":"CONCATENATE($A85,H82)","v":"H1H2"},{"$f":"IF(G86=\"\",\"\",IF(G86=I86,\"△\",IF(G86>I86,\"〇\",\"×\")))","v":"〇"},{"$f":"CONCATENATE(H82,$A85)","v":"H2H1"},{"$f":"CONCATENATE($A85,K82)","v":"H1H3"},{"$f":"IF(J86=\"\",\"\",IF(J86=L86,\"△\",IF(J86>L86,\"〇\",\"×\")))","v":"〇"},{"$f":"CONCATENATE(K82,$A85)","v":"H3H1"},{"$nulls":12},{"$f":"COUNTIF($E85:$K85,\"〇\")","v":2},{"$f":"COUNTIF($E85:$K85,\"×\")","v":0},{"$f":"COUNTIF($E85:$W85,\"△\")","v":0},{"$f":"Y85*2+AA85","v":4},{"$f":"IF(G86=\"\",\"\",D86+G86+J86)","v":13},{"$f":"IF(AC85=\"\",\"\",AB85*100+AC85)","v":413},{"$f":"IF(AC85=\"\",\"\",F86+I86+L86)","v":6},{"$f":"IF(AD85=\"\",\"\",RANK(AD85,AD85:AD90,0))","v":1},null,{"$f":"CONCATENATE(A83,AF85)","v":"H1"},{"$f":"B85","v":"THUNDER(ｻﾝﾀﾞｰ)"}]
[{"$nulls":6},{"$f":"VLOOKUP(G85,対戦表!$AG:$AH,2,0)","v":7},"-",{"$f":"VLOOKUP(I85,対戦表!$AG:$AH,2,0)","v":1},{"$f":"VLOOKUP(J85,対戦表!$AG:$AH,2,0)","v":6},"-",{"$f":"VLOOKUP(L85,対戦表!$AG:$AH,2,0)","v":5}]
[{"$f":"CONCATENATE(A83,2)","v":"H2"},{"$f":"VLOOKUP(A87,チーム表!C:D,2,FALSE)","v":"ＳＫＩＰＰＥＲＳ"},null,null,{"$f":"IF(D88=\"\",\"\",IF(D88=F88,\"△\",IF(D88>F88,\"〇\",\"×\")))","v":"×"},{"$nulls":4},{"$f":"CONCATENATE($A87,K82)","v":"H2H3"},{"$f":"IF(J88=\"\",\"\",IF(J88=L88,\"△\",IF(J88>L88,\"〇\",\"×\")))","v":"×"},{"$f":"CONCATENATE(K82,$A87)","v":"H3H2"},{"$nulls":12},{"$f":"COUNTIF($E87:$K87,\"〇\")","v":0},{"$f":"COUNTIF($E87:$K87,\"×\")","v":2},{"$f":"COUNTIF($E87:$W87,\"△\")","v":0},{"$f":"Y87*2+AA87","v":0},{"$f":"IF(D88=\"\",\"\",D88+G88+J88)","v":1},{"$f":"IF(AC87=\"\",\"\",AB87*100+AC87)","v":1},{"$f":"IF(AC87=\"\",\"\",F88+I88+L88)","v":13},{"$f":"IF(AD87=\"\",\"\",RANK(AD87,AD85:AD90,0))","v":3},null,{"$f":"CONCATENATE(A83,AF87)","v":"H3"},{"$f":"B87","v":"ＳＫＩＰＰＥＲＳ"}]
[{"$nulls":3},{"$f":"IF(I86=\"\",\"\",I86)","v":1},"-",{"$f":"IF(G86=\"\",\"\",G86)","v":7},{"$nulls":3},{"$f":"VLOOKUP(J87,対戦表!$AG:$AH,2,0)","v":0},"-",{"$f":"VLOOKUP(L87,対戦表!$AG:$AH,2,0)","v":6}]
[{"$f":"CONCATENATE(A83,3)","v":"H3"},{"$f":"VLOOKUP(A89,チーム表!C:D,2,FALSE)","v":"山中SPAーS"},null,null,{"$f":"IF(D90=\"\",\"\",IF(D90=F90,\"△\",IF(D90>F90,\"〇\",\"×\")))","v":"×"},null,null,{"$f":"IF(G90=\"\",\"\",IF(G90=I90,\"△\",IF(G90>I90,\"〇\",\"×\")))","v":"〇"},{"$nulls":16},{"$f":"COUNTIF($E89:$K89,\"〇\")","v":1},{"$f":"COUNTIF($E89:$K89,\"×\")","v":1},{"$f":"COUNTIF($E89:$W89,\"△\")","v":0},{"$f":"Y89*2+AA89","v":2},{"$f":"IF(G90=\"\",\"\",D90+G90+J90)","v":11},{"$f":"IF(AC89=\"\",\"\",AB89*100+AC89)","v":211},{"$f":"IF(AC89=\"\",\"\",F90+I90+L90)","v":6},{"$f":"IF(AD89=\"\",\"\",RANK(AD89,AD85:AD90,0))","v":2},null,{"$f":"CONCATENATE(A83,AF89)","v":"H2"},{"$f":"B89","v":"山中SPAーS"}]
[{"$nulls":3},{"$f":"IF(L86=\"\",\"\",L86)","v":5},"-",{"$f":"IF(J86=\"\",\"\",J86)","v":6},{"$f":"IF(L88=\"\",\"\",L88)","v":6},"-",{"$f":"IF(J88=\"\",\"\",J88)","v":0}]
[]
[{"$nulls":4},{"$f":"CONCATENATE(A93,\"1\")","v":"I1"},null,null,{"$f":"CONCATENATE(A93,\"2\")","v":"I2"},null,null,{"$f":"CONCATENATE(A93,\"3\")","v":"I3"}]
["I","チーム名",null,{"$f":"B95","v":"ペヤング"},null,null,{"$f":"B97","v":"鞍月アタッカーズＯＮＥ"},null,null,{"$f":"B99","v":"新撰組"},{"$nulls":14},"勝","負","分","点","内野","順位決定点","相手内野","順位","kaku"]
[]
[{"$f":"CONCATENATE(A93,1)","v":"I1"},{"$f":"VLOOKUP(A95,チーム表!C:D,2,FALSE)","v":"ペヤング"},{"$nulls":4},{"$f":"CONCATENATE($A95,H92)","v":"I1I2"},{"$f":"IF(G96=\"\",\"\",IF(G96=I96,\"△\",IF(G96>I96,\"〇\",\"×\")))","v":"〇"},{"$f":"CONCATENATE(H92,$A95)","v":"I2I1"},{"$f":"CONCATENATE($A95,K92)","v":"I1I3"},{"$f":"IF(J96=\"\",\"\",IF(J96=L96,\"△\",IF(J96>L96,\"〇\",\"×\")))","v":"×"},{"$f":"CONCATENATE(K92,$A95)","v":"I3I1"},{"$nulls":12},{"$f":"COUNTIF($E95:$K95,\"〇\")","v":1},{"$f":"COUNTIF($E95:$K95,\"×\")","v":1},{"$f":"COUNTIF($E95:$W95,\"△\")","v":0},{"$f":"Y95*2+AA95","v":2},{"$f":"IF(G96=\"\",\"\",D96+G96+J96)","v":11},{"$f":"IF(AC95=\"\",\"\",AB95*100+AC95)","v":211},{"$f":"IF(AC95=\"\",\"\",F96+I96+L96)","v":4},{"$f":"IF(AD95=\"\",\"\",RANK(AD95,AD95:AD100,0))","v":2},null,{"$f":"CONCATENATE(A93,AF95)","v":"I2"},{"$f":"B95","v":"ペヤング"}]
[{"$nulls":6},{"$f":"VLOOKUP(G95,対戦表!$AG:$AH,2,0)","v":8},"-",{"$f":"VLOOKUP(I95,対戦表!$AG:$AH,2,0)","v":0},{"$f":"VLOOKUP(J95,対戦表!$AG:$AH,2,0)","v":3},"-",{"$f":"VLOOKUP(L95,対戦表!$AG:$AH,2,0)","v":4}]
[{"$f":"CONCATENATE(A93,2)","v":"I2"},{"$f":"VLOOKUP(A97,チーム表!C:D,2,FALSE)","v":"鞍月アタッカーズＯＮＥ"},null,null,{"$f":"IF(D98=\"\",\"\",IF(D98=F98,\"△\",IF(D98>F98,\"〇\",\"×\")))","v":"×"},{"$nulls":4},{"$f":"CONCATENATE($A97,K92)","v":"I2I3"},{"$f":"IF(J98=\"\",\"\",IF(J98=L98,\"△\",IF(J98>L98,\"〇\",\"×\")))","v":"△"},{"$f":"CONCATENATE(K92,$A97)","v":"I3I2"},{"$nulls":12},{"$f":"COUNTIF($E97:$K97,\"〇\")","v":0},{"$f":"COUNTIF($E97:$K97,\"×\")","v":1},{"$f":"COUNTIF($E97:$W97,\"△\")","v":1},{"$f":"Y97*2+AA97","v":1},{"$f":"IF(D98=\"\",\"\",D98+G98+J98)","v":4},{"$f":"IF(AC97=\"\",\"\",AB97*100+AC97)","v":104},{"$f":"IF(AC97=\"\",\"\",F98+I98+L98)","v":12},{"$f":"IF(AD97=\"\",\"\",RANK(AD97,AD95:AD100,0))","v":3},null,{"$f":"CONCATENATE(A93,AF97)","v":"I3"},{"$f":"B97","v":"鞍月アタッカーズＯＮＥ"}]
[{"$nulls":3},{"$f":"IF(I96=\"\",\"\",I96)","v":0},"-",{"$f":"IF(G96=\"\",\"\",G96)","v":8},{"$nulls":3},{"$f":"VLOOKUP(J97,対戦表!$AG:$AH,2,0)","v":4},"-",{"$f":"VLOOKUP(L97,対戦表!$AG:$AH,2,0)","v":4}]
[{"$f":"CONCATENATE(A93,3)","v":"I3"},{"$f":"VLOOKUP(A99,チーム表!C:D,2,FALSE)","v":"新撰組"},null,null,{"$f":"IF(D100=\"\",\"\",IF(D100=F100,\"△\",IF(D100>F100,\"〇\",\"×\")))","v":"〇"},null,null,{"$f":"IF(G100=\"\",\"\",IF(G100=I100,\"△\",IF(G100>I100,\"〇\",\"×\")))","v":"△"},{"$nulls":16},{"$f":"COUNTIF($E99:$K99,\"〇\")","v":1},{"$f":"COUNTIF($E99:$K99,\"×\")","v":0},{"$f":"COUNTIF($E99:$W99,\"△\")","v":1},{"$f":"Y99*2+AA99","v":3},{"$f":"IF(G100=\"\",\"\",D100+G100+J100)","v":8},{"$f":"IF(AC99=\"\",\"\",AB99*100+AC99)","v":308},{"$f":"IF(AC99=\"\",\"\",F100+I100+L100)","v":7},{"$f":"IF(AD99=\"\",\"\",RANK(AD99,AD95:AD100,0))","v":1},null,{"$f":"CONCATENATE(A93,AF99)","v":"I1"},{"$f":"B99","v":"新撰組"}]
[{"$nulls":3},{"$f":"IF(L96=\"\",\"\",L96)","v":4},"-",{"$f":"IF(J96=\"\",\"\",J96)","v":3},{"$f":"IF(L98=\"\",\"\",L98)","v":4},"-",{"$f":"IF(J98=\"\",\"\",J98)","v":4}]
[null,"パパさんの部"]
[{"$nulls":4},{"$f":"CONCATENATE(A103,\"1\")","v":"J1"},null,null,{"$f":"CONCATENATE(A103,\"2\")","v":"J2"},null,null,{"$f":"CONCATENATE(A103,\"3\")","v":"J3"}]
["J","チーム名",null,{"$f":"B105","v":"杉っ子ダディー"},null,null,{"$f":"B107","v":"松任の大魔陣オールディーズ"},null,null,{"$f":"B109","v":"パパ合同チーム"},{"$nulls":14},"勝","負","分","点","内野","順位決定点","相手内野","順位","kaku"]
[]
[{"$f":"CONCATENATE(A103,1)","v":"J1"},{"$f":"VLOOKUP(A105,チーム表!C:D,2,FALSE)","v":"杉っ子ダディー"},{"$nulls":4},{"$f":"CONCATENATE($A105,H102)","v":"J1J2"},{"$f":"IF(G106=\"\",\"\",IF(G106=I106,\"△\",IF(G106>I106,\"〇\",\"×\")))","v":"〇"},{"$f":"CONCATENATE(H102,$A105)","v":"J2J1"},{"$f":"CONCATENATE($A105,K102)","v":"J1J3"},{"$f":"IF(J106=\"\",\"\",IF(J106=L106,\"△\",IF(J106>L106,\"〇\",\"×\")))","v":"△"},{"$f":"CONCATENATE(K102,$A105)","v":"J3J1"},{"$nulls":12},{"$f":"COUNTIF($E105:$K105,\"〇\")","v":1},{"$f":"COUNTIF($E105:$K105,\"×\")","v":0},{"$f":"COUNTIF($E105:$W105,\"△\")","v":1},{"$f":"Y105*2+AA105","v":3},{"$f":"IF(G106=\"\",\"\",D106+G106+J106)","v":10},{"$f":"IF(AC105=\"\",\"\",AB105*100+AC105)","v":310},{"$f":"IF(AC105=\"\",\"\",F106+I106+L106)","v":8},{"$f":"IF(AD105=\"\",\"\",RANK(AD105,AD105:AD110,0))","v":1},null,{"$f":"CONCATENATE(A103,AF105)","v":"J1"},{"$f":"B105","v":"杉っ子ダディー"}]
[{"$nulls":6},{"$f":"VLOOKUP(G105,対戦表!$AG:$AH,2,0)","v":5},"-",{"$f":"VLOOKUP(I105,対戦表!$AG:$AH,2,0)","v":3},{"$f":"VLOOKUP(J105,対戦表!$AG:$AH,2,0)","v":5},"-",{"$f":"VLOOKUP(L105,対戦表!$AG:$AH,2,0)","v":5}]
[{"$f":"CONCATENATE(A103,2)","v":"J2"},{"$f":"VLOOKUP(A107,チーム表!C:D,2,FALSE)","v":"松任の大魔陣オールディーズ"},null,null,{"$f":"IF(D108=\"\",\"\",IF(D108=F108,\"△\",IF(D108>F108,\"〇\",\"×\")))","v":"×"},{"$nulls":4},{"$f":"CONCATENATE($A107,K102)","v":"J2J3"},{"$f":"IF(J108=\"\",\"\",IF(J108=L108,\"△\",IF(J108>L108,\"〇\",\"×\")))","v":"〇"},{"$f":"CONCATENATE(K102,$A107)","v":"J3J2"},{"$nulls":12},{"$f":"COUNTIF($E107:$K107,\"〇\")","v":1},{"$f":"COUNTIF($E107:$K107,\"×\")","v":1},{"$f":"COUNTIF($E107:$W107,\"△\")","v":0},{"$f":"Y107*2+AA107","v":2},{"$f":"IF(D108=\"\",\"\",D108+G108+J108)","v":10},{"$f":"IF(AC107=\"\",\"\",AB107*100+AC107)","v":210},{"$f":"IF(AC107=\"\",\"\",F108+I108+L108)","v":8},{"$f":"IF(AD107=\"\",\"\",RANK(AD107,AD105:AD110,0))","v":2},null,{"$f":"CONCATENATE(A103,AF107)","v":"J2"},{"$f":"B107","v":"松任の大魔陣オールディーズ"}]
[{"$nulls":3},{"$f":"IF(I106=\"\",\"\",I106)","v":3},"-",{"$f":"IF(G106=\"\",\"\",G106)","v":5},{"$nulls":3},{"$f":"VLOOKUP(J107,対戦表!$AG:$AH,2,0)","v":7},"-",{"$f":"VLOOKUP(L107,対戦表!$AG:$AH,2,0)","v":3}]
[{"$f":"CONCATENATE(A103,3)","v":"J3"},{"$f":"VLOOKUP(A109,チーム表!C:D,2,FALSE)","v":"パパ合同チーム"},null,null,{"$f":"IF(D110=\"\",\"\",IF(D110=F110,\"△\",IF(D110>F110,\"〇\",\"×\")))","v":"△"},null,null,{"$f":"IF(G110=\"\",\"\",IF(G110=I110,\"△\",IF(G110>I110,\"〇\",\"×\")))","v":"×"},{"$nulls":16},{"$f":"COUNTIF($E109:$K109,\"〇\")","v":0},{"$f":"COUNTIF($E109:$K109,\"×\")","v":1},{"$f":"COUNTIF($E109:$W109,\"△\")","v":1},{"$f":"Y109*2+AA109","v":1},{"$f":"IF(G110=\"\",\"\",D110+G110+J110)","v":8},{"$f":"IF(AC109=\"\",\"\",AB109*100+AC109)","v":108},{"$f":"IF(AC109=\"\",\"\",F110+I110+L110)","v":12},{"$f":"IF(AD109=\"\",\"\",RANK(AD109,AD105:AD110,0))","v":3},null,{"$f":"CONCATENATE(A103,AF109)","v":"J3"},{"$f":"B109","v":"パパ合同チーム"}]
[{"$nulls":3},{"$f":"IF(L106=\"\",\"\",L106)","v":5},"-",{"$f":"IF(J106=\"\",\"\",J106)","v":5},{"$f":"IF(L108=\"\",\"\",L108)","v":3},"-",{"$f":"IF(J108=\"\",\"\",J108)","v":7}]
[null,"ママさんの部"]
[{"$nulls":4},{"$f":"CONCATENATE(A113,\"1\")","v":"K1"},null,null,{"$f":"CONCATENATE(A113,\"2\")","v":"K2"},null,null,{"$f":"CONCATENATE(A113,\"3\")","v":"K3"},null,null,{"$f":"CONCATENATE(A113,\"4\")","v":"K4"}]
["K","チーム名",null,{"$f":"B115","v":"松任の大魔陣Ladies"},null,null,{"$f":"B117","v":"鞍月マミ～ズ"},null,null,{"$f":"B119","v":"田上闘球HAPPYS"},null,null,{"$f":"B121","v":"ママ合同チーム"},{"$nulls":11},"勝","負","分","点","内野","順位決定点","相手内野","順位","kaku"]
[]
[{"$f":"CONCATENATE(A113,1)","v":"K1"},{"$f":"VLOOKUP(A115,チーム表!C:D,2,FALSE)","v":"松任の大魔陣Ladies"},{"$nulls":4},{"$f":"CONCATENATE($A115,H112)","v":"K1K2"},{"$f":"IF(G116=\"\",\"\",IF(G116=I116,\"△\",IF(G116>I116,\"〇\",\"×\")))","v":"×"},{"$f":"CONCATENATE(H112,$A115)","v":"K2K1"},{"$f":"CONCATENATE($A115,K112)","v":"K1K3"},{"$f":"IF(J116=\"\",\"\",IF(J116=L116,\"△\",IF(J116>L116,\"〇\",\"×\")))","v":"×"},{"$f":"CONCATENATE(K112,$A115)","v":"K3K1"},{"$f":"CONCATENATE($A115,N112)","v":"K1K4"},{"$f":"IF(M116=\"\",\"\",IF(M116=O116,\"△\",IF(M116>O116,\"〇\",\"×\")))","v":"〇"},{"$f":"CONCATENATE(N112,$A115)","v":"K4K1"},{"$nulls":9},{"$f":"COUNTIF($E115:$N115,\"〇\")","v":1},{"$f":"COUNTIF($E115:$N115,\"×\")","v":2},{"$f":"COUNTIF($E115:$N115,\"△\")","v":0},{"$f":"Y115*2+AA115","v":2},{"$f":"IF(G116=\"\",\"\",D116+G116+M116+J116)","v":6},{"$f":"IF(AC115=\"\",\"\",AB115*100+AC115)","v":206},{"$f":"IF(AC115=\"\",\"\",F116+I116+L116+O116)","v":14},{"$f":"IF(AD115=\"\",\"\",RANK(AD115,AD115:AD122,0))","v":3},null,{"$f":"CONCATENATE(A113,AF115)","v":"K3"},{"$f":"B115","v":"松任の大魔陣Ladies"}]
[{"$nulls":6},{"$f":"VLOOKUP(G115,対戦表!$AG:$AH,2,0)","v":0},"-",{"$f":"VLOOKUP(I115,対戦表!$AG:$AH,2,0)","v":7},{"$f":"VLOOKUP(J115,対戦表!$AG:$AH,2,0)","v":3},"-",{"$f":"VLOOKUP(L115,対戦表!$AG:$AH,2,0)","v":5},{"$f":"VLOOKUP(M115,対戦表!$AG:$AH,2,0)","v":3},"-",{"$f":"VLOOKUP(O115,対戦表!$AG:$AH,2,0)","v":2}]
[{"$f":"CONCATENATE(A113,2)","v":"K2"},{"$f":"VLOOKUP(A117,チーム表!C:D,2,FALSE)","v":"鞍月マミ～ズ"},null,null,{"$f":"IF(D118=\"\",\"\",IF(D118=F118,\"△\",IF(D118>F118,\"〇\",\"×\")))","v":"〇"},{"$nulls":4},{"$f":"CONCATENATE($A117,K112)","v":"K2K3"},{"$f":"IF(J118=\"\",\"\",IF(J118=L118,\"△\",IF(J118>L118,\"〇\",\"×\")))","v":"〇"},{"$f":"CONCATENATE(K112,$A117)","v":"K3K2"},{"$f":"CONCATENATE($A117,N112)","v":"K2K4"},{"$f":"IF(M118=\"\",\"\",IF(M118=O118,\"△\",IF(M118>O118,\"〇\",\"×\")))","v":"×"},{"$f":"CONCATENATE(N112,$A117)","v":"K4K2"},{"$nulls":9},{"$f":"COUNTIF($E117:$N117,\"〇\")","v":2},{"$f":"COUNTIF($E117:$N117,\"×\")","v":1},{"$f":"COUNTIF($E117:$N117,\"△\")","v":0},{"$f":"Y117*2+AA117","v":4},{"$f":"IF(D118=\"\",\"\",D118+G118+M118+J118)","v":13},{"$f":"IF(AC117=\"\",\"\",AB117*100+AC117)","v":413},{"$f":"IF(AC117=\"\",\"\",F118+I118+L118+O118)","v":2},{"$f":"IF(AD117=\"\",\"\",RANK(AD117,AD115:AD122,0))","v":1},null,{"$f":"CONCATENATE(A113,AF117)","v":"K1"},{"$f":"B117","v":"鞍月マミ～ズ"}]
[{"$nulls":3},{"$f":"IF(I116=\"\",\"\",I116)","v":7},"-",{"$f":"IF(G116=\"\",\"\",G116)","v":0},{"$nulls":3},{"$f":"VLOOKUP(J117,対戦表!$AG:$AH,2,0)","v":5},"-",{"$f":"VLOOKUP(L117,対戦表!$AG:$AH,2,0)","v":0},{"$f":"VLOOKUP(M117,対戦表!$AG:$AH,2,0)","v":1},"-",{"$f":"VLOOKUP(O117,対戦表!$AG:$AH,2,0)","v":2}]
[{"$f":"CONCATENATE(A113,3)","v":"K3"},{"$f":"VLOOKUP(A119,チーム表!C:D,2,FALSE)","v":"田上闘球HAPPYS"},null,null,{"$f":"IF(D120=\"\",\"\",IF(D120=F120,\"△\",IF(D120>F120,\"〇\",\"×\")))","v":"〇"},null,null,{"$f":"IF(G120=\"\",\"\",IF(G120=I120,\"△\",IF(G120>I120,\"〇\",\"×\")))","v":"×"},{"$nulls":4},{"$f":"CONCATENATE($A119,N112)","v":"K3K4"},{"$f":"IF(M120=\"\",\"\",IF(M120=O120,\"△\",IF(M120>O120,\"〇\",\"×\")))","v":"×"},{"$f":"CONCATENATE(N112,$A119)","v":"K4K3"},{"$nulls":9},{"$f":"COUNTIF($E119:$N119,\"〇\")","v":1},{"$f":"COUNTIF($E119:$N119,\"×\")","v":2},{"$f":"COUNTIF($E119:$N119,\"△\")","v":0},{"$f":"Y119*2+AA119","v":2},{"$f":"IF(G120=\"\",\"\",D120+G120+M120+J120)","v":5},{"$f":"IF(AC119=\"\",\"\",AB119*100+AC119)","v":205},{"$f":"IF(AC119=\"\",\"\",F120+I120+L120+O120)","v":13},{"$f":"IF(AD119=\"\",\"\",RANK(AD119,AD115:AD122,0))","v":4},null,{"$f":"CONCATENATE(A113,AF119)","v":"K4"},{"$f":"B119","v":"田上闘球HAPPYS"}]
[{"$nulls":3},{"$f":"IF(L116=\"\",\"\",L116)","v":5},"-",{"$f":"IF(J116=\"\",\"\",J116)","v":3},{"$f":"IF(L118=\"\",\"\",L118)","v":0},"-",{"$f":"IF(J118=\"\",\"\",J118)","v":5},{"$nulls":3},{"$f":"VLOOKUP(M119,対戦表!$AG:$AH,2,0)","v":0},"-",{"$f":"VLOOKUP(O119,対戦表!$AG:$AH,2,0)","v":5}]
[{"$f":"CONCATENATE(A113,4)","v":"K4"},{"$f":"VLOOKUP(A121,チーム表!C:D,2,FALSE)","v":"ママ合同チーム"},null,null,{"$f":"IF(D122=\"\",\"\",IF(D122=F122,\"△\",IF(D122>F122,\"〇\",\"×\")))","v":"×"},null,null,{"$f":"IF(G122=\"\",\"\",IF(G122=I122,\"△\",IF(G122>I122,\"〇\",\"×\")))","v":"〇"},null,null,{"$f":"IF(J122=\"\",\"\",IF(J122=L122,\"△\",IF(J122>L122,\"〇\",\"×\")))","v":"〇"},{"$nulls":13},{"$f":"COUNTIF($E121:$N121,\"〇\")","v":2},{"$f":"COUNTIF($E121:$N121,\"×\")","v":1},{"$f":"COUNTIF($E121:$N121,\"△\")","v":0},{"$f":"Y121*2+AA121","v":4},{"$f":"IF(G122=\"\",\"\",D122+G122+M122+J122)","v":9},{"$f":"IF(AC121=\"\",\"\",AB121*100+AC121)","v":409},{"$f":"IF(AC121=\"\",\"\",F122+I122+L122+O122)","v":4},{"$f":"IF(AD121=\"\",\"\",RANK(AD121,AD115:AD122,0))","v":2},null,{"$f":"CONCATENATE(A113,AF121)","v":"K2"},{"$f":"B121","v":"ママ合同チーム"}]
[{"$nulls":3},{"$f":"IF(O116=\"\",\"\",O116)","v":2},"-",{"$f":"IF(M116=\"\",\"\",M116)","v":3},{"$f":"IF(O118=\"\",\"\",O118)","v":2},"-",{"$f":"IF(M118=\"\",\"\",M118)","v":1},{"$f":"IF(O120=\"\",\"\",O120)","v":5},"-",{"$f":"IF(M120=\"\",\"\",M120)","v":0}]
[null,"親子の部"]
[{"$nulls":4},{"$f":"CONCATENATE(A125,\"1\")","v":"L1"},null,null,{"$f":"CONCATENATE(A125,\"2\")","v":"L2"},null,null,{"$f":"CONCATENATE(A125,\"3\")","v":"L3"},null,null,{"$f":"CONCATENATE(A125,\"4\")","v":"L4"}]
["L","チーム名",null,{"$f":"B127","v":"田上闘球親子"},null,null,{"$f":"B129","v":"フェニックスと頑固なお父さん"},null,null,{"$f":"B131","v":"松任の大魔陣ファミリー"},null,null,{"$f":"B133","v":"三馬パワフルファミリー"},{"$nulls":11},"勝","負","分","点","内野","順位決定点","相手内野","順位","kaku"]
[]
[{"$f":"CONCATENATE(A125,1)","v":"L1"},{"$f":"VLOOKUP(A127,チーム表!C:D,2,FALSE)","v":"田上闘球親子"},{"$nulls":4},{"$f":"CONCATENATE($A127,H124)","v":"L1L2"},{"$f":"IF(G128=\"\",\"\",IF(G128=I128,\"△\",IF(G128>I128,\"〇\",\"×\")))","v":"〇"},{"$f":"CONCATENATE(H124,$A127)","v":"L2L1"},{"$f":"CONCATENATE($A127,K124)","v":"L1L3"},{"$f":"IF(J128=\"\",\"\",IF(J128=L128,\"△\",IF(J128>L128,\"〇\",\"×\")))","v":"×"},{"$f":"CONCATENATE(K124,$A127)","v":"L3L1"},{"$f":"CONCATENATE($A127,N124)","v":"L1L4"},{"$f":"IF(M128=\"\",\"\",IF(M128=O128,\"△\",IF(M128>O128,\"〇\",\"×\")))","v":"〇"},{"$f":"CONCATENATE(N124,$A127)","v":"L4L1"},{"$nulls":9},{"$f":"COUNTIF($E127:$N127,\"〇\")","v":2},{"$f":"COUNTIF($E127:$N127,\"×\")","v":1},{"$f":"COUNTIF($E127:$N127,\"△\")","v":0},{"$f":"Y127*2+AA127","v":4},{"$f":"IF(G128=\"\",\"\",D128+G128+M128+J128)","v":10},{"$f":"IF(AC127=\"\",\"\",AB127*100+AC127)","v":410},{"$f":"IF(AC127=\"\",\"\",F128+I128+L128+O128)","v":11},{"$f":"IF(AD127=\"\",\"\",RANK(AD127,AD127:AD134,0))","v":2},null,{"$f":"CONCATENATE(A125,AF127)","v":"L2"},{"$f":"B127","v":"田上闘球親子"}]
[{"$nulls":6},{"$f":"VLOOKUP(G127,対戦表!$AG:$AH,2,0)","v":4},"-",{"$f":"VLOOKUP(I127,対戦表!$AG:$AH,2,0)","v":3},{"$f":"VLOOKUP(J127,対戦表!$AG:$AH,2,0)","v":1},"-",{"$f":"VLOOKUP(L127,対戦表!$AG:$AH,2,0)","v":5},{"$f":"VLOOKUP(M127,対戦表!$AG:$AH,2,0)","v":5},"-",{"$f":"VLOOKUP(O127,対戦表!$AG:$AH,2,0)","v":3}]
[{"$f":"CONCATENATE(A125,2)","v":"L2"},{"$f":"VLOOKUP(A129,チーム表!C:D,2,FALSE)","v":"フェニックスと頑固なお父さん"},null,null,{"$f":"IF(D130=\"\",\"\",IF(D130=F130,\"△\",IF(D130>F130,\"〇\",\"×\")))","v":"×"},{"$nulls":4},{"$f":"CONCATENATE($A129,K124)","v":"L2L3"},{"$f":"IF(J130=\"\",\"\",IF(J130=L130,\"△\",IF(J130>L130,\"〇\",\"×\")))","v":"△"},{"$f":"CONCATENATE(K124,$A129)","v":"L3L2"},{"$f":"CONCATENATE($A129,N124)","v":"L2L4"},{"$f":"IF(M130=\"\",\"\",IF(M130=O130,\"△\",IF(M130>O130,\"〇\",\"×\")))","v":"〇"},{"$f":"CONCATENATE(N124,$A129)","v":"L4L2"},{"$nulls":9},{"$f":"COUNTIF($E129:$N129,\"〇\")","v":1},{"$f":"COUNTIF($E129:$N129,\"×\")","v":1},{"$f":"COUNTIF($E129:$N129,\"△\")","v":1},{"$f":"Y129*2+AA129","v":3},{"$f":"IF(D130=\"\",\"\",D130+G130+M130+J130)","v":12},{"$f":"IF(AC129=\"\",\"\",AB129*100+AC129)","v":312},{"$f":"IF(AC129=\"\",\"\",F130+I130+L130+O130)","v":9},{"$f":"IF(AD129=\"\",\"\",RANK(AD129,AD127:AD134,0))","v":3},null,{"$f":"CONCATENATE(A125,AF129)","v":"L3"},{"$f":"B129","v":"フェニックスと頑固なお父さん"}]
[{"$nulls":3},{"$f":"IF(I128=\"\",\"\",I128)","v":3},"-",{"$f":"IF(G128=\"\",\"\",G128)","v":4},{"$nulls":3},{"$f":"VLOOKUP(J129,対戦表!$AG:$AH,2,0)","v":3},"-",{"$f":"VLOOKUP(L129,対戦表!$AG:$AH,2,0)","v":3},{"$f":"VLOOKUP(M129,対戦表!$AG:$AH,2,0)","v":6},"-",{"$f":"VLOOKUP(O129,対戦表!$AG:$AH,2,0)","v":2}]
[{"$f":"CONCATENATE(A125,3)","v":"L3"},{"$f":"VLOOKUP(A131,チーム表!C:D,2,FALSE)","v":"松任の大魔陣ファミリー"},null,null,{"$f":"IF(D132=\"\",\"\",IF(D132=F132,\"△\",IF(D132>F132,\"〇\",\"×\")))","v":"〇"},null,null,{"$f":"IF(G132=\"\",\"\",IF(G132=I132,\"△\",IF(G132>I132,\"〇\",\"×\")))","v":"△"},{"$nulls":4},{"$f":"CONCATENATE($A131,N124)","v":"L3L4"},{"$f":"IF(M132=\"\",\"\",IF(M132=O132,\"△\",IF(M132>O132,\"〇\",\"×\")))","v":"〇"},{"$f":"CONCATENATE(N124,$A131)","v":"L4L3"},{"$nulls":9},{"$f":"COUNTIF($E131:$N131,\"〇\")","v":2},{"$f":"COUNTIF($E131:$N131,\"×\")","v":0},{"$f":"COUNTIF($E131:$N131,\"△\")","v":1},{"$f":"Y131*2+AA131","v":5},{"$f":"IF(G132=\"\",\"\",D132+G132+M132+J132)","v":15},{"$f":"IF(AC131=\"\",\"\",AB131*100+AC131)","v":515},{"$f":"IF(AC131=\"\",\"\",F132+I132+L132+O132)","v":4},{"$f":"IF(AD131=\"\",\"\",RANK(AD131,AD127:AD134,0))","v":1},null,{"$f":"CONCATENATE(A125,AF131)","v":"L1"},{"$f":"B131","v":"松任の大魔陣ファミリー"}]
[{"$nulls":3},{"$f":"IF(L128=\"\",\"\",L128)","v":5},"-",{"$f":"IF(J128=\"\",\"\",J128)","v":1},{"$f":"IF(L130=\"\",\"\",L130)","v":3},"-",{"$f":"IF(J130=\"\",\"\",J130)","v":3},{"$nulls":3},{"$f":"VLOOKUP(M131,対戦表!$AG:$AH,2,0)","v":7},"-",{"$f":"VLOOKUP(O131,対戦表!$AG:$AH,2,0)","v":0}]
[{"$f":"CONCATENATE(A125,4)","v":"L4"},{"$f":"VLOOKUP(A133,チーム表!C:D,2,FALSE)","v":"三馬パワフルファミリー"},null,null,{"$f":"IF(D134=\"\",\"\",IF(D134=F134,\"△\",IF(D134>F134,\"〇\",\"×\")))","v":"×"},null,null,{"$f":"IF(G134=\"\",\"\",IF(G134=I134,\"△\",IF(G134>I134,\"〇\",\"×\")))","v":"×"},null,null,{"$f":"IF(J134=\"\",\"\",IF(J134=L134,\"△\",IF(J134>L134,\"〇\",\"×\")))","v":"×"},{"$nulls":13},{"$f":"COUNTIF($E133:$N133,\"〇\")","v":0},{"$f":"COUNTIF($E133:$N133,\"×\")","v":3},{"$f":"COUNTIF($E133:$N133,\"△\")","v":0},{"$f":"Y133*2+AA133","v":0},{"$f":"IF(G134=\"\",\"\",D134+G134+M134+J134)","v":5},{"$f":"IF(AC133=\"\",\"\",AB133*100+AC133)","v":5},{"$f":"IF(AC133=\"\",\"\",F134+I134+L134+O134)","v":18},{"$f":"IF(AD133=\"\",\"\",RANK(AD133,AD127:AD134,0))","v":4},null,{"$f":"CONCATENATE(A125,AF133)","v":"L4"},{"$f":"B133","v":"三馬パワフルファミリー"}]
[{"$nulls":3},{"$f":"IF(O128=\"\",\"\",O128)","v":3},"-",{"$f":"IF(M128=\"\",\"\",M128)","v":5},{"$f":"IF(O130=\"\",\"\",O130)","v":2},"-",{"$f":"IF(M130=\"\",\"\",M130)","v":6},{"$f":"IF(O132=\"\",\"\",O132)","v":0},"-",{"$f":"IF(M132=\"\",\"\",M132)","v":7}]
[]
[{"$nulls":4},{"$f":"CONCATENATE(A137,\"1\")","v":"M1"},null,null,{"$f":"CONCATENATE(A137,\"2\")","v":"M2"},null,null,{"$f":"CONCATENATE(A137,\"3\")","v":"M3"},null,null,{"$f":"CONCATENATE(A137,\"4\")","v":"M4"}]
["M","チーム名",null,{"$f":"B139","v":"NISHIファミリーズ"},null,null,{"$f":"B141","v":"鳳至ファミリーズ"},null,null,{"$f":"B143","v":"テライFamily’＄"},null,null,{"$f":"B145","v":"鞍月ファミリーズ"},{"$nulls":11},"勝","負","分","点","内野","順位決定点","相手内野","順位","kaku"]
[]
[{"$f":"CONCATENATE(A137,1)","v":"M1"},{"$f":"VLOOKUP(A139,チーム表!C:D,2,FALSE)","v":"NISHIファミリーズ"},{"$nulls":4},{"$f":"CONCATENATE($A139,H136)","v":"M1M2"},{"$f":"IF(G140=\"\",\"\",IF(G140=I140,\"△\",IF(G140>I140,\"〇\",\"×\")))","v":"〇"},{"$f":"CONCATENATE(H136,$A139)","v":"M2M1"},{"$f":"CONCATENATE($A139,K136)","v":"M1M3"},{"$f":"IF(J140=\"\",\"\",IF(J140=L140,\"△\",IF(J140>L140,\"〇\",\"×\")))","v":"〇"},{"$f":"CONCATENATE(K136,$A139)","v":"M3M1"},{"$f":"CONCATENATE($A139,N136)","v":"M1M4"},{"$f":"IF(M140=\"\",\"\",IF(M140=O140,\"△\",IF(M140>O140,\"〇\",\"×\")))","v":"×"},{"$f":"CONCATENATE(N136,$A139)","v":"M4M1"},{"$nulls":9},{"$f":"COUNTIF($E139:$N139,\"〇\")","v":2},{"$f":"COUNTIF($E139:$N139,\"×\")","v":1},{"$f":"COUNTIF($E139:$N139,\"△\")","v":0},{"$f":"Y139*2+AA139","v":4},{"$f":"IF(G140=\"\",\"\",D140+G140+M140+J140)","v":7},{"$f":"IF(AC139=\"\",\"\",AB139*100+AC139)","v":407},{"$f":"IF(AC139=\"\",\"\",F140+I140+L140+O140)","v":8},{"$f":"IF(AD139=\"\",\"\",RANK(AD139,AD139:AD146,0))","v":2},null,{"$f":"CONCATENATE(A137,AF139)","v":"M2"},{"$f":"B139","v":"NISHIファミリーズ"}]
[{"$nulls":6},{"$f":"VLOOKUP(G139,対戦表!$AG:$AH,2,0)","v":3},"-",{"$f":"VLOOKUP(I139,対戦表!$AG:$AH,2,0)","v":0},{"$f":"VLOOKUP(J139,対戦表!$AG:$AH,2,0)","v":3},"-",{"$f":"VLOOKUP(L139,対戦表!$AG:$AH,2,0)","v":2},{"$f":"VLOOKUP(M139,対戦表!$AG:$AH,2,0)","v":1},"-",{"$f":"VLOOKUP(O139,対戦表!$AG:$AH,2,0)","v":6}]
[{"$f":"CONCATENATE(A137,2)","v":"M2"},{"$f":"VLOOKUP(A141,チーム表!C:D,2,FALSE)","v":"鳳至ファミリーズ"},null,null,{"$f":"IF(D142=\"\",\"\",IF(D142=F142,\"△\",IF(D142>F142,\"〇\",\"×\")))","v":"×"},{"$nulls":4},{"$f":"CONCATENATE($A141,K136)","v":"M2M3"},{"$f":"IF(J142=\"\",\"\",IF(J142=L142,\"△\",IF(J142>L142,\"〇\",\"×\")))","v":"〇"},{"$f":"CONCATENATE(K136,$A141)","v":"M3M2"},{"$f":"CONCATENATE($A141,N136)","v":"M2M4"},{"$f":"IF(M142=\"\",\"\",IF(M142=O142,\"△\",IF(M142>O142,\"〇\",\"×\")))","v":"×"},{"$f":"CONCATENATE(N136,$A141)","v":"M4M2"},{"$nulls":9},{"$f":"COUNTIF($E141:$N141,\"〇\")","v":1},{"$f":"COUNTIF($E141:$N141,\"×\")","v":2},{"$f":"COUNTIF($E141:$N141,\"△\")","v":0},{"$f":"Y141*2+AA141","v":2},{"$f":"IF(D142=\"\",\"\",D142+G142+M142+J142)","v":8},{"$f":"IF(AC141=\"\",\"\",AB141*100+AC141)","v":208},{"$f":"IF(AC141=\"\",\"\",F142+I142+L142+O142)","v":10},{"$f":"IF(AD141=\"\",\"\",RANK(AD141,AD139:AD146,0))","v":3},null,{"$f":"CONCATENATE(A137,AF141)","v":"M3"},{"$f":"B141","v":"鳳至ファミリーズ"}]
[{"$nulls":3},{"$f":"IF(I140=\"\",\"\",I140)","v":0},"-",{"$f":"IF(G140=\"\",\"\",G140)","v":3},{"$nulls":3},{"$f":"VLOOKUP(J141,対戦表!$AG:$AH,2,0)","v":5},"-",{"$f":"VLOOKUP(L141,対戦表!$AG:$AH,2,0)","v":1},{"$f":"VLOOKUP(M141,対戦表!$AG:$AH,2,0)","v":3},"-",{"$f":"VLOOKUP(O141,対戦表!$AG:$AH,2,0)","v":6}]
[{"$f":"CONCATENATE(A137,3)","v":"M3"},{"$f":"VLOOKUP(A143,チーム表!C:D,2,FALSE)","v":"テライFamily’＄"},null,null,{"$f":"IF(D144=\"\",\"\",IF(D144=F144,\"△\",IF(D144>F144,\"〇\",\"×\")))","v":"×"},null,null,{"$f":"IF(G144=\"\",\"\",IF(G144=I144,\"△\",IF(G144>I144,\"〇\",\"×\")))","v":"×"},{"$nulls":4},{"$f":"CONCATENATE($A143,N136)","v":"M3M4"},{"$f":"IF(M144=\"\",\"\",IF(M144=O144,\"△\",IF(M144>O144,\"〇\",\"×\")))","v":"×"},{"$f":"CONCATENATE(N136,$A143)","v":"M4M3"},{"$nulls":9},{"$f":"COUNTIF($E143:$N143,\"〇\")","v":0},{"$f":"COUNTIF($E143:$N143,\"×\")","v":3},{"$f":"COUNTIF($E143:$N143,\"△\")","v":0},{"$f":"Y143*2+AA143","v":0},{"$f":"IF(G144=\"\",\"\",D144+G144+M144+J144)","v":6},{"$f":"IF(AC143=\"\",\"\",AB143*100+AC143)","v":6},{"$f":"IF(AC143=\"\",\"\",F144+I144+L144+O144)","v":12},{"$f":"IF(AD143=\"\",\"\",RANK(AD143,AD139:AD146,0))","v":4},null,{"$f":"CONCATENATE(A137,AF143)","v":"M4"},{"$f":"B143","v":"テライFamily’＄"}]
[{"$nulls":3},{"$f":"IF(L140=\"\",\"\",L140)","v":2},"-",{"$f":"IF(J140=\"\",\"\",J140)","v":3},{"$f":"IF(L142=\"\",\"\",L142)","v":1},"-",{"$f":"IF(J142=\"\",\"\",J142)","v":5},{"$nulls":3},{"$f":"VLOOKUP(M143,対戦表!$AG:$AH,2,0)","v":3},"-",{"$f":"VLOOKUP(O143,対戦表!$AG:$AH,2,0)","v":4}]
[{"$f":"CONCATENATE(A137,4)","v":"M4"},{"$f":"VLOOKUP(A145,チーム表!C:D,2,FALSE)","v":"鞍月ファミリーズ"},null,null,{"$f":"IF(D146=\"\",\"\",IF(D146=F146,\"△\",IF(D146>F146,\"〇\",\"×\")))","v":"〇"},null,null,{"$f":"IF(G146=\"\",\"\",IF(G146=I146,\"△\",IF(G146>I146,\"〇\",\"×\")))","v":"〇"},null,null,{"$f":"IF(J146=\"\",\"\",IF(J146=L146,\"△\",IF(J146>L146,\"〇\",\"×\")))","v":"〇"},{"$nulls":13},{"$f":"COUNTIF($E145:$N145,\"〇\")","v":3},{"$f":"COUNTIF($E145:$N145,\"×\")","v":0},{"$f":"COUNTIF($E145:$N145,\"△\")","v":0},{"$f":"Y145*2+AA145","v":6},{"$f":"IF(G146=\"\",\"\",D146+G146+M146+J146)","v":16},{"$f":"IF(AC145=\"\",\"\",AB145*100+AC145)","v":616},{"$f":"IF(AC145=\"\",\"\",F146+I146+L146+O146)","v":7},{"$f":"IF(AD145=\"\",\"\",RANK(AD145,AD139:AD146,0))","v":1},null,{"$f":"CONCATENATE(A137,AF145)","v":"M1"},{"$f":"B145","v":"鞍月ファミリーズ"}]
[{"$nulls":3},{"$f":"IF(O140=\"\",\"\",O140)","v":6},"-",{"$f":"IF(M140=\"\",\"\",M140)","v":1},{"$f":"IF(O142=\"\",\"\",O142)","v":6},"-",{"$f":"IF(M142=\"\",\"\",M142)","v":3},{"$f":"IF(O144=\"\",\"\",O144)","v":4},"-",{"$f":"IF(M144=\"\",\"\",M144)","v":3}]
[null,"ミドル親子の部"]
[{"$nulls":4},{"$f":"CONCATENATE(A149,\"1\")","v":"N1"},null,null,{"$f":"CONCATENATE(A149,\"2\")","v":"N2"},null,null,{"$f":"CONCATENATE(A149,\"3\")","v":"N3"}]
["N","チーム名",null,{"$f":"B151","v":"田上闘球ミドル"},null,null,{"$f":"B153","v":"鳳至あまさんず"},null,null,{"$f":"B155","v":"松任の大魔陣ミドルファミリー"},{"$nulls":14},"勝","負","分","点","内野","順位決定点","相手内野","順位","kaku"]
[]
[{"$f":"CONCATENATE(A149,1)","v":"N1"},{"$f":"VLOOKUP(A151,チーム表!C:D,2,FALSE)","v":"田上闘球ミドル"},{"$nulls":4},{"$f":"CONCATENATE($A151,H148)","v":"N1N2"},{"$f":"IF(G152=\"\",\"\",IF(G152=I152,\"△\",IF(G152>I152,\"〇\",\"×\")))","v":"〇"},{"$f":"CONCATENATE(H148,$A151)","v":"N2N1"},{"$f":"CONCATENATE($A151,K148)","v":"N1N3"},{"$f":"IF(J152=\"\",\"\",IF(J152=L152,\"△\",IF(J152>L152,\"〇\",\"×\")))","v":"×"},{"$f":"CONCATENATE(K148,$A151)","v":"N3N1"},{"$nulls":12},{"$f":"COUNTIF($E151:$K151,\"〇\")","v":1},{"$f":"COUNTIF($E151:$K151,\"×\")","v":1},{"$f":"COUNTIF($E151:$W151,\"△\")","v":0},{"$f":"Y151*2+AA151","v":2},{"$f":"IF(G152=\"\",\"\",D152+G152+J152)","v":11},{"$f":"IF(AC151=\"\",\"\",AB151*100+AC151)","v":211},{"$f":"IF(AC151=\"\",\"\",F152+I152+L152)","v":5},{"$f":"IF(AD151=\"\",\"\",RANK(AD151,AD151:AD156,0))","v":2},null,{"$f":"CONCATENATE(A149,AF151)","v":"N2"},{"$f":"B151","v":"田上闘球ミドル"}]
[{"$nulls":6},{"$f":"VLOOKUP(G151,対戦表!$AG:$AH,2,0)","v":8},"-",{"$f":"VLOOKUP(I151,対戦表!$AG:$AH,2,0)","v":0},{"$f":"VLOOKUP(J151,対戦表!$AG:$AH,2,0)","v":3},"-",{"$f":"VLOOKUP(L151,対戦表!$AG:$AH,2,0)","v":5}]
[{"$f":"CONCATENATE(A149,2)","v":"N2"},{"$f":"VLOOKUP(A153,チーム表!C:D,2,FALSE)","v":"鳳至あまさんず"},null,null,{"$f":"IF(D154=\"\",\"\",IF(D154=F154,\"△\",IF(D154>F154,\"〇\",\"×\")))","v":"×"},{"$nulls":4},{"$f":"CONCATENATE($A153,K148)","v":"N2N3"},{"$f":"IF(J154=\"\",\"\",IF(J154=L154,\"△\",IF(J154>L154,\"〇\",\"×\")))","v":"×"},{"$f":"CONCATENATE(K148,$A153)","v":"N3N2"},{"$nulls":12},{"$f":"COUNTIF($E153:$K153,\"〇\")","v":0},{"$f":"COUNTIF($E153:$K153,\"×\")","v":2},{"$f":"COUNTIF($E153:$W153,\"△\")","v":0},{"$f":"Y153*2+AA153","v":0},{"$f":"IF(D154=\"\",\"\",D154+G154+J154)","v":2},{"$f":"IF(AC153=\"\",\"\",AB153*100+AC153)","v":2},{"$f":"IF(AC153=\"\",\"\",F154+I154+L154)","v":13},{"$f":"IF(AD153=\"\",\"\",RANK(AD153,AD151:AD156,0))","v":3},null,{"$f":"CONCATENATE(A149,AF153)","v":"N3"},{"$f":"B153","v":"鳳至あまさんず"}]
[{"$nulls":3},{"$f":"IF(I152=\"\",\"\",I152)","v":0},"-",{"$f":"IF(G152=\"\",\"\",G152)","v":8},{"$nulls":3},{"$f":"VLOOKUP(J153,対戦表!$AG:$AH,2,0)","v":2},"-",{"$f":"VLOOKUP(L153,対戦表!$AG:$AH,2,0)","v":5}]
[{"$f":"CONCATENATE(A149,3)","v":"N3"},{"$f":"VLOOKUP(A155,チーム表!C:D,2,FALSE)","v":"松任の大魔陣ミドルファミリー"},null,null,{"$f":"IF(D156=\"\",\"\",IF(D156=F156,\"△\",IF(D156>F156,\"〇\",\"×\")))","v":"〇"},null,null,{"$f":"IF(G156=\"\",\"\",IF(G156=I156,\"△\",IF(G156>I156,\"〇\",\"×\")))","v":"〇"},{"$nulls":16},{"$f":"COUNTIF($E155:$K155,\"〇\")","v":2},{"$f":"COUNTIF($E155:$K155,\"×\")","v":0},{"$f":"COUNTIF($E155:$W155,\"△\")","v":0},{"$f":"Y155*2+AA155","v":4},{"$f":"IF(G156=\"\",\"\",D156+G156+J156)","v":10},{"$f":"IF(AC155=\"\",\"\",AB155*100+AC155)","v":410},{"$f":"IF(AC155=\"\",\"\",F156+I156+L156)","v":5},{"$f":"IF(AD155=\"\",\"\",RANK(AD155,AD151:AD156,0))","v":1},null,{"$f":"CONCATENATE(A149,AF155)","v":"N1"},{"$f":"B155","v":"松任の大魔陣ミドルファミリー"}]
[{"$nulls":3},{"$f":"IF(L152=\"\",\"\",L152)","v":5},"-",{"$f":"IF(J152=\"\",\"\",J152)","v":3},{"$f":"IF(L154=\"\",\"\",L154)","v":5},"-",{"$f":"IF(J154=\"\",\"\",J154)","v":2}]
[]
[{"$nulls":4},{"$f":"CONCATENATE(A159,\"1\")","v":"O1"},null,null,{"$f":"CONCATENATE(A159,\"2\")","v":"O2"},null,null,{"$f":"CONCATENATE(A159,\"3\")","v":"O3"}]
["O","チーム名",null,{"$f":"B161","v":"宇出津っ子と優しいお母さん"},null,null,{"$f":"B163","v":"向本折ファミリー"},null,null,{"$f":"B165","v":"鞍月ミドルファミリーズ"},{"$nulls":14},"勝","負","分","点","内野","順位決定点","相手内野","順位","kaku"]
[]
[{"$f":"CONCATENATE(A159,1)","v":"O1"},{"$f":"VLOOKUP(A161,チーム表!C:D,2,FALSE)","v":"宇出津っ子と優しいお母さん"},{"$nulls":4},{"$f":"CONCATENATE($A161,H158)","v":"O1O2"},{"$f":"IF(G162=\"\",\"\",IF(G162=I162,\"△\",IF(G162>I162,\"〇\",\"×\")))","v":"×"},{"$f":"CONCATENATE(H158,$A161)","v":"O2O1"},{"$f":"CONCATENATE($A161,K158)","v":"O1O3"},{"$f":"IF(J162=\"\",\"\",IF(J162=L162,\"△\",IF(J162>L162,\"〇\",\"×\")))","v":"×"},{"$f":"CONCATENATE(K158,$A161)","v":"O3O1"},{"$nulls":12},{"$f":"COUNTIF($E161:$K161,\"〇\")","v":0},{"$f":"COUNTIF($E161:$K161,\"×\")","v":2},{"$f":"COUNTIF($E161:$W161,\"△\")","v":0},{"$f":"Y161*2+AA161","v":0},{"$f":"IF(G162=\"\",\"\",D162+G162+J162)","v":4},{"$f":"IF(AC161=\"\",\"\",AB161*100+AC161)","v":4},{"$f":"IF(AC161=\"\",\"\",F162+I162+L162)","v":12},{"$f":"IF(AD161=\"\",\"\",RANK(AD161,AD161:AD166,0))","v":3},null,{"$f":"CONCATENATE(A159,AF161)","v":"O3"},{"$f":"B161","v":"宇出津っ子と優しいお母さん"}]
[{"$nulls":6},{"$f":"VLOOKUP(G161,対戦表!$AG:$AH,2,0)","v":4},"-",{"$f":"VLOOKUP(I161,対戦表!$AG:$AH,2,0)","v":6},{"$f":"VLOOKUP(J161,対戦表!$AG:$AH,2,0)","v":0},"-",{"$f":"VLOOKUP(L161,対戦表!$AG:$AH,2,0)","v":6}]
[{"$f":"CONCATENATE(A159,2)","v":"O2"},{"$f":"VLOOKUP(A163,チーム表!C:D,2,FALSE)","v":"向本折ファミリー"},null,null,{"$f":"IF(D164=\"\",\"\",IF(D164=F164,\"△\",IF(D164>F164,\"〇\",\"×\")))","v":"〇"},{"$nulls":4},{"$f":"CONCATENATE($A163,K158)","v":"O2O3"},{"$f":"IF(J164=\"\",\"\",IF(J164=L164,\"△\",IF(J164>L164,\"〇\",\"×\")))","v":"×"},{"$f":"CONCATENATE(K158,$A163)","v":"O3O2"},{"$nulls":12},{"$f":"COUNTIF($E163:$K163,\"〇\")","v":1},{"$f":"COUNTIF($E163:$K163,\"×\")","v":1},{"$f":"COUNTIF($E163:$W163,\"△\")","v":0},{"$f":"Y163*2+AA163","v":2},{"$f":"IF(D164=\"\",\"\",D164+G164+J164)","v":8},{"$f":"IF(AC163=\"\",\"\",AB163*100+AC163)","v":208},{"$f":"IF(AC163=\"\",\"\",F164+I164+L164)","v":8},{"$f":"IF(AD163=\"\",\"\",RANK(AD163,AD161:AD166,0))","v":2},null,{"$f":"CONCATENATE(A159,AF163)","v":"O2"},{"$f":"B163","v":"向本折ファミリー"}]
[{"$nulls":3},{"$f":"IF(I162=\"\",\"\",I162)","v":6},"-",{"$f":"IF(G162=\"\",\"\",G162)","v":4},{"$nulls":3},{"$f":"VLOOKUP(J163,対戦表!$AG:$AH,2,0)","v":2},"-",{"$f":"VLOOKUP(L163,対戦表!$AG:$AH,2,0)","v":4}]
[{"$f":"CONCATENATE(A159,3)","v":"O3"},{"$f":"VLOOKUP(A165,チーム表!C:D,2,FALSE)","v":"鞍月ミドルファミリーズ"},null,null,{"$f":"IF(D166=\"\",\"\",IF(D166=F166,\"△\",IF(D166>F166,\"〇\",\"×\")))","v":"〇"},null,null,{"$f":"IF(G166=\"\",\"\",IF(G166=I166,\"△\",IF(G166>I166,\"〇\",\"×\")))","v":"〇"},{"$nulls":16},{"$f":"COUNTIF($E165:$K165,\"〇\")","v":2},{"$f":"COUNTIF($E165:$K165,\"×\")","v":0},{"$f":"COUNTIF($E165:$W165,\"△\")","v":0},{"$f":"Y165*2+AA165","v":4},{"$f":"IF(G166=\"\",\"\",D166+G166+J166)","v":10},{"$f":"IF(AC165=\"\",\"\",AB165*100+AC165)","v":410},{"$f":"IF(AC165=\"\",\"\",F166+I166+L166)","v":2},{"$f":"IF(AD165=\"\",\"\",RANK(AD165,AD161:AD166,0))","v":1},null,{"$f":"CONCATENATE(A159,AF165)","v":"O1"},{"$f":"B165","v":"鞍月ミドルファミリーズ"}]
[{"$nulls":3},{"$f":"IF(L162=\"\",\"\",L162)","v":6},"-",{"$f":"IF(J162=\"\",\"\",J162)","v":0},{"$f":"IF(L164=\"\",\"\",L164)","v":4},"-",{"$f":"IF(J164=\"\",\"\",J164)","v":2}]
[]
[{"$nulls":4},{"$f":"CONCATENATE(A169,\"1\")","v":"P1"},null,null,{"$f":"CONCATENATE(A169,\"2\")","v":"P2"},null,null,{"$f":"CONCATENATE(A169,\"3\")","v":"P3"}]
["P","チーム名",null,{"$f":"B171","v":"千坂ゼブラーズG"},null,null,{"$f":"B173","v":"小木クLOVE♡楽球会"},null,null,{"$f":"B175","v":"Ｊ－テライｆａｍｉｌｙ’＄"},{"$nulls":14},"勝","負","分","点","内野","順位決定点","相手内野","順位","kaku"]
[]
[{"$f":"CONCATENATE(A169,1)","v":"P1"},{"$f":"VLOOKUP(A171,チーム表!C:D,2,FALSE)","v":"千坂ゼブラーズG"},{"$nulls":4},{"$f":"CONCATENATE($A171,H168)","v":"P1P2"},{"$f":"IF(G172=\"\",\"\",IF(G172=I172,\"△\",IF(G172>I172,\"〇\",\"×\")))","v":"×"},{"$f":"CONCATENATE(H168,$A171)","v":"P2P1"},{"$f":"CONCATENATE($A171,K168)","v":"P1P3"},{"$f":"IF(J172=\"\",\"\",IF(J172=L172,\"△\",IF(J172>L172,\"〇\",\"×\")))","v":"×"},{"$f":"CONCATENATE(K168,$A171)","v":"P3P1"},{"$nulls":12},{"$f":"COUNTIF($E171:$K171,\"〇\")","v":0},{"$f":"COUNTIF($E171:$K171,\"×\")","v":2},{"$f":"COUNTIF($E171:$W171,\"△\")","v":0},{"$f":"Y171*2+AA171","v":0},{"$f":"IF(G172=\"\",\"\",D172+G172+J172)","v":7},{"$f":"IF(AC171=\"\",\"\",AB171*100+AC171)","v":7},{"$f":"IF(AC171=\"\",\"\",F172+I172+L172)","v":12},{"$f":"IF(AD171=\"\",\"\",RANK(AD171,AD171:AD176,0))","v":3},null,{"$f":"CONCATENATE(A169,AF171)","v":"P3"},{"$f":"B171","v":"千坂ゼブラーズG"}]
[{"$nulls":6},{"$f":"VLOOKUP(G171,対戦表!$AG:$AH,2,0)","v":5},"-",{"$f":"VLOOKUP(I171,対戦表!$AG:$AH,2,0)","v":6},{"$f":"VLOOKUP(J171,対戦表!$AG:$AH,2,0)","v":2},"-",{"$f":"VLOOKUP(L171,対戦表!$AG:$AH,2,0)","v":6}]
[{"$f":"CONCATENATE(A169,2)","v":"P2"},{"$f":"VLOOKUP(A173,チーム表!C:D,2,FALSE)","v":"小木クLOVE♡楽球会"},null,null,{"$f":"IF(D174=\"\",\"\",IF(D174=F174,\"△\",IF(D174>F174,\"〇\",\"×\")))","v":"〇"},{"$nulls":4},{"$f":"CONCATENATE($A173,K168)","v":"P2P3"},{"$f":"IF(J174=\"\",\"\",IF(J174=L174,\"△\",IF(J174>L174,\"〇\",\"×\")))","v":"〇"},{"$f":"CONCATENATE(K168,$A173)","v":"P3P2"},{"$nulls":12},{"$f":"COUNTIF($E173:$K173,\"〇\")","v":2},{"$f":"COUNTIF($E173:$K173,\"×\")","v":0},{"$f":"COUNTIF($E173:$W173,\"△\")","v":0},{"$f":"Y173*2+AA173","v":4},{"$f":"IF(D174=\"\",\"\",D174+G174+J174)","v":14},{"$f":"IF(AC173=\"\",\"\",AB173*100+AC173)","v":414},{"$f":"IF(AC173=\"\",\"\",F174+I174+L174)","v":5},{"$f":"IF(AD173=\"\",\"\",RANK(AD173,AD171:AD176,0))","v":1},null,{"$f":"CONCATENATE(A169,AF173)","v":"P1"},{"$f":"B173","v":"小木クLOVE♡楽球会"}]
[{"$nulls":3},{"$f":"IF(I172=\"\",\"\",I172)","v":6},"-",{"$f":"IF(G172=\"\",\"\",G172)","v":5},{"$nulls":3},{"$f":"VLOOKUP(J173,対戦表!$AG:$AH,2,0)","v":8},"-",{"$f":"VLOOKUP(L173,対戦表!$AG:$AH,2,0)","v":0}]
[{"$f":"CONCATENATE(A169,3)","v":"P3"},{"$f":"VLOOKUP(A175,チーム表!C:D,2,FALSE)","v":"Ｊ－テライｆａｍｉｌｙ’＄"},null,null,{"$f":"IF(D176=\"\",\"\",IF(D176=F176,\"△\",IF(D176>F176,\"〇\",\"×\")))","v":"〇"},null,null,{"$f":"IF(G176=\"\",\"\",IF(G176=I176,\"△\",IF(G176>I176,\"〇\",\"×\")))","v":"×"},{"$nulls":16},{"$f":"COUNTIF($E175:$K175,\"〇\")","v":1},{"$f":"COUNTIF($E175:$K175,\"×\")","v":1},{"$f":"COUNTIF($E175:$W175,\"△\")","v":0},{"$f":"Y175*2+AA175","v":2},{"$f":"IF(G176=\"\",\"\",D176+G176+J176)","v":6},{"$f":"IF(AC175=\"\",\"\",AB175*100+AC175)","v":206},{"$f":"IF(AC175=\"\",\"\",F176+I176+L176)","v":10},{"$f":"IF(AD175=\"\",\"\",RANK(AD175,AD171:AD176,0))","v":2},null,{"$f":"CONCATENATE(A169,AF175)","v":"P2"},{"$f":"B175","v":"Ｊ－テライｆａｍｉｌｙ’＄"}]
[{"$nulls":3},{"$f":"IF(L172=\"\",\"\",L172)","v":6},"-",{"$f":"IF(J172=\"\",\"\",J172)","v":2},{"$f":"IF(L174=\"\",\"\",L174)","v":0},"-",{"$f":"IF(J174=\"\",\"\",J174)","v":8}]

{"sheet":"トーナメント表","index":3,"n_rows":137,"n_cols":23,"rows_kept":137,"merged":[[4,0,5,0],[4,1,5,9],[8,0,9,0],[8,1,9,9],[9,19,12,19],[10,20,12,26],[12,0,13,0],[12,1,13,9],[16,0,17,0],[16,1,17,9],[19,9,20,17],[21,18,22,19],[23,9,24,17],[31,0,32,0],[31,1,32,9],[33,19,36,19],[34,20,35,25],[35,0,36,0],[35,1,36,9],[37,11,38,12],[39,0,40,0],[39,1,40,9],[42,19,42,20],[53,0,54,0],[53,1,54,9],[57,0,58,0],[57,1,58,9],[61,0,62,0],[61,1,62,9],[62,19,65,19],[63,20,65,26],[65,0,66,0],[65,1,66,9],[69,0,70,0],[69,1,70,9],[73,0,74,0],[73,1,74,9],[76,9,77,17],[77,21,80,21],[80,9,81,17],[86,0,87,0],[86,1,87,9],[90,0,91,0],[90,1,91,9],[91,18,94,18],[92,19,94,26],[94,0,95,0],[94,1,95,9],[98,0,99,0],[98,1,99,9],[105,0,106,0],[105,1,106,9],[109,0,110,0],[109,1,110,9],[113,0,114,0],[113,1,114,9],[114,19,117,19],[115,20,117,26],[117,0,118,0],[117,1,118,9],[121,0,122,0],[121,1,122,9],[125,0,126,0],[125,1,126,9],[130,7,131,8],[130,9,131,14],[135,7,136,8],[135,9,136,14]]}
[null,"決勝トーナメント　小学生の部"]
[]
[null,null,"決勝戦は１セットマッチとする"]
[null,"A1"]
["A1位",{"$f":"VLOOKUP(B4,リーグ戦表!AH:AI,2,0)","v":"下関福光サンダージュニア"},{"$nulls":8},10]
[]
[{"$nulls":11},"Ａ⑩",{"$nulls":3},10]
[null,"C1"]
["C１位",{"$f":"VLOOKUP(B8,リーグ戦表!AH:AI,2,0)","v":"千坂ドッジファイヤーズ"}]
[{"$nulls":10},4,{"$nulls":8},"優勝"]
[{"$nulls":14},"Ａ⑪",{"$nulls":5},"下関福光サンダージュニア"]
[null,"B1"]
["B１位",{"$f":"VLOOKUP(B12,リーグ戦表!AH:AI,2,0)","v":"杉っ子ドッジファイターズ"},{"$nulls":8},10]
[]
[{"$nulls":11},"Ｂ⑩"]
[null,"D1",{"$nulls":13},8,{"$nulls":4},"杉っ子ドッジファイターズ"]
["D１位",{"$f":"VLOOKUP(B16,リーグ戦表!AH:AI,2,0)","v":"山中SPARS"}]
[{"$nulls":10},5]
[]
[{"$nulls":9},"千坂ドッジファイヤーズ",{"$nulls":8},10]
[{"$nulls":21},"3位"]
[{"$nulls":18},"Ｂ⑪"]
[{"$nulls":21},"千坂ドッジファイヤーズ"]
[{"$nulls":9},"山中SPARS"]
[{"$nulls":18},8]
[]
[]
[null,"決勝トーナメント　ジュニア・キッズの部"]
[]
[null,null,"決勝戦は１セットマッチとする",{"$nulls":11},"※","１位は抽選とする"]
[null,"F1"]
["1位",{"$f":"VLOOKUP(B31,リーグ戦表!AH:AI,2,0)","v":"向本折クラブNew"},{"$nulls":13},1]
[]
[{"$nulls":19},"優勝"]
[null,"G1",{"$nulls":12},"B②",{"$nulls":5},"松任の大魔陣Jr"]
["1位",{"$f":"VLOOKUP(B35,リーグ戦表!AH:AI,2,0)","v":"松任の大魔陣Jr"},{"$nulls":8},4]
[]
[{"$nulls":11},"B①"]
[null,"E1",{"$nulls":13},4,{"$nulls":3},"準優勝"]
["1位",{"$f":"VLOOKUP(B39,リーグ戦表!AH:AI,2,0)","v":"千坂ロータスルート"}]
[{"$nulls":10},2,{"$nulls":9},"向本折クラブNew"]
[]
[{"$nulls":19},"3位"]
[]
[{"$nulls":20},"千坂ロータスルート"]
[]
[]
[]
[]
[null,"決勝トーナメント　一般の部"]
[]
[null,null,"決勝戦は１セットマッチとする"]
[null,"H1"]
["H１位",{"$f":"VLOOKUP(B53,リーグ戦表!AH:AI,2,0)","v":"THUNDER(ｻﾝﾀﾞｰ)"},{"$nulls":11},7]
[]
[]
[null,"H3",{"$nulls":10},"A③",{"$nulls":3},5]
["H３位",{"$f":"VLOOKUP(B57,リーグ戦表!AH:AI,2,0)","v":"ＳＫＩＰＰＥＲＳ"},{"$nulls":8},5]
[]
[{"$nulls":10},"A①"]
[null,"I2",{"$nulls":11},0]
["I２位",{"$f":"VLOOKUP(B61,リーグ戦表!AH:AI,2,0)","v":"ペヤング"}]
[{"$nulls":10},3,{"$nulls":8},"優勝"]
[{"$nulls":15},"Ａ④",{"$nulls":4},"THUNDER(ｻﾝﾀﾞｰ)"]
[null,"H2"]
["H２位",{"$f":"VLOOKUP(B65,リーグ戦表!AH:AI,2,0)","v":"山中SPAーS"},{"$nulls":8},4]
[]
[{"$nulls":10},"A②",null,null,4,{"$nulls":5},"準優勝"]
[null,"I3"]
["I３位",{"$f":"VLOOKUP(B69,リーグ戦表!AH:AI,2,0)","v":"鞍月アタッカーズＯＮＥ"},{"$nulls":18},"鞍月アタッカーズＯＮＥ"]
[{"$nulls":10},5,null,"Ｂ③"]
[{"$nulls":16},2]
[null,"I1"]
["I１位",{"$f":"VLOOKUP(B73,リーグ戦表!AH:AI,2,0)","v":"新撰組"}]
[{"$nulls":13},3]
[]
[{"$nulls":9},"ＳＫＩＰＰＥＲＳ",{"$nulls":9},6]
[{"$nulls":21},"3位"]
[{"$nulls":18},"Ｂ④"]
[{"$nulls":22},"ＳＫＩＰＰＥＲＳ"]
[{"$nulls":9},"新撰組"]
[{"$nulls":19},0]
[]
[]
[null,"決勝トーナメント　親子の部"]
[null,"L1"]
["L１位",{"$f":"VLOOKUP(B86,リーグ戦表!AH:AI,2,0)","v":"松任の大魔陣ファミリー"},{"$nulls":10},5,"6S"]
[]
[{"$nulls":11},"Ａ⑤",{"$nulls":3},5,"5S"]
[null,"M2"]
["M２位",{"$f":"VLOOKUP(B90,リーグ戦表!AH:AI,2,0)","v":"NISHIファミリーズ"}]
[{"$nulls":12},5,"4S",{"$nulls":4},"優勝"]
[{"$nulls":14},"Ａ⑥",{"$nulls":4},"松任の大魔陣ファミリー"]
[null,"L2"]
["L２位",{"$f":"VLOOKUP(B94,リーグ戦表!AH:AI,2,0)","v":"田上闘球親子"},{"$nulls":8},4]
[{"$nulls":19},"準優勝"]
[{"$nulls":11},"B⑤",{"$nulls":7},"田上闘球親子"]
[null,"M1",{"$nulls":13},5,"4S"]
["M１位",{"$f":"VLOOKUP(B98,リーグ戦表!AH:AI,2,0)","v":"鞍月ファミリーズ"}]
[{"$nulls":10},3,{"$nulls":7},"3位","NISHIファミリーズ"]
[]
[{"$nulls":18},"3位","鞍月ファミリーズ"]
[null,"決勝トーナメント　ミドル親子の部",{"$nulls":12},"※","１位は抽選とする"]
[]
[null,"O1"]
["１位",{"$f":"VLOOKUP(B105,リーグ戦表!AH:AI,2,0)","v":"鞍月ミドルファミリーズ"},{"$nulls":11},7]
[]
[]
[null,"P2",{"$nulls":10},"Ａ⑧",{"$nulls":3},0]
["P２位",{"$f":"VLOOKUP(B109,リーグ戦表!AH:AI,2,0)","v":"Ｊ－テライｆａｍｉｌｙ’＄"},{"$nulls":8},0]
[]
[{"$nulls":10},"A⑦"]
[null,"N1",{"$nulls":11},3]
["１位",{"$f":"VLOOKUP(B113,リーグ戦表!AH:AI,2,0)","v":"松任の大魔陣ミドルファミリー"}]
[{"$nulls":10},7,{"$nulls":8},"優勝"]
[{"$nulls":15},"Ｂ⑨",{"$nulls":4},"向本折ファミリー"]
[null,"N2"]
["N２位",{"$f":"VLOOKUP(B117,リーグ戦表!AH:AI,2,0)","v":"田上闘球ミドル"},{"$nulls":8},2]
[]
[{"$nulls":10},"Ｂ⑦",null,null,7,{"$nulls":5},"準優勝"]
[null,"O2"]
["O２位",{"$f":"VLOOKUP(B121,リーグ戦表!AH:AI,2,0)","v":"向本折ファミリー"},{"$nulls":18},"鞍月ミドルファミリーズ"]
[{"$nulls":10},3,null,"Ｂ⑧"]
[{"$nulls":16},6]
[null,"P1"]
["１位",{"$f":"VLOOKUP(B125,リーグ戦表!AH:AI,2,0)","v":"小木クLOVE♡楽球会"},{"$nulls":15},"3位","松任の大魔陣ミドルファミリー"]
[{"$nulls":13},1]
[{"$nulls":17},"3位","小木クLOVE♡楽球会"]
[]
[]
[{"$nulls":7},"優勝",null,"杉っ子ダディー"]
[null,"パパさんの部"]
[]
[]
[]
[{"$nulls":7},"優勝",null,"鞍月マミ～ズ"]
[null,"ママさんの部"]

{"sheet":"表彰状","index":4,"n_rows":0,"n_cols":0,"rows_kept":0}

{"sheet":"DATA","index":5,"n_rows":40,"n_cols":38,"rows_kept":40,"merged":[[4,0,5,0],[4,1,5,2],[4,3,5,5],[4,6,5,8],[4,9,5,11],[4,12,5,14],[4,15,5,17],[4,18,5,20],[4,21,5,23],[4,24,5,24],[4,25,5,25],[4,26,5,26],[4,27,5,27],[4,28,5,28],[4,29,5,29],[4,30,5,30],[4,31,5,31],[4,32,5,32],[6,0,7,0],[6,1,7,2],[6,3,7,5],[6,24,7,24],[6,25,7,25],[6,26,7,26],[6,27,7,27],[6,28,7,28],[6,29,7,29],[6,30,7,30],[6,31,7,31],[6,32,7,32],[8,0,9,0],[8,1,9,2],[8,6,9,8],[8,24,9,24],[8,25,9,25],[8,26,9,26],[8,27,9,27],[8,28,9,28],[8,29,9,29],[8,30,9,30],[8,31,9,31],[8,32,9,32],[10,0,11,0],[10,1,11,2],[10,9,11,11],[10,24,11,24],[10,25,11,25],[10,26,11,26],[10,27,11,27],[10,28,11,28],[10,29,11,29],[10,30,11,30],[10,31,11,31],[10,32,11,32],[12,0,13,0],[12,1,13,2],[12,12,13,14],[12,24,13,24],[12,25,13,25],[12,26,13,26],[12,27,13,27],[12,28,13,28],[12,29,13,29],[12,30,13,30],[12,31,13,31],[12,32,13,32],[14,0,15,0],[14,1,15,2],[14,15,15,17],[14,24,15,24],[14,25,15,25],[14,26,15,26],[14,27,15,27],[14,28,15,28],[14,29,15,29],[14,30,15,30],[14,31,15,31],[14,32,15,32],[16,0,17,0],[16,1,17,2],[16,18,17,20],[16,24,17,24],[16,25,17,25],[16,26,17,26],[16,27,17,27],[16,28,17,28],[16,29,17,29],[16,30,17,30],[16,31,17,31],[16,32,17,32],[18,0,19,0],[18,1,19,2],[18,21,19,23],[18,24,19,24],[18,25,19,25],[18,26,19,26],[18,27,19,27],[18,28,19,28],[18,29,19,29],[18,30,19,30],[18,31,19,31],[18,32,19,32],[23,0,24,0],[23,1,24,2],[23,3,24,5],[23,6,24,8],[23,9,24,11],[23,12,24,14],[23,15,24,17],[23,18,24,20],[23,21,24,23],[23,24,24,24],[23,25,24,25],[23,26,24,26],[23,27,24,27],[23,28,24,28],[23,29,24,29],[23,30,24,30],[23,31,24,31],[23,32,24,32],[25,0,26,0],[25,1,26,2],[25,3,26,5],[25,24,26,24],[25,25,26,25],[25,26,26,26],[25,27,26,27],[25,28,26,28],[25,29,26,29],[25,30,26,30],[25,31,26,31],[25,32,26,32],[27,0,28,0],[27,1,28,2],[27,6,28,8],[27,24,28,24],[27,25,28,25],[27,26,28,26],[27,27,28,27],[27,28,28,28],[27,29,28,29],[27,30,28,30],[27,31,28,31],[27,32,28,32],[29,0,30,0],[29,1,30,2],[29,9,30,11],[29,24,30,24],[29,25,30,25],[29,26,30,26],[29,27,30,27],[29,28,30,28],[29,29,30,29],[29,30,30,30],[29,31,30,31],[29,32,30,32],[31,0,32,0],[31,1,32,2],[31,12,32,14],[31,24,32,24],[31,25,32,25],[31,26,32,26],[31,27,32,27],[31,28,32,28],[31,29,32,29],[31,30,32,30],[31,31,32,31],[31,32,32,32],[33,0,34,0],[33,1,34,2],[33,15,34,17],[33,24,34,24],[33,25,34,25],[33,26,34,26],[33,27,34,27],[33,28,34,28],[33,29,34,29],[33,30,34,30],[33,31,34,31],[33,32,34,32],[35,0,36,0],[35,1,36,2],[35,18,36,20],[35,24,36,24],[35,25,36,25],[35,26,36,26],[35,27,36,27],[35,28,36,28],[35,29,36,29],[35,30,36,30],[35,31,36,31],[35,32,36,32]]}
[]
[]
[]
[{"$nulls":4},{"$f":"CONCATENATE(A5,\"1\")","v":"1"},null,null,{"$f":"CONCATENATE(A5,\"2\")","v":"2"},null,null,{"$f":"CONCATENATE(A5,\"3\")","v":"3"},null,null,{"$f":"CONCATENATE(A5,\"4\")","v":"4"},null,null,{"$f":"CONCATENATE(A5,\"5\")","v":"5"},null,null,{"$f":"CONCATENATE(A5,\"6\")","v":"6"},null,null,{"$f":"CONCATENATE(A5,\"7\")","v":"7"}]
[null,"チーム名",null,{"$f":"B7","v":{"$error":"#N/A"}},null,null,{"$f":"B9","v":{"$error":"#N/A"}},null,null,{"$f":"B11","v":{"$error":"#N/A"}},null,null,{"$f":"B13","v":{"$error":"#N/A"}},null,null,{"$f":"B15","v":{"$error":"#N/A"}},null,null,{"$f":"B17","v":{"$error":"#N/A"}},null,null,{"$f":"B19","v":{"$error":"#N/A"}},null,null,"勝","負","分","点","内野","順位決定点","相手内野","順位","kaku"]
[]
[{"$f":"CONCATENATE(A5,1)","v":"1"},{"$f":"VLOOKUP(A7,チーム表!C:D,2,FALSE)","v":{"$error":"#N/A"}},{"$nulls":4},{"$f":"CONCATENATE($A7,H4)","v":"12"},{"$f":"IF(G8=\"\",\"\",IF(G8=I8,\"△\",IF(G8>I8,\"〇\",\"×\")))","v":{"$error":"#N/A"}},{"$f":"CONCATENATE(H4,$A7)","v":"21"},{"$f":"CONCATENATE($A7,K4)","v":"13"},{"$f":"IF(J8=\"\",\"\",IF(J8=L8,\"△\",IF(J8>L8,\"〇\",\"×\")))","v":{"$error":"#N/A"}},{"$f":"CONCATENATE(K4,$A7)","v":"31"},{"$f":"CONCATENATE($A7,N4)","v":"14"},{"$f":"IF(M8=\"\",\"\",IF(M8=O8,\"△\",IF(M8>O8,\"〇\",\"×\")))","v":{"$error":"#N/A"}},{"$f":"CONCATENATE(N4,$A7)","v":"41"},{"$f":"CONCATENATE($A7,Q4)","v":"15"},{"$f":"IF(P8=\"\",\"\",IF(P8=R8,\"△\",IF(P8>R8,\"〇\",\"×\")))","v":{"$error":"#N/A"}},{"$f":"CONCATENATE(Q4,$A7)","v":"51"},{"$f":"CONCATENATE($A7,T4)","v":"16"},{"$f":"IF(S8=\"\",\"\",IF(S8=U8,\"△\",IF(S8>U8,\"〇\",\"×\")))","v":{"$error":"#N/A"}},{"$f":"CONCATENATE(T4,$A7)","v":"61"},{"$f":"CONCATENATE($A7,W4)","v":"17"},{"$f":"IF(V8=\"\",\"\",IF(V8=X8,\"△\",IF(V8>X8,\"〇\",\"×\")))","v":{"$error":"#N/A"}},{"$f":"CONCATENATE(W4,$A7)","v":"71"},{"$f":"COUNTIF($E7:$W7,\"〇\")","v":0},{"$f":"COUNTIF($E7:$W7,\"×\")","v":0},{"$f":"COUNTIF($E7:$W7,\"△\")","v":0},{"$f":"Y7*2+AA7","v":0},{"$f":"IF(G8=\"\",\"\",D8+G8+M8+P8+J8+S8+V8)","v":{"$error":"#N/A"}},{"$f":"IF(AC7=\"\",\"\",AB7*100+AC7)","v":{"$error":"#N/A"}},{"$f":"IF(AC7=\"\",\"\",F8+I8+L8+O8+R8+U8+X8)","v":{"$error":"#N/A"}},{"$f":"IF(AD7=\"\",\"\",RANK(AD7,AD7:AD20,0))","v":{"$error":"#N/A"}},null,{"$f":"CONCATENATE(A5,AF7)","v":{"$error":"#N/A"}},{"$f":"B7","v":{"$error":"#N/A"}},null,{"$f":"CONCATENATE(A$5,AF7)","v":{"$error":"#N/A"}},{"$f":"$B7","v":{"$error":"#N/A"}}]
[{"$nulls":6},{"$f":"VLOOKUP(G7,対戦表!$AG:$AH,2,0)","v":{"$error":"#N/A"}},"-",{"$f":"VLOOKUP(I7,対戦表!$AG:$AH,2,0)","v":{"$error":"#N/A"}},{"$f":"VLOOKUP(J7,対戦表!$AG:$AH,2,0)","v":{"$error":"#N/A"}},"-",{"$f":"VLOOKUP(L7,対戦表!$AG:$AH,2,0)","v":{"$error":"#N/A"}},{"$f":"VLOOKUP(M7,対戦表!$AG:$AH,2,0)","v":{"$error":"#N/A"}},"-",{"$f":"VLOOKUP(O7,対戦表!$AG:$AH,2,0)","v":{"$error":"#N/A"}},{"$f":"VLOOKUP(P7,対戦表!$AG:$AH,2,0)","v":{"$error":"#N/A"}},"-",{"$f":"VLOOKUP(R7,対戦表!$AG:$AH,2,0)","v":{"$error":"#N/A"}},{"$f":"VLOOKUP(S7,対戦表!$AG:$AH,2,0)","v":{"$error":"#N/A"}},"-",{"$f":"VLOOKUP(U7,対戦表!$AG:$AH,2,0)","v":{"$error":"#N/A"}},{"$f":"VLOOKUP(V7,対戦表!$AG:$AH,2,0)","v":{"$error":"#N/A"}},"-",{"$f":"VLOOKUP(X7,対戦表!$AG:$AH,2,0)","v":{"$error":"#N/A"}},{"$nulls":12},{"$f":"CONCATENATE(A$5,AF8)","v":""},{"$f":"$B8","v":0}]
[{"$f":"CONCATENATE(A5,2)","v":"2"},{"$f":"VLOOKUP(A9,チーム表!C:D,2,FALSE)","v":{"$error":"#N/A"}},null,null,{"$f":"IF(D10=\"\",\"\",IF(D10=F10,\"△\",IF(D10>F10,\"〇\",\"×\")))","v":{"$error":"#N/A"}},{"$nulls":4},{"$f":"CONCATENATE($A9,K4)","v":"23"},{"$f":"IF(J10=\"\",\"\",IF(J10=L10,\"△\",IF(J10>L10,\"〇\",\"×\")))","v":{"$error":"#N/A"}},{"$f":"CONCATENATE(K4,$A9)","v":"32"},{"$f":"CONCATENATE($A9,N4)","v":"24"},{"$f":"IF(M10=\"\",\"\",IF(M10=O10,\"△\",IF(M10>O10,\"〇\",\"×\")))","v":{"$error":"#N/A"}},{"$f":"CONCATENATE(N4,$A9)","v":"42"},{"$f":"CONCATENATE($A9,Q4)","v":"25"},{"$f":"IF(P10=\"\",\"\",IF(P10=R10,\"△\",IF(P10>R10,\"〇\",\"×\")))","v":{"$error":"#N/A"}},{"$f":"CONCATENATE(Q4,$A9)","v":"52"},{"$f":"CONCATENATE($A9,T4)","v":"26"},{"$f":"IF(S10=\"\",\"\",IF(S10=U10,\"△\",IF(S10>U10,\"〇\",\"×\")))","v":{"$error":"#N/A"}},{"$f":"CONCATENATE(T4,$A9)","v":"62"},{"$f":"CONCATENATE($A9,W4)","v":"27"},{"$f":"IF(V10=\"\",\"\",IF(V10=X10,\"△\",IF(V10>X10,\"〇\",\"×\")))","v":{"$error":"#N/A"}},{"$f":"CONCATENATE(W4,$A9)","v":"72"},{"$f":"COUNTIF($E9:$W9,\"〇\")","v":0},{"$f":"COUNTIF($E9:$W9,\"×\")","v":0},{"$f":"COUNTIF($E9:$W9,\"△\")","v":0},{"$f":"Y9*2+AA9","v":0},{"$f":"IF(D10=\"\",\"\",D10+G10+M10+P10+J10+S10+V10)","v":{"$error":"#N/A"}},{"$f":"IF(AC9=\"\",\"\",AB9*100+AC9)","v":{"$error":"#N/A"}},{"$f":"IF(AC9=\"\",\"\",F10+I10+L10+O10+R10+U10+X10)","v":{"$error":"#N/A"}},{"$f":"IF(AD9=\"\",\"\",RANK(AD9,AD7:AD20,0))","v":{"$error":"#N/A"}},null,{"$f":"CONCATENATE(A5,AF9)","v":{"$error":"#N/A"}},{"$f":"B9","v":{"$error":"#N/A"}},null,{"$error":"#N/A"},{"$error":"#N/A"}]
[{"$nulls":3},{"$f":"IF(I8=\"\",\"\",I8)","v":{"$error":"#N/A"}},"-",{"$f":"IF(G8=\"\",\"\",G8)","v":{"$error":"#N/A"}},{"$nulls":3},{"$f":"VLOOKUP(J9,対戦表!$AG:$AH,2,0)","v":{"$error":"#N/A"}},"-",{"$f":"VLOOKUP(L9,対戦表!$AG:$AH,2,0)","v":{"$error":"#N/A"}},{"$f":"VLOOKUP(M9,対戦表!$AG:$AH,2,0)","v":{"$error":"#N/A"}},"-",{"$f":"VLOOKUP(O9,対戦表!$AG:$AH,2,0)","v":{"$error":"#N/A"}},{"$f":"VLOOKUP(P9,対戦表!$AG:$AH,2,0)","v":{"$error":"#N/A"}},"-",{"$f":"VLOOKUP(R9,対戦表!$AG:$AH,2,0)","v":{"$error":"#N/A"}},{"$f":"VLOOKUP(S9,対戦表!$AG:$AH,2,0)","v":{"$error":"#N/A"}},"-",{"$f":"VLOOKUP(U9,対戦表!$AG:$AH,2,0)","v":{"$error":"#N/A"}},{"$f":"VLOOKUP(V9,対戦表!$AG:$AH,2,0)","v":{"$error":"#N/A"}},"-",{"$f":"VLOOKUP(X9,対戦表!$AG:$AH,2,0)","v":{"$error":"#N/A"}},{"$nulls":12},"",0]
[{"$f":"CONCATENATE(A5,3)","v":"3"},{"$f":"VLOOKUP(A11,チーム表!C:D,2,FALSE)","v":{"$error":"#N/A"}},null,null,{"$f":"IF(D12=\"\",\"\",IF(D12=F12,\"△\",IF(D12>F12,\"〇\",\"×\")))","v":{"$error":"#N/A"}},null,null,{"$f":"IF(G12=\"\",\"\",IF(G12=I12,\"△\",IF(G12>I12,\"〇\",\"×\")))","v":{"$error":"#N/A"}},{"$nulls":4},{"$f":"CONCATENATE($A11,N4)","v":"34"},{"$f":"IF(M12=\"\",\"\",IF(M12=O12,\"△\",IF(M12>O12,\"〇\",\"×\")))","v":{"$error":"#N/A"}},{"$f":"CONCATENATE(N4,$A11)","v":"43"},{"$f":"CONCATENATE($A11,Q4)","v":"35"},{"$f":"IF(P12=\"\",\"\",IF(P12=R12,\"△\",IF(P12>R12,\"〇\",\"×\")))","v":{"$error":"#N/A"}},{"$f":"CONCATENATE(Q4,$A11)","v":"53"},{"$f":"CONCATENATE($A11,T4)","v":"36"},{"$f":"IF(S12=\"\",\"\",IF(S12=U12,\"△\",IF(S12>U12,\"〇\",\"×\")))","v":{"$error":"#N/A"}},{"$f":"CONCATENATE(T4,$A11)","v":"63"},{"$f":"CONCATENATE($A11,W4)","v":"37"},{"$f":"IF(V12=\"\",\"\",IF(V12=X12,\"△\",IF(V12>X12,\"〇\",\"×\")))","v":{"$error":"#N/A"}},{"$f":"CONCATENATE(W4,$A11)","v":"73"},{"$f":"COUNTIF($E11:$W11,\"〇\")","v":0},{"$f":"COUNTIF($E11:$W11,\"×\")","v":0},{"$f":"COUNTIF($E11:$W11,\"△\")","v":0},{"$f":"Y11*2+AA11","v":0},{"$f":"IF(D12=\"\",\"\",D12+G12+M12+P12+J12+S12+V12)","v":{"$error":"#N/A"}},{"$f":"IF(AC11=\"\",\"\",AB11*100+AC11)","v":{"$error":"#N/A"}},{"$f":"IF(AC11=\"\",\"\",F12+I12+L12+O12+R12+U12+X12)","v":{"$error":"#N/A"}},{"$f":"IF(AD11=\"\",\"\",RANK(AD11,AD7:AD20,0))","v":{"$error":"#N/A"}},null,{"$f":"CONCATENATE(A5,AF11)","v":{"$error":"#N/A"}},{"$f":"B11","v":{"$error":"#N/A"}},null,{"$error":"#N/A"},{"$error":"#N/A"}]
[{"$nulls":3},{"$f":"IF(L8=\"\",\"\",L8)","v":{"$error":"#N/A"}},"-",{"$f":"IF(J8=\"\",\"\",J8)","v":{"$error":"#N/A"}},{"$f":"IF(L10=\"\",\"\",L10)","v":{"$error":"#N/A"}},"-",{"$f":"IF(J10=\"\",\"\",J10)","v":{"$error":"#N/A"}},{"$nulls":3},{"$f":"VLOOKUP(M11,対戦表!$AG:$AH,2,0)","v":{"$error":"#N/A"}},"-",{"$f":"VLOOKUP(O11,対戦表!$AG:$AH,2,0)","v":{"$error":"#N/A"}},{"$f":"VLOOKUP(P11,対戦表!$AG:$AH,2,0)","v":{"$error":"#N/A"}},"-",{"$f":"VLOOKUP(R11,対戦表!$AG:$AH,2,0)","v":{"$error":"#N/A"}},{"$f":"VLOOKUP(S11,対戦表!$AG:$AH,2,0)","v":{"$error":"#N/A"}},"-",{"$f":"VLOOKUP(U11,対戦表!$AG:$AH,2,0)","v":{"$error":"#N/A"}},{"$f":"VLOOKUP(V11,対戦表!$AG:$AH,2,0)","v":{"$error":"#N/A"}},"-",{"$f":"VLOOKUP(X11,対戦表!$AG:$AH,2,0)","v":{"$error":"#N/A"}},{"$nulls":12},"",0]
[{"$f":"CONCATENATE(A5,4)","v":"4"},{"$f":"VLOOKUP(A13,チーム表!C:D,2,FALSE)","v":{"$error":"#N/A"}},null,null,{"$f":"IF(D14=\"\",\"\",IF(D14=F14,\"△\",IF(D14>F14,\"〇\",\"×\")))","v":{"$error":"#N/A"}},null,null,{"$f":"IF(G14=\"\",\"\",IF(G14=I14,\"△\",IF(G14>I14,\"〇\",\"×\")))","v":{"$error":"#N/A"}},null,null,{"$f":"IF(J14=\"\",\"\",IF(J14=L14,\"△\",IF(J14>L14,\"〇\",\"×\")))","v":{"$error":"#N/A"}},{"$nulls":4},{"$f":"CONCATENATE($A13,Q4)","v":"45"},{"$f":"IF(P14=\"\",\"\",IF(P14=R14,\"△\",IF(P14>R14,\"〇\",\"×\")))","v":{"$error":"#N/A"}},{"$f":"CONCATENATE(Q4,$A13)","v":"54"},{"$f":"CONCATENATE($A13,T4)","v":"46"},{"$f":"IF(S14=\"\",\"\",IF(S14=U14,\"△\",IF(S14>U14,\"〇\",\"×\")))","v":{"$error":"#N/A"}},{"$f":"CONCATENATE(T4,$A13)","v":"64"},{"$f":"CONCATENATE($A13,W4)","v":"47"},{"$f":"IF(V14=\"\",\"\",IF(V14=X14,\"△\",IF(V14>X14,\"〇\",\"×\")))","v":{"$error":"#N/A"}},{"$f":"CONCATENATE(W4,$A13)","v":"74"},null,{"$f":"COUNTIF($E13:$W13,\"×\")","v":0},{"$f":"COUNTIF($E13:$W13,\"△\")","v":0},{"$f":"Y13*2+AA13","v":0},{"$f":"IF(D14=\"\",\"\",D14+G14+M14+P14+J14+S14+V14)","v":{"$error":"#N/A"}},{"$f":"IF(AC13=\"\",\"\",AB13*100+AC13)","v":{"$error":"#N/A"}},{"$f":"IF(AC13=\"\",\"\",F14+I14+L14+O14+R14+U14+X14)","v":{"$error":"#N/A"}},{"$f":"IF(AD13=\"\",\"\",RANK(AD13,AD7:AD20,0))","v":{"$error":"#N/A"}},null,{"$f":"CONCATENATE(A5,AF13)","v":{"$error":"#N/A"}},{"$f":"B13","v":{"$error":"#N/A"}},null,{"$error":"#N/A"},{"$error":"#N/A"}]
[{"$nulls":3},{"$f":"IF(O8=\"\",\"\",O8)","v":{"$error":"#N/A"}},"-",{"$f":"IF(M8=\"\",\"\",M8)","v":{"$error":"#N/A"}},{"$f":"IF(O10=\"\",\"\",O10)","v":{"$error":"#N/A"}},"-",{"$f":"IF(M10=\"\",\"\",M10)","v":{"$error":"#N/A"}},{"$f":"IF(O12=\"\",\"\",O12)","v":{"$error":"#N/A"}},"-",{"$f":"IF(M12=\"\",\"\",M12)","v":{"$error":"#N/A"}},{"$nulls":3},{"$f":"VLOOKUP(P13,対戦表!$AG:$AH,2,0)","v":{"$error":"#N/A"}},"-",{"$f":"VLOOKUP(R13,対戦表!$AG:$AH,2,0)","v":{"$error":"#N/A"}},{"$f":"VLOOKUP(S13,対戦表!$AG:$AH,2,0)","v":{"$error":"#N/A"}},"-",{"$f":"VLOOKUP(U13,対戦表!$AG:$AH,2,0)","v":{"$error":"#N/A"}},{"$f":"VLOOKUP(V13,対戦表!$AG:$AH,2,0)","v":{"$error":"#N/A"}},"-",{"$f":"VLOOKUP(X13,対戦表!$AG:$AH,2,0)","v":{"$error":"#N/A"}},{"$nulls":12},"",0]
[{"$f":"CONCATENATE(A5,5)","v":"5"},{"$f":"VLOOKUP(A15,チーム表!C:D,2,FALSE)","v":{"$error":"#N/A"}},null,null,{"$f":"IF(D16=\"\",\"\",IF(D16=F16,\"△\",IF(D16>F16,\"〇\",\"×\")))","v":{"$error":"#N/A"}},null,null,{"$f":"IF(G16=\"\",\"\",IF(G16=I16,\"△\",IF(G16>I16,\"〇\",\"×\")))","v":{"$error":"#N/A"}},null,null,{"$f":"IF(J16=\"\",\"\",IF(J16=L16,\"△\",IF(J16>L16,\"〇\",\"×\")))","v":{"$error":"#N/A"}},null,null,{"$f":"IF(M16=\"\",\"\",IF(M16=O16,\"△\",IF(M16>O16,\"〇\",\"×\")))","v":{"$error":"#N/A"}},null,{"$f":"IF(P16=\"\",\"\",IF(P16=R16,\"△\",IF(P16>R16,\"〇\",\"×\")))","v":""},null,null,{"$f":"CONCATENATE($A15,T4)","v":"56"},{"$f":"IF(S16=\"\",\"\",IF(S16=U16,\"△\",IF(S16>U16,\"〇\",\"×\")))","v":{"$error":"#N/A"}},{"$f":"CONCATENATE(T4,$A15)","v":"65"},{"$f":"CONCATENATE($A15,W4)","v":"57"},{"$f":"IF(V16=\"\",\"\",IF(V16=X16,\"△\",IF(V16>X16,\"〇\",\"×\")))","v":{"$error":"#N/A"}},{"$f":"CONCATENATE(W4,$A15)","v":"75"},{"$f":"COUNTIF($E15:$W15,\"〇\")","v":0},{"$f":"COUNTIF($E15:$W15,\"×\")","v":0},{"$f":"COUNTIF($E15:$W15,\"△\")","v":0},{"$f":"Y15*2+AA15","v":0},{"$f":"IF(D16=\"\",\"\",D16+G16+M16+P16+J16+S16+V16)","v":{"$error":"#N/A"}},{"$f":"IF(AC15=\"\",\"\",AB15*100+AC15)","v":{"$error":"#N/A"}},{"$f":"IF(AC15=\"\",\"\",F16+I16+L16+O16+R16+U16+X16)","v":{"$error":"#N/A"}},{"$f":"IF(AD15=\"\",\"\",RANK(AD15,AD7:AD20,0))","v":{"$error":"#N/A"}},null,{"$f":"CONCATENATE(A5,AF15)","v":{"$error":"#N/A"}},{"$f":"B15","v":{"$error":"#N/A"}},null,{"$error":"#N/A"},{"$error":"#N/A"}]
[{"$nulls":3},{"$f":"IF($R8=\"\",\"\",$R8)","v":{"$error":"#N/A"}},"-",{"$f":"IF($P8=\"\",\"\",$P8)","v":{"$error":"#N/A"}},{"$f":"IF($R10=\"\",\"\",$R10)","v":{"$error":"#N/A"}},"-",{"$f":"IF($P10=\"\",\"\",$P10)","v":{"$error":"#N/A"}},{"$f":"IF($R12=\"\",\"\",$R12)","v":{"$error":"#N/A"}},"-",{"$f":"IF($P12=\"\",\"\",$P12)","v":{"$error":"#N/A"}},{"$f":"IF($R14=\"\",\"\",$R14)","v":{"$error":"#N/A"}},"-",{"$f":"IF($P14=\"\",\"\",$P14)","v":{"$error":"#N/A"}},{"$nulls":3},{"$f":"VLOOKUP(S15,対戦表!$AG:$AH,2,0)","v":{"$error":"#N/A"}},"-",{"$f":"VLOOKUP(U15,対戦表!$AG:$AH,2,0)","v":{"$error":"#N/A"}},{"$f":"VLOOKUP(V15,対戦表!$AG:$AH,2,0)","v":{"$error":"#N/A"}},"-",{"$f":"VLOOKUP(X15,対戦表!$AG:$AH,2,0)","v":{"$error":"#N/A"}},{"$nulls":12},"",0]
[{"$f":"CONCATENATE(A5,6)","v":"6"},{"$f":"VLOOKUP(A17,チーム表!C:D,2,FALSE)","v":{"$error":"#N/A"}},null,null,{"$f":"IF(D18=\"\",\"\",IF(D18=F18,\"△\",IF(D18>F18,\"〇\",\"×\")))","v":{"$error":"#N/A"}},null,null,{"$f":"IF(G18=\"\",\"\",IF(G18=I18,\"△\",IF(G18>I18,\"〇\",\"×\")))","v":{"$error":"#N/A"}},null,null,{"$f":"IF(J18=\"\",\"\",IF(J18=L18,\"△\",IF(J18>L18,\"〇\",\"×\")))","v":{"$error":"#N/A"}},null,null,{"$f":"IF(M18=\"\",\"\",IF(M18=O18,\"△\",IF(M18>O18,\"〇\",\"×\")))","v":{"$error":"#N/A"}},null,null,{"$f":"IF(P18=\"\",\"\",IF(P18=R18,\"△\",IF(P18>R18,\"〇\",\"×\")))","v":{"$error":"#N/A"}},{"$nulls":4},{"$f":"CONCATENATE($A17,W4)","v":"67"},{"$f":"IF(V18=\"\",\"\",IF(V18=X18,\"△\",IF(V18>X18,\"〇\",\"×\")))","v":{"$error":"#N/A"}},{"$f":"CONCATENATE(W4,$A17)","v":"76"},{"$f":"COUNTIF($E17:$W17,\"〇\")","v":0},{"$f":"COUNTIF($E17:$W17,\"×\")","v":0},{"$f":"COUNTIF($E17:$W17,\"△\")","v":0},{"$f":"Y17*2+AA17","v":0},{"$f":"IF(D18=\"\",\"\",D18+G18+M18+P18+J18+S18+V18)","v":{"$error":"#N/A"}},{"$f":"IF(AC17=\"\",\"\",AB17*100+AC17)","v":{"$error":"#N/A"}},{"$f":"IF(AC17=\"\",\"\",F18+I18+L18+O18+R18+U18+X18)","v":{"$error":"#N/A"}},{"$f":"IF(AD17=\"\",\"\",RANK(AD17,AD7:AD20,0))","v":{"$error":"#N/A"}},null,{"$f":"CONCATENATE(A5,AF17)","v":{"$error":"#N/A"}},{"$f":"B17","v":{"$error":"#N/A"}},null,{"$error":"#N/A"},{"$error":"#N/A"}]
[{"$nulls":3},{"$f":"IF($U8=\"\",\"\",$U8)","v":{"$error":"#N/A"}},"-",{"$f":"IF($S8=\"\",\"\",$S8)","v":{"$error":"#N/A"}},{"$f":"IF($U10=\"\",\"\",$U10)","v":{"$error":"#N/A"}},"-",{"$f":"IF($S10=\"\",\"\",$S10)","v":{"$error":"#N/A"}},{"$f":"IF($U12=\"\",\"\",$U12)","v":{"$error":"#N/A"}},"-",{"$f":"IF($S12=\"\",\"\",$S12)","v":{"$error":"#N/A"}},{"$f":"IF($U14=\"\",\"\",$U14)","v":{"$error":"#N/A"}},"-",{"$f":"IF($S14=\"\",\"\",$S14)","v":{"$error":"#N/A"}},{"$f":"IF($U16=\"\",\"\",$U16)","v":{"$error":"#N/A"}},"-",{"$f":"IF($S16=\"\",\"\",$S16)","v":{"$error":"#N/A"}},{"$nulls":3},{"$f":"VLOOKUP(V17,対戦表!$AG:$AH,2,0)","v":{"$error":"#N/A"}},"-",{"$f":"VLOOKUP(X17,対戦表!$AG:$AH,2,0)","v":{"$error":"#N/A"}},{"$nulls":12},"",0]
[{"$f":"CONCATENATE(A5,7)","v":"7"},{"$f":"VLOOKUP(A19,チーム表!C:D,2,FALSE)","v":{"$error":"#N/A"}},null,null,{"$f":"IF(D20=\"\",\"\",IF(D20=F20,\"△\",IF(D20>F20,\"〇\",\"×\")))","v":{"$error":"#N/A"}},null,null,{"$f":"IF(G20=\"\",\"\",IF(G20=I20,\"△\",IF(G20>I20,\"〇\",\"×\")))","v":{"$error":"#N/A"}},null,null,{"$f":"IF(J20=\"\",\"\",IF(J20=L20,\"△\",IF(J20>L20,\"〇\",\"×\")))","v":{"$error":"#N/A"}},null,null,{"$f":"IF(M20=\"\",\"\",IF(M20=O20,\"△\",IF(M20>O20,\"〇\",\"×\")))","v":{"$error":"#N/A"}},null,null,{"$f":"IF(P20=\"\",\"\",IF(P20=R20,\"△\",IF(P20>R20,\"〇\",\"×\")))","v":{"$error":"#N/A"}},null,null,{"$f":"IF(S20=\"\",\"\",IF(S20=U20,\"△\",IF(S20>U20,\"〇\",\"×\")))","v":{"$error":"#N/A"}},{"$nulls":4},{"$f":"COUNTIF($E19:$W19,\"〇\")","v":0},{"$f":"COUNTIF($E19:$W19,\"×\")","v":0},{"$f":"COUNTIF($E19:$W19,\"△\")","v":0},{"$f":"Y19*2+AA19","v":0},{"$f":"IF(D20=\"\",\"\",D20+G20+M20+P20+J20+S20+V20)","v":{"$error":"#N/A"}},{"$f":"IF(AC19=\"\",\"\",AB19*100+AC19)","v":{"$error":"#N/A"}},{"$f":"IF(AC19=\"\",\"\",F20+I20+L20+O20+R20+U20+X20)","v":{"$error":"#N/A"}},{"$f":"IF(AD19=\"\",\"\",RANK(AD19,AD7:AD20,0))","v":{"$error":"#N/A"}},null,{"$f":"CONCATENATE(A5,AF19)","v":{"$error":"#N/A"}},{"$f":"B19","v":{"$error":"#N/A"}},null,{"$error":"#N/A"},{"$error":"#N/A"}]
[{"$nulls":3},{"$f":"IF($X8=\"\",\"\",$X8)","v":{"$error":"#N/A"}},"-",{"$f":"IF($V8=\"\",\"\",$V8)","v":{"$error":"#N/A"}},{"$f":"IF($X10=\"\",\"\",$X10)","v":{"$error":"#N/A"}},"-",{"$f":"IF($V10=\"\",\"\",$V10)","v":{"$error":"#N/A"}},{"$f":"IF($X12=\"\",\"\",$X12)","v":{"$error":"#N/A"}},"-",{"$f":"IF($V12=\"\",\"\",$V12)","v":{"$error":"#N/A"}},{"$f":"IF($X14=\"\",\"\",$X14)","v":{"$error":"#N/A"}},"-",{"$f":"IF($V14=\"\",\"\",$V14)","v":{"$error":"#N/A"}},{"$f":"IF($X16=\"\",\"\",$X16)","v":{"$error":"#N/A"}},"-",{"$f":"IF($V16=\"\",\"\",$V16)","v":{"$error":"#N/A"}},{"$f":"IF($X18=\"\",\"\",$X18)","v":{"$error":"#N/A"}},"-",{"$f":"IF($V18=\"\",\"\",$V18)","v":{"$error":"#N/A"}},{"$nulls":15},"",0]
[]
[]
[{"$nulls":4},{"$f":"CONCATENATE(A24,\"1\")","v":"1"},null,null,{"$f":"CONCATENATE(A24,\"2\")","v":"2"},null,null,{"$f":"CONCATENATE(A24,\"3\")","v":"3"},null,null,{"$f":"CONCATENATE(A24,\"4\")","v":"4"},null,null,{"$f":"CONCATENATE(A24,\"5\")","v":"5"},null,null,{"$f":"CONCATENATE(A24,\"6\")","v":"6"}]
[null,"チーム名",null,{"$f":"B26","v":{"$error":"#N/A"}},null,null,{"$f":"B28","v":{"$error":"#N/A"}},null,null,{"$f":"B30","v":{"$error":"#N/A"}},null,null,{"$f":"B32","v":{"$error":"#N/A"}},null,null,{"$f":"B34","v":{"$error":"#N/A"}},null,null,{"$f":"B36","v":{"$error":"#N/A"}},{"$nulls":5},"勝","負","分","点","内野","順位決定点","相手内野","順位","kaku"]
[]
[{"$f":"CONCATENATE(A24,1)","v":"1"},{"$f":"VLOOKUP(A26,チーム表!C:D,2,FALSE)","v":{"$error":"#N/A"}},{"$nulls":4},{"$f":"CONCATENATE($A26,H23)","v":"12"},{"$f":"IF(G27=\"\",\"\",IF(G27=I27,\"△\",IF(G27>I27,\"〇\",\"×\")))","v":{"$error":"#N/A"}},{"$f":"CONCATENATE(H23,$A26)","v":"21"},{"$f":"CONCATENATE($A26,K23)","v":"13"},{"$f":"IF(J27=\"\",\"\",IF(J27=L27,\"△\",IF(J27>L27,\"〇\",\"×\")))","v":{"$error":"#N/A"}},{"$f":"CONCATENATE(K23,$A26)","v":"31"},{"$f":"CONCATENATE($A26,N23)","v":"14"},{"$f":"IF(M27=\"\",\"\",IF(M27=O27,\"△\",IF(M27>O27,\"〇\",\"×\")))","v":{"$error":"#N/A"}},{"$f":"CONCATENATE(N23,$A26)","v":"41"},{"$f":"CONCATENATE($A26,Q23)","v":"15"},{"$f":"IF(P27=\"\",\"\",IF(P27=R27,\"△\",IF(P27>R27,\"〇\",\"×\")))","v":{"$error":"#N/A"}},{"$f":"CONCATENATE(Q23,$A26)","v":"51"},{"$f":"CONCATENATE($A26,T23)","v":"16"},{"$f":"IF(S27=\"\",\"\",IF(S27=U27,\"△\",IF(S27>U27,\"〇\",\"×\")))","v":{"$error":"#N/A"}},{"$f":"CONCATENATE(T23,$A26)","v":"61"},{"$nulls":3},{"$f":"COUNTIF($E26:$T26,\"〇\")","v":0},{"$f":"COUNTIF($E26:$T26,\"×\")","v":0},{"$f":"COUNTIF($E26:$T26,\"△\")","v":0},{"$f":"Y26*2+AA26","v":0},{"$f":"IF(G27=\"\",\"\",D27+G27+M27+P27+J27+S27)","v":{"$error":"#N/A"}},{"$f":"IF(AC26=\"\",\"\",AB26*100+AC26)","v":{"$error":"#N/A"}},{"$f":"IF(AC26=\"\",\"\",F27+I27+L27+O27+R27+U27)","v":{"$error":"#N/A"}},{"$f":"IF(AD26=\"\",\"\",RANK(AD26,AD26:AD37,0))","v":{"$error":"#N/A"}},null,{"$f":"CONCATENATE(A24,AF26)","v":{"$error":"#N/A"}},{"$f":"B26","v":{"$error":"#N/A"}},null,{"$f":"CONCATENATE(A$5,AF26)","v":{"$error":"#N/A"}},{"$f":"$B26","v":{"$error":"#N/A"}}]
[{"$nulls":6},{"$f":"VLOOKUP(G26,対戦表!$AG:$AH,2,0)","v":{"$error":"#N/A"}},"-",{"$f":"VLOOKUP(I26,対戦表!$AG:$AH,2,0)","v":{"$error":"#N/A"}},{"$f":"VLOOKUP(J26,対戦表!$AG:$AH,2,0)","v":{"$error":"#N/A"}},"-",{"$f":"VLOOKUP(L26,対戦表!$AG:$AH,2,0)","v":{"$error":"#N/A"}},{"$f":"VLOOKUP(M26,対戦表!$AG:$AH,2,0)","v":{"$error":"#N/A"}},"-",{"$f":"VLOOKUP(O26,対戦表!$AG:$AH,2,0)","v":{"$error":"#N/A"}},{"$f":"VLOOKUP(P26,対戦表!$AG:$AH,2,0)","v":{"$error":"#N/A"}},"-",{"$f":"VLOOKUP(R26,対戦表!$AG:$AH,2,0)","v":{"$error":"#N/A"}},{"$f":"VLOOKUP(S26,対戦表!$AG:$AH,2,0)","v":{"$error":"#N/A"}},"-",{"$f":"VLOOKUP(U26,対戦表!$AG:$AH,2,0)","v":{"$error":"#N/A"}},{"$nulls":15},{"$f":"CONCATENATE(A$5,AF27)","v":""},{"$f":"$B27","v":0}]
[{"$f":"CONCATENATE(A24,2)","v":"2"},{"$f":"VLOOKUP(A28,チーム表!C:D,2,FALSE)","v":{"$error":"#N/A"}},null,null,{"$f":"IF(D29=\"\",\"\",IF(D29=F29,\"△\",IF(D29>F29,\"〇\",\"×\")))","v":{"$error":"#N/A"}},{"$nulls":4},{"$f":"CONCATENATE($A28,K23)","v":"23"},{"$f":"IF(J29=\"\",\"\",IF(J29=L29,\"△\",IF(J29>L29,\"〇\",\"×\")))","v":{"$error":"#N/A"}},{"$f":"CONCATENATE(K23,$A28)","v":"32"},{"$f":"CONCATENATE($A28,N23)","v":"24"},{"$f":"IF(M29=\"\",\"\",IF(M29=O29,\"△\",IF(M29>O29,\"〇\",\"×\")))","v":{"$error":"#N/A"}},{"$f":"CONCATENATE(N23,$A28)","v":"42"},{"$f":"CONCATENATE($A28,Q23)","v":"25"},{"$f":"IF(P29=\"\",\"\",IF(P29=R29,\"△\",IF(P29>R29,\"〇\",\"×\")))","v":{"$error":"#N/A"}},{"$f":"CONCATENATE(Q23,$A28)","v":"52"},{"$f":"CONCATENATE($A28,T23)","v":"26"},{"$f":"IF(S29=\"\",\"\",IF(S29=U29,\"△\",IF(S29>U29,\"〇\",\"×\")))","v":{"$error":"#N/A"}},{"$f":"CONCATENATE(T23,$A28)","v":"62"},{"$nulls":3},{"$f":"COUNTIF($E28:$T28,\"〇\")","v":0},{"$f":"COUNTIF($E28:$T28,\"×\")","v":0},{"$f":"COUNTIF($E28:$T28,\"△\")","v":0},{"$f":"Y28*2+AA28","v":0},{"$f":"IF(D29=\"\",\"\",D29+G29+M29+P29+J29+S29)","v":{"$error":"#N/A"}},{"$f":"IF(AC28=\"\",\"\",AB28*100+AC28)","v":{"$error":"#N/A"}},{"$f":"IF(AC28=\"\",\"\",F29+I29+L29+O29+R29+U29)","v":{"$error":"#N/A"}},{"$f":"IF(AD28=\"\",\"\",RANK(AD28,AD26:AD37,0))","v":{"$error":"#N/A"}},null,{"$f":"CONCATENATE(A24,AF28)","v":{"$error":"#N/A"}},{"$f":"B28","v":{"$error":"#N/A"}},null,{"$error":"#N/A"},{"$error":"#N/A"}]
[{"$nulls":3},{"$f":"IF(I27=\"\",\"\",I27)","v":{"$error":"#N/A"}},"-",{"$f":"IF(G27=\"\",\"\",G27)","v":{"$error":"#N/A"}},{"$nulls":3},{"$f":"VLOOKUP(J28,対戦表!$AG:$AH,2,0)","v":{"$error":"#N/A"}},"-",{"$f":"VLOOKUP(L28,対戦表!$AG:$AH,2,0)","v":{"$error":"#N/A"}},{"$f":"VLOOKUP(M28,対戦表!$AG:$AH,2,0)","v":{"$error":"#N/A"}},"-",{"$f":"VLOOKUP(O28,対戦表!$AG:$AH,2,0)","v":{"$error":"#N/A"}},{"$f":"VLOOKUP(P28,対戦表!$AG:$AH,2,0)","v":{"$error":"#N/A"}},"-",{"$f":"VLOOKUP(R28,対戦表!$AG:$AH,2,0)","v":{"$error":"#N/A"}},{"$f":"VLOOKUP(S28,対戦表!$AG:$AH,2,0)","v":{"$error":"#N/A"}},"-",{"$f":"VLOOKUP(U28,対戦表!$AG:$AH,2,0)","v":{"$error":"#N/A"}},{"$nulls":15},"",0]
[{"$f":"CONCATENATE(A24,3)","v":"3"},{"$f":"VLOOKUP(A30,チーム表!C:D,2,FALSE)","v":{"$error":"#N/A"}},null,null,{"$f":"IF(D31=\"\",\"\",IF(D31=F31,\"△\",IF(D31>F31,\"〇\",\"×\")))","v":{"$error":"#N/A"}},null,null,{"$f":"IF(G31=\"\",\"\",IF(G31=I31,\"△\",IF(G31>I31,\"〇\",\"×\")))","v":{"$error":"#N/A"}},{"$nulls":4},{"$f":"CONCATENATE($A30,N23)","v":"34"},{"$f":"IF(M31=\"\",\"\",IF(M31=O31,\"△\",IF(M31>O31,\"〇\",\"×\")))","v":{"$error":"#N/A"}},{"$f":"CONCATENATE(N23,$A30)","v":"43"},{"$f":"CONCATENATE($A30,Q23)","v":"35"},{"$f":"IF(P31=\"\",\"\",IF(P31=R31,\"△\",IF(P31>R31,\"〇\",\"×\")))","v":{"$error":"#N/A"}},{"$f":"CONCATENATE(Q23,$A30)","v":"53"},{"$f":"CONCATENATE($A30,T23)","v":"36"},{"$f":"IF(S31=\"\",\"\",IF(S31=U31,\"△\",IF(S31>U31,\"〇\",\"×\")))","v":{"$error":"#N/A"}},{"$f":"CONCATENATE(T23,$A30)","v":"63"},{"$nulls":3},{"$f":"COUNTIF($E30:$T30,\"〇\")","v":0},{"$f":"COUNTIF($E30:$T30,\"×\")","v":0},{"$f":"COUNTIF($E30:$T30,\"△\")","v":0},{"$f":"Y30*2+AA30","v":0},{"$f":"IF(G31=\"\",\"\",D31+G31+M31+P31+J31+S31)","v":{"$error":"#N/A"}},{"$f":"IF(AC30=\"\",\"\",AB30*100+AC30)","v":{"$error":"#N/A"}},{"$f":"IF(AC30=\"\",\"\",F31+I31+L31+O31+R31+U31)","v":{"$error":"#N/A"}},{"$f":"IF(AD30=\"\",\"\",RANK(AD30,AD26:AD37,0))","v":{"$error":"#N/A"}},null,{"$f":"CONCATENATE(A24,AF30)","v":{"$error":"#N/A"}},{"$f":"B30","v":{"$error":"#N/A"}},null,{"$error":"#N/A"},{"$error":"#N/A"}]
[{"$nulls":3},{"$f":"IF(L27=\"\",\"\",L27)","v":{"$error":"#N/A"}},"-",{"$f":"IF(J27=\"\",\"\",J27)","v":{"$error":"#N/A"}},{"$f":"IF(L29=\"\",\"\",L29)","v":{"$error":"#N/A"}},"-",{"$f":"IF(J29=\"\",\"\",J29)","v":{"$error":"#N/A"}},{"$nulls":3},{"$f":"VLOOKUP(M30,対戦表!$AG:$AH,2,0)","v":{"$error":"#N/A"}},"-",{"$f":"VLOOKUP(O30,対戦表!$AG:$AH,2,0)","v":{"$error":"#N/A"}},{"$f":"VLOOKUP(P30,対戦表!$AG:$AH,2,0)","v":{"$error":"#N/A"}},"-",{"$f":"VLOOKUP(R30,対戦表!$AG:$AH,2,0)","v":{"$error":"#N/A"}},{"$f":"VLOOKUP(S30,対戦表!$AG:$AH,2,0)","v":{"$error":"#N/A"}},"-",{"$f":"VLOOKUP(U30,対戦表!$AG:$AH,2,0)","v":{"$error":"#N/A"}},{"$nulls":15},"",0]
[{"$f":"CONCATENATE(A24,4)","v":"4"},{"$f":"VLOOKUP(A32,チーム表!C:D,2,FALSE)","v":{"$error":"#N/A"}},null,null,{"$f":"IF(D33=\"\",\"\",IF(D33=F33,\"△\",IF(D33>F33,\"〇\",\"×\")))","v":{"$error":"#N/A"}},null,null,{"$f":"IF(G33=\"\",\"\",IF(G33=I33,\"△\",IF(G33>I33,\"〇\",\"×\")))","v":{"$error":"#N/A"}},null,null,{"$f":"IF(J33=\"\",\"\",IF(J33=L33,\"△\",IF(J33>L33,\"〇\",\"×\")))","v":{"$error":"#N/A"}},{"$nulls":4},{"$f":"CONCATENATE($A32,Q23)","v":"45"},{"$f":"IF(P33=\"\",\"\",IF(P33=R33,\"△\",IF(P33>R33,\"〇\",\"×\")))","v":{"$error":"#N/A"}},{"$f":"CONCATENATE(Q23,$A32)","v":"54"},{"$f":"CONCATENATE($A32,T23)","v":"46"},{"$f":"IF(S33=\"\",\"\",IF(S33=U33,\"△\",IF(S33>U33,\"〇\",\"×\")))","v":{"$error":"#N/A"}},{"$f":"CONCATENATE(T23,$A32)","v":"64"},{"$nulls":3},{"$f":"COUNTIF($E32:$T32,\"〇\")","v":0},{"$f":"COUNTIF($E32:$T32,\"×\")","v":0},{"$f":"COUNTIF($E32:$T32,\"△\")","v":0},{"$f":"Y32*2+AA32","v":0},{"$f":"IF(G33=\"\",\"\",D33+G33+M33+P33+J33+S33)","v":{"$error":"#N/A"}},{"$f":"IF(AC32=\"\",\"\",AB32*100+AC32)","v":{"$error":"#N/A"}},{"$f":"IF(AC32=\"\",\"\",F33+I33+L33+O33+R33+U33)","v":{"$error":"#N/A"}},{"$f":"IF(AD32=\"\",\"\",RANK(AD32,AD26:AD37,0))","v":{"$error":"#N/A"}},null,{"$f":"CONCATENATE(A24,AF32)","v":{"$error":"#N/A"}},{"$f":"B32","v":{"$error":"#N/A"}},null,{"$error":"#N/A"},{"$error":"#N/A"}]
[{"$nulls":3},{"$f":"IF(O27=\"\",\"\",O27)","v":{"$error":"#N/A"}},"-",{"$f":"IF(M27=\"\",\"\",M27)","v":{"$error":"#N/A"}},{"$f":"IF(O29=\"\",\"\",O29)","v":{"$error":"#N/A"}},"-",{"$f":"IF(M29=\"\",\"\",M29)","v":{"$error":"#N/A"}},{"$f":"IF(O31=\"\",\"\",O31)","v":{"$error":"#N/A"}},"-",{"$f":"IF(M31=\"\",\"\",M31)","v":{"$error":"#N/A"}},{"$nulls":3},{"$f":"VLOOKUP(P32,対戦表!$AG:$AH,2,0)","v":{"$error":"#N/A"}},"-",{"$f":"VLOOKUP(R32,対戦表!$AG:$AH,2,0)","v":{"$error":"#N/A"}},{"$f":"VLOOKUP(S32,対戦表!$AG:$AH,2,0)","v":{"$error":"#N/A"}},"-",{"$f":"VLOOKUP(U32,対戦表!$AG:$AH,2,0)","v":{"$error":"#N/A"}},{"$nulls":15},"",0]
[{"$f":"CONCATENATE(A24,5)","v":"5"},{"$f":"VLOOKUP(A34,チーム表!C:D,2,FALSE)","v":{"$error":"#N/A"}},null,null,{"$f":"IF(D35=\"\",\"\",IF(D35=F35,\"△\",IF(D35>F35,\"〇\",\"×\")))","v":{"$error":"#N/A"}},null,null,{"$f":"IF(G35=\"\",\"\",IF(G35=I35,\"△\",IF(G35>I35,\"〇\",\"×\")))","v":{"$error":"#N/A"}},null,null,{"$f":"IF(J35=\"\",\"\",IF(J35=L35,\"△\",IF(J35>L35,\"〇\",\"×\")))","v":{"$error":"#N/A"}},null,null,{"$f":"IF(M35=\"\",\"\",IF(M35=O35,\"△\",IF(M35>O35,\"〇\",\"×\")))","v":{"$error":"#N/A"}},null,{"$f":"IF(P35=\"\",\"\",IF(P35=R35,\"△\",IF(P35>R35,\"〇\",\"×\")))","v":""},null,null,{"$f":"CONCATENATE($A34,T23)","v":"56"},{"$f":"IF(S35=\"\",\"\",IF(S35=U35,\"△\",IF(S35>U35,\"〇\",\"×\")))","v":{"$error":"#N/A"}},{"$f":"CONCATENATE(T23,$A34)","v":"65"},{"$nulls":3},{"$f":"COUNTIF($E34:$T34,\"〇\")","v":0},{"$f":"COUNTIF($E34:$T34,\"×\")","v":0},{"$f":"COUNTIF($E34:$T34,\"△\")","v":0},{"$f":"Y34*2+AA34","v":0},{"$f":"IF(G35=\"\",\"\",D35+G35+M35+P35+J35+S35)","v":{"$error":"#N/A"}},{"$f":"IF(AC34=\"\",\"\",AB34*100+AC34)","v":{"$error":"#N/A"}},{"$f":"IF(AC34=\"\",\"\",F35+I35+L35+O35+R35+U35)","v":{"$error":"#N/A"}},{"$f":"IF(AD34=\"\",\"\",RANK(AD34,AD26:AD37,0))","v":{"$error":"#N/A"}},null,{"$f":"CONCATENATE(A24,AF34)","v":{"$error":"#N/A"}},{"$f":"B34","v":{"$error":"#N/A"}},null,{"$error":"#N/A"},{"$error":"#N/A"}]
[{"$nulls":3},{"$f":"IF($R27=\"\",\"\",$R27)","v":{"$error":"#N/A"}},"-",{"$f":"IF($P27=\"\",\"\",$P27)","v":{"$error":"#N/A"}},{"$f":"IF($R29=\"\",\"\",$R29)","v":{"$error":"#N/A"}},"-",{"$f":"IF($P29=\"\",\"\",$P29)","v":{"$error":"#N/A"}},{"$f":"IF($R31=\"\",\"\",$R31)","v":{"$error":"#N/A"}},"-",{"$f":"IF($P31=\"\",\"\",$P31)","v":{"$error":"#N/A"}},{"$f":"IF($R33=\"\",\"\",$R33)","v":{"$error":"#N/A"}},"-",{"$f":"IF($P33=\"\",\"\",$P33)","v":{"$error":"#N/A"}},{"$nulls":3},{"$f":"VLOOKUP(S34,対戦表!$AG:$AH,2,0)","v":{"$error":"#N/A"}},"-",{"$f":"VLOOKUP(U34,対戦表!$AG:$AH,2,0)","v":{"$error":"#N/A"}},{"$nulls":12},{"$f":"CONCATENATE($A$5,AF35)","v":""},null,null,"",0]
[{"$f":"CONCATENATE(A24,6)","v":"6"},{"$f":"VLOOKUP(A36,チーム表!C:D,2,FALSE)","v":{"$error":"#N/A"}},null,null,{"$f":"IF(D37=\"\",\"\",IF(D37=F37,\"△\",IF(D37>F37,\"〇\",\"×\")))","v":{"$error":"#N/A"}},null,null,{"$f":"IF(G37=\"\",\"\",IF(G37=I37,\"△\",IF(G37>I37,\"〇\",\"×\")))","v":{"$error":"#N/A"}},null,null,{"$f":"IF(J37=\"\",\"\",IF(J37=L37,\"△\",IF(J37>L37,\"〇\",\"×\")))","v":{"$error":"#N/A"}},null,null,{"$f":"IF(M37=\"\",\"\",IF(M37=O37,\"△\",IF(M37>O37,\"〇\",\"×\")))","v":{"$error":"#N/A"}},null,null,{"$f":"IF(P37=\"\",\"\",IF(P37=R37,\"△\",IF(P37>R37,\"〇\",\"×\")))","v":{"$error":"#N/A"}},{"$nulls":7},{"$f":"COUNTIF($E36:$T36,\"〇\")","v":0},{"$f":"COUNTIF($E36:$T36,\"×\")","v":0},{"$f":"COUNTIF($E36:$T36,\"△\")","v":0},{"$f":"Y36*2+AA36","v":0},{"$f":"IF(G37=\"\",\"\",D37+G37+M37+P37+J37+S37)","v":{"$error":"#N/A"}},{"$f":"IF(AC36=\"\",\"\",AB36*100+AC36)","v":{"$error":"#N/A"}},{"$f":"IF(AC36=\"\",\"\",F37+I37+L37+O37+R37+U37)","v":{"$error":"#N/A"}},{"$f":"IF(AD36=\"\",\"\",RANK(AD36,AD26:AD37,0))","v":{"$error":"#N/A"}},null,{"$f":"CONCATENATE(A24,AF36)","v":{"$error":"#N/A"}},{"$f":"B36","v":{"$error":"#N/A"}},null,{"$error":"#N/A"},{"$error":"#N/A"}]
[{"$nulls":3},{"$f":"IF($U27=\"\",\"\",$U27)","v":{"$error":"#N/A"}},"-",{"$f":"IF($S27=\"\",\"\",$S27)","v":{"$error":"#N/A"}},{"$f":"IF($U29=\"\",\"\",$U29)","v":{"$error":"#N/A"}},"-",{"$f":"IF($S29=\"\",\"\",$S29)","v":{"$error":"#N/A"}},{"$f":"IF($U31=\"\",\"\",$U31)","v":{"$error":"#N/A"}},"-",{"$f":"IF($S31=\"\",\"\",$S31)","v":{"$error":"#N/A"}},{"$f":"IF($U33=\"\",\"\",$U33)","v":{"$error":"#N/A"}},"-",{"$f":"IF($S33=\"\",\"\",$S33)","v":{"$error":"#N/A"}},{"$f":"IF($U35=\"\",\"\",$U35)","v":{"$error":"#N/A"}},"-",{"$f":"IF($S35=\"\",\"\",$S35)","v":{"$error":"#N/A"}},{"$nulls":18},"",0]
[]
[]
[{"$nulls":4},{"$f":"CONCATENATE(#REF!,\"1\")","v":{"$error":"#REF!"}},null,null,{"$f":"CONCATENATE(#REF!,\"2\")","v":{"$error":"#REF!"}},null,null,{"$f":"CONCATENATE(#REF!,\"3\")","v":{"$error":"#REF!"}},null,null,{"$f":"CONCATENATE(#REF!,\"4\")","v":{"$error":"#REF!"}},null,null,{"$f":"CONCATENATE(#REF!,\"5\")","v":{"$error":"#REF!"}}]

{"sheet":"DATA1","index":6,"n_rows":0,"n_cols":0,"rows_kept":0}

{"sheet":"対戦表1","index":7,"n_rows":85,"n_cols":34,"rows_kept":85}
{"$rows_empty":74}
[{"$nulls":32},{"$f":"#REF!","v":{"$error":"#REF!"}},{"$f":"IF(#REF!=\"\",\"\",#REF!)","v":{"$error":"#REF!"}}]
[{"$nulls":32},{"$f":"#REF!","v":{"$error":"#REF!"}},{"$f":"IF(#REF!=\"\",\"\",#REF!)","v":{"$error":"#REF!"}}]
[{"$nulls":32},{"$f":"#REF!","v":{"$error":"#REF!"}},{"$f":"IF(#REF!=\"\",\"\",#REF!)","v":{"$error":"#REF!"}}]
[{"$nulls":32},{"$f":"#REF!","v":{"$error":"#REF!"}},{"$f":"IF(#REF!=\"\",\"\",#REF!)","v":{"$error":"#REF!"}}]
[{"$nulls":32},{"$f":"#REF!","v":{"$error":"#REF!"}},{"$f":"IF(#REF!=\"\",\"\",#REF!)","v":{"$error":"#REF!"}}]
[{"$nulls":32},{"$f":"#REF!","v":{"$error":"#REF!"}},{"$f":"IF(#REF!=\"\",\"\",#REF!)","v":{"$error":"#REF!"}}]
[{"$nulls":32},{"$f":"#REF!","v":{"$error":"#REF!"}},{"$f":"IF(#REF!=\"\",\"\",#REF!)","v":{"$error":"#REF!"}}]
[{"$nulls":32},{"$f":"#REF!","v":{"$error":"#REF!"}},{"$f":"IF(#REF!=\"\",\"\",#REF!)","v":{"$error":"#REF!"}}]
[{"$nulls":32},{"$f":"#REF!","v":{"$error":"#REF!"}},{"$f":"IF(#REF!=\"\",\"\",#REF!)","v":{"$error":"#REF!"}}]
[{"$nulls":32},{"$f":"#REF!","v":{"$error":"#REF!"}},{"$f":"IF(#REF!=\"\",\"\",#REF!)","v":{"$error":"#REF!"}}]
[{"$nulls":32},{"$f":"#REF!","v":{"$error":"#REF!"}},{"$f":"IF(#REF!=\"\",\"\",#REF!)","v":{"$error":"#REF!"}}]

{"sheet":"対戦表2","index":8,"n_rows":165,"n_cols":34,"rows_kept":165}
[{"$nulls":10},{"$f":"チーム表!$B$1","v":"第２７回　いしかわスポーツ・レクリエーション交流大会\n「第１１回ふれあいドッジボール大会」"}]
[]
["　試合スケジュール"]
[]
[null,"時間",null,null,"点","Ａコート",{"$nulls":3},"点","Ａコート",{"$nulls":3},"点","Ｂコート",{"$nulls":3},"点","Ｂコート"]
[1,null,{"$f":"組合表!AG4","v":"A1"},{"$f":"CONCATENATE(C6,H6)","v":"A1A2"},null,{"$f":"VLOOKUP(C6,チーム表!C:D,2,FALSE)","v":"下関福光サンダージュニア"},"×",{"$f":"組合表!AH4","v":"A2"},{"$f":"CONCATENATE(H6,C6)","v":"A2A1"},null,{"$f":"VLOOKUP(H6,チーム表!C:D,2,FALSE)","v":"NISHIファイヤースターズ"},null,{"$f":"組合表!AI4","v":"B1"},{"$f":"CONCATENATE(M6,R6)","v":"B1B2"},null,{"$f":"VLOOKUP(M6,チーム表!C:D,2,FALSE)","v":"杉っ子ドッジファイターズ"},"×",{"$f":"組合表!AJ4","v":"B2"},{"$f":"CONCATENATE(R6,M6)","v":"B2B1"},null,{"$f":"VLOOKUP(R6,チーム表!C:D,2,FALSE)","v":"鵜川ミラクルフェニックス"},{"$nulls":11},{"$f":"D6","v":"A1A2"},{"$f":"IF(E6=\"\",\"\",E6)","v":""}]
[2,null,{"$f":"組合表!AG5","v":"C1"},{"$f":"CONCATENATE(C7,H7)","v":"C1C2"},null,{"$f":"VLOOKUP(C7,チーム表!C:D,2,FALSE)","v":"田上闘球DREAMS"},"×",{"$f":"組合表!AH5","v":"C2"},{"$f":"CONCATENATE(H7,C7)","v":"C2C1"},null,{"$f":"VLOOKUP(H7,チーム表!C:D,2,FALSE)","v":"千坂ドッジファイヤーズ"},null,{"$f":"組合表!AI5","v":"D1"},{"$f":"CONCATENATE(M7,R7)","v":"D1D2"},null,{"$f":"VLOOKUP(M7,チーム表!C:D,2,FALSE)","v":"大門ドッジボールクラブ"},"×",{"$f":"組合表!AJ5","v":"D2"},{"$f":"CONCATENATE(R7,M7)","v":"D2D1"},null,{"$f":"VLOOKUP(R7,チーム表!C:D,2,FALSE)","v":"鳳至ドッジボールクラブ"},{"$nulls":11},"C1C2",{"$f":"IF(E7=\"\",\"\",E7)","v":""}]
[3,null,{"$f":"組合表!AG6","v":"K1"},"K1K2",null,{"$f":"VLOOKUP(C8,チーム表!C:D,2,FALSE)","v":"松任の大魔陣Ladies"},"×",{"$f":"組合表!AH6","v":"K2"},"K2K1",null,{"$f":"VLOOKUP(H8,チーム表!C:D,2,FALSE)","v":"鞍月マミ～ズ"},null,{"$f":"組合表!AI6","v":"L1"},"L1L2",null,{"$f":"VLOOKUP(M8,チーム表!C:D,2,FALSE)","v":"田上闘球親子"},"×",{"$f":"組合表!AJ6","v":"L2"},"L2L1",null,{"$f":"VLOOKUP(R8,チーム表!C:D,2,FALSE)","v":"フェニックスと頑固なお父さん"},{"$nulls":11},"K1K2",""]
[4,null,{"$f":"組合表!AG7","v":"M1"},"M1M2",null,{"$f":"VLOOKUP(C9,チーム表!C:D,2,FALSE)","v":"NISHIファミリーズ"},"×",{"$f":"組合表!AH7","v":"M2"},"M2M1",null,{"$f":"VLOOKUP(H9,チーム表!C:D,2,FALSE)","v":"鳳至ファミリーズ"},null,{"$f":"組合表!AI7","v":"E1"},"E1E2",null,{"$f":"VLOOKUP(M9,チーム表!C:D,2,FALSE)","v":"鵜川フェニックスｷｯｽﾞ"},"×",{"$f":"組合表!AJ7","v":"E2"},"E2E1",null,{"$f":"VLOOKUP(R9,チーム表!C:D,2,FALSE)","v":"千坂ロータスルート"},{"$nulls":11},"M1M2",""]
[5,null,{"$f":"組合表!AG8","v":"F1"},"F1F2",null,{"$f":"VLOOKUP(C10,チーム表!C:D,2,FALSE)","v":"鳳至ジュニア"},"×",{"$f":"組合表!AH8","v":"F2"},"F2F1",null,{"$f":"VLOOKUP(H10,チーム表!C:D,2,FALSE)","v":"向本折クラブNew"},null,{"$f":"組合表!AI8","v":"G1"},"G1G2",null,{"$f":"VLOOKUP(M10,チーム表!C:D,2,FALSE)","v":"九十九クラブ"},"×",{"$f":"組合表!AJ8","v":"G2"},"G2G1",null,{"$f":"VLOOKUP(R10,チーム表!C:D,2,FALSE)","v":"松任の大魔陣Jr"},{"$nulls":11},"F1F2",""]
[6,null,{"$f":"組合表!AG9","v":"H1"},"H1H2",null,{"$f":"VLOOKUP(C11,チーム表!C:D,2,FALSE)","v":"THUNDER(ｻﾝﾀﾞｰ)"},"×",{"$f":"組合表!AH9","v":"H2"},"H2H1",null,{"$f":"VLOOKUP(H11,チーム表!C:D,2,FALSE)","v":"ＳＫＩＰＰＥＲＳ"},null,{"$f":"組合表!AI9","v":"I1"},"I1I2",null,{"$f":"VLOOKUP(M11,チーム表!C:D,2,FALSE)","v":"ペヤング"},"×",{"$f":"組合表!AJ9","v":"I2"},"I2I1",null,{"$f":"VLOOKUP(R11,チーム表!C:D,2,FALSE)","v":"鞍月アタッカーズＯＮＥ"},{"$nulls":11},"H1H2",""]
[7,null,{"$f":"組合表!AG10","v":"J1"},"J1J2",null,{"$f":"VLOOKUP(C12,チーム表!C:D,2,FALSE)","v":"杉っ子ダディー"},"×",{"$f":"組合表!AH10","v":"J2"},"J2J1",null,{"$f":"VLOOKUP(H12,チーム表!C:D,2,FALSE)","v":"松任の大魔陣オールディーズ"},null,{"$f":"組合表!AI10","v":"N1"},"N1N2",null,{"$f":"VLOOKUP(M12,チーム表!C:D,2,FALSE)","v":"田上闘球ミドル"},"×",{"$f":"組合表!AJ10","v":"N2"},"N2N1",null,{"$f":"VLOOKUP(R12,チーム表!C:D,2,FALSE)","v":"鳳至あまさんず"},{"$nulls":11},"J1J2",""]
[8,null,{"$f":"組合表!AG11","v":"O1"},"O1O2",null,{"$f":"VLOOKUP(C13,チーム表!C:D,2,FALSE)","v":"宇出津っ子と優しいお母さん"},"×",{"$f":"組合表!AH11","v":"O2"},"O2O1",null,{"$f":"VLOOKUP(H13,チーム表!C:D,2,FALSE)","v":"向本折ファミリー"},null,{"$f":"組合表!AI11","v":"P1"},"P1P2",null,{"$f":"VLOOKUP(M13,チーム表!C:D,2,FALSE)","v":"千坂ゼブラーズG"},"×",{"$f":"組合表!AJ11","v":"P2"},"P2P1",null,{"$f":"VLOOKUP(R13,チーム表!C:D,2,FALSE)","v":"小木クLOVE♡楽球会"},{"$nulls":11},"O1O2",""]
[9,null,{"$f":"組合表!AG12","v":"A3"},"A3A4",null,{"$f":"VLOOKUP(C14,チーム表!C:D,2,FALSE)","v":"小木クラブ"},"×",{"$f":"組合表!AH12","v":"A4"},"A4A3",null,{"$f":"VLOOKUP(H14,チーム表!C:D,2,FALSE)","v":"松任の大魔陣"},null,{"$f":"組合表!AI12","v":"B3"},"B3B4",null,{"$f":"VLOOKUP(M14,チーム表!C:D,2,FALSE)","v":"向本折クラブA"},"×",{"$f":"組合表!AJ12","v":"B4"},"B4B3",null,{"$f":"VLOOKUP(R14,チーム表!C:D,2,FALSE)","v":"鞍月アタッカーズ"},{"$nulls":11},"A3A4",""]
[10,null,{"$f":"組合表!AG13","v":"C3"},"C3C4",null,{"$f":"VLOOKUP(C15,チーム表!C:D,2,FALSE)","v":"あさひスーパーファイターズ"},"×",{"$f":"組合表!AH13","v":"C4"},"C4C3",null,{"$f":"VLOOKUP(H15,チーム表!C:D,2,FALSE)","v":"寺井クラブ"},null,{"$f":"組合表!AI13","v":"D3"},"D3D4",null,{"$f":"VLOOKUP(M15,チーム表!C:D,2,FALSE)","v":"山中SPARS"},"×",{"$f":"組合表!AJ13","v":"D4"},"D4D3",null,{"$f":"VLOOKUP(R15,チーム表!C:D,2,FALSE)","v":"三馬パワフル"},{"$nulls":11},"C3C4",""]
{"$rows_empty":65}
[{"$nulls":32},{"$f":"#REF!","v":{"$error":"#REF!"}},{"$f":"IF(#REF!=\"\",\"\",#REF!)","v":{"$error":"#REF!"}}]
[{"$nulls":32},{"$f":"#REF!","v":{"$error":"#REF!"}},{"$f":"IF(#REF!=\"\",\"\",#REF!)","v":{"$error":"#REF!"}}]
[{"$nulls":32},{"$f":"#REF!","v":{"$error":"#REF!"}},{"$f":"IF(#REF!=\"\",\"\",#REF!)","v":{"$error":"#REF!"}}]
[{"$nulls":32},{"$f":"#REF!","v":{"$error":"#REF!"}},{"$f":"IF(#REF!=\"\",\"\",#REF!)","v":{"$error":"#REF!"}}]
[{"$nulls":32},{"$f":"#REF!","v":{"$error":"#REF!"}},{"$f":"IF(#REF!=\"\",\"\",#REF!)","v":{"$error":"#REF!"}}]
[{"$nulls":32},{"$f":"N6","v":"B1B2"},{"$f":"IF(O6=\"\",\"\",O6)","v":""}]
[{"$nulls":32},"D1D2",{"$f":"IF(O7=\"\",\"\",O7)","v":""}]
[{"$nulls":32},"L1L2",""]
[{"$nulls":32},"E1E2",""]
[{"$nulls":32},"G1G2",""]
[{"$nulls":32},"I1I2",""]
[{"$nulls":32},"N1N2",""]
[{"$nulls":32},"P1P2",""]
[{"$nulls":32},"B3B4",""]
[{"$nulls":32},"D3D4",""]
[{"$nulls":32},{"$f":"#REF!","v":{"$error":"#REF!"}},{"$f":"IF(#REF!=\"\",\"\",#REF!)","v":{"$error":"#REF!"}}]
[{"$nulls":32},{"$f":"#REF!","v":{"$error":"#REF!"}},{"$f":"IF(#REF!=\"\",\"\",#REF!)","v":{"$error":"#REF!"}}]
[{"$nulls":32},{"$f":"#REF!","v":{"$error":"#REF!"}},{"$f":"IF(#REF!=\"\",\"\",#REF!)","v":{"$error":"#REF!"}}]
[{"$nulls":32},{"$f":"#REF!","v":{"$error":"#REF!"}},{"$f":"IF(#REF!=\"\",\"\",#REF!)","v":{"$error":"#REF!"}}]
[{"$nulls":32},{"$f":"#REF!","v":{"$error":"#REF!"}},{"$f":"IF(#REF!=\"\",\"\",#REF!)","v":{"$error":"#REF!"}}]
[{"$nulls":32},{"$f":"#REF!","v":{"$error":"#REF!"}},{"$f":"IF(#REF!=\"\",\"\",#REF!)","v":{"$error":"#REF!"}}]
[{"$nulls":32},{"$f":"#REF!","v":{"$error":"#REF!"}},{"$f":"IF(#REF!=\"\",\"\",#REF!)","v":{"$error":"#REF!"}}]
[{"$nulls":32},{"$f":"#REF!","v":{"$error":"#REF!"}},{"$f":"IF(#REF!=\"\",\"\",#REF!)","v":{"$error":"#REF!"}}]
[{"$nulls":32},{"$f":"#REF!","v":{"$error":"#REF!"}},{"$f":"IF(#REF!=\"\",\"\",#REF!)","v":{"$error":"#REF!"}}]
[{"$nulls":32},{"$f":"#REF!","v":{"$error":"#REF!"}},{"$f":"IF(#REF!=\"\",\"\",#REF!)","v":{"$error":"#REF!"}}]
[{"$nulls":32},{"$f":"#REF!","v":{"$error":"#REF!"}},{"$f":"IF(#REF!=\"\",\"\",#REF!)","v":{"$error":"#REF!"}}]
[{"$nulls":32},{"$f":"#REF!","v":{"$error":"#REF!"}},{"$f":"IF(#REF!=\"\",\"\",#REF!)","v":{"$error":"#REF!"}}]
[{"$nulls":32},{"$f":"#REF!","v":{"$error":"#REF!"}},{"$f":"IF(#REF!=\"\",\"\",#REF!)","v":{"$error":"#REF!"}}]
[{"$nulls":32},{"$f":"#REF!","v":{"$error":"#REF!"}},{"$f":"IF(#REF!=\"\",\"\",#REF!)","v":{"$error":"#REF!"}}]
[{"$nulls":32},{"$f":"#REF!","v":{"$error":"#REF!"}},{"$f":"IF(#REF!=\"\",\"\",#REF!)","v":{"$error":"#REF!"}}]
[{"$nulls":32},{"$f":"#REF!","v":{"$error":"#REF!"}},{"$f":"IF(#REF!=\"\",\"\",#REF!)","v":{"$error":"#REF!"}}]
[{"$nulls":32},{"$f":"#REF!","v":{"$error":"#REF!"}},{"$f":"IF(#REF!=\"\",\"\",#REF!)","v":{"$error":"#REF!"}}]
[{"$nulls":32},{"$f":"#REF!","v":{"$error":"#REF!"}},{"$f":"IF(#REF!=\"\",\"\",#REF!)","v":{"$error":"#REF!"}}]
[{"$nulls":32},{"$f":"#REF!","v":{"$error":"#REF!"}},{"$f":"IF(#REF!=\"\",\"\",#REF!)","v":{"$error":"#REF!"}}]
[{"$nulls":32},{"$f":"#REF!","v":{"$error":"#REF!"}},{"$f":"IF(#REF!=\"\",\"\",#REF!)","v":{"$error":"#REF!"}}]
[{"$nulls":32},{"$f":"#REF!","v":{"$error":"#REF!"}},{"$f":"IF(#REF!=\"\",\"\",#REF!)","v":{"$error":"#REF!"}}]
[{"$nulls":32},{"$f":"#REF!","v":{"$error":"#REF!"}},{"$f":"IF(#REF!=\"\",\"\",#REF!)","v":{"$error":"#REF!"}}]
[{"$nulls":32},{"$f":"#REF!","v":{"$error":"#REF!"}},{"$f":"IF(#REF!=\"\",\"\",#REF!)","v":{"$error":"#REF!"}}]
[{"$nulls":32},{"$f":"#REF!","v":{"$error":"#REF!"}},{"$f":"IF(#REF!=\"\",\"\",#REF!)","v":{"$error":"#REF!"}}]
[{"$nulls":32},{"$f":"#REF!","v":{"$error":"#REF!"}},{"$f":"IF(#REF!=\"\",\"\",#REF!)","v":{"$error":"#REF!"}}]
[{"$nulls":32},{"$f":"#REF!","v":{"$error":"#REF!"}},{"$f":"IF(#REF!=\"\",\"\",#REF!)","v":{"$error":"#REF!"}}]
[{"$nulls":32},{"$f":"#REF!","v":{"$error":"#REF!"}},{"$f":"IF(#REF!=\"\",\"\",#REF!)","v":{"$error":"#REF!"}}]
[{"$nulls":32},{"$f":"#REF!","v":{"$error":"#REF!"}},{"$f":"IF(#REF!=\"\",\"\",#REF!)","v":{"$error":"#REF!"}}]
[{"$nulls":32},{"$f":"#REF!","v":{"$error":"#REF!"}},{"$f":"IF(#REF!=\"\",\"\",#REF!)","v":{"$error":"#REF!"}}]
[{"$nulls":32},{"$f":"#REF!","v":{"$error":"#REF!"}},{"$f":"IF(#REF!=\"\",\"\",#REF!)","v":{"$error":"#REF!"}}]
[{"$nulls":32},{"$f":"S6","v":"B2B1"},{"$f":"IF(T6=\"\",\"\",T6)","v":""}]
[{"$nulls":32},"D2D1",{"$f":"IF(T7=\"\",\"\",T7)","v":""}]
[{"$nulls":32},"L2L1",""]
[{"$nulls":32},"E2E1",""]
[{"$nulls":32},"G2G1",""]
[{"$nulls":32},"I2I1",""]
[{"$nulls":32},"N2N1",""]
[{"$nulls":32},"P2P1",""]
[{"$nulls":32},"B4B3",""]
[{"$nulls":32},"D4D3",""]
[{"$nulls":32},{"$f":"#REF!","v":{"$error":"#REF!"}},{"$f":"IF(#REF!=\"\",\"\",#REF!)","v":{"$error":"#REF!"}}]
[{"$nulls":32},{"$f":"#REF!","v":{"$error":"#REF!"}},{"$f":"IF(#REF!=\"\",\"\",#REF!)","v":{"$error":"#REF!"}}]
[{"$nulls":32},{"$f":"#REF!","v":{"$error":"#REF!"}},{"$f":"IF(#REF!=\"\",\"\",#REF!)","v":{"$error":"#REF!"}}]
[{"$nulls":32},{"$f":"#REF!","v":{"$error":"#REF!"}},{"$f":"IF(#REF!=\"\",\"\",#REF!)","v":{"$error":"#REF!"}}]
[{"$nulls":32},{"$f":"#REF!","v":{"$error":"#REF!"}},{"$f":"IF(#REF!=\"\",\"\",#REF!)","v":{"$error":"#REF!"}}]
[{"$nulls":32},{"$f":"#REF!","v":{"$error":"#REF!"}},{"$f":"IF(#REF!=\"\",\"\",#REF!)","v":{"$error":"#REF!"}}]
[{"$nulls":32},{"$f":"#REF!","v":{"$error":"#REF!"}},{"$f":"IF(#REF!=\"\",\"\",#REF!)","v":{"$error":"#REF!"}}]
[{"$nulls":32},{"$f":"#REF!","v":{"$error":"#REF!"}},{"$f":"IF(#REF!=\"\",\"\",#REF!)","v":{"$error":"#REF!"}}]
[{"$nulls":32},{"$f":"#REF!","v":{"$error":"#REF!"}},{"$f":"IF(#REF!=\"\",\"\",#REF!)","v":{"$error":"#REF!"}}]
[{"$nulls":32},{"$f":"#REF!","v":{"$error":"#REF!"}},{"$f":"IF(#REF!=\"\",\"\",#REF!)","v":{"$error":"#REF!"}}]
[{"$nulls":32},{"$f":"#REF!","v":{"$error":"#REF!"}},{"$f":"IF(#REF!=\"\",\"\",#REF!)","v":{"$error":"#REF!"}}]
[{"$nulls":32},{"$f":"#REF!","v":{"$error":"#REF!"}},{"$f":"IF(#REF!=\"\",\"\",#REF!)","v":{"$error":"#REF!"}}]
[{"$nulls":32},{"$f":"#REF!","v":{"$error":"#REF!"}},{"$f":"IF(#REF!=\"\",\"\",#REF!)","v":{"$error":"#REF!"}}]
[{"$nulls":32},{"$f":"#REF!","v":{"$error":"#REF!"}},{"$f":"IF(#REF!=\"\",\"\",#REF!)","v":{"$error":"#REF!"}}]
[{"$nulls":32},{"$f":"#REF!","v":{"$error":"#REF!"}},{"$f":"IF(#REF!=\"\",\"\",#REF!)","v":{"$error":"#REF!"}}]
[{"$nulls":32},{"$f":"#REF!","v":{"$error":"#REF!"}},{"$f":"IF(#REF!=\"\",\"\",#REF!)","v":{"$error":"#REF!"}}]
[{"$nulls":32},{"$f":"#REF!","v":{"$error":"#REF!"}},{"$f":"IF(#REF!=\"\",\"\",#REF!)","v":{"$error":"#REF!"}}]
[{"$nulls":32},{"$f":"#REF!","v":{"$error":"#REF!"}},{"$f":"IF(#REF!=\"\",\"\",#REF!)","v":{"$error":"#REF!"}}]
[{"$nulls":32},{"$f":"#REF!","v":{"$error":"#REF!"}},{"$f":"IF(#REF!=\"\",\"\",#REF!)","v":{"$error":"#REF!"}}]
[{"$nulls":32},{"$f":"#REF!","v":{"$error":"#REF!"}},{"$f":"IF(#REF!=\"\",\"\",#REF!)","v":{"$error":"#REF!"}}]
[{"$nulls":32},{"$f":"#REF!","v":{"$error":"#REF!"}},{"$f":"IF(#REF!=\"\",\"\",#REF!)","v":{"$error":"#REF!"}}]
[{"$nulls":32},{"$f":"#REF!","v":{"$error":"#REF!"}},{"$f":"IF(#REF!=\"\",\"\",#REF!)","v":{"$error":"#REF!"}}]
[{"$nulls":32},{"$f":"#REF!","v":{"$error":"#REF!"}},{"$f":"IF(#REF!=\"\",\"\",#REF!)","v":{"$error":"#REF!"}}]
[{"$nulls":32},{"$f":"#REF!","v":{"$error":"#REF!"}},{"$f":"IF(#REF!=\"\",\"\",#REF!)","v":{"$error":"#REF!"}}]
[{"$nulls":32},{"$f":"#REF!","v":{"$error":"#REF!"}},{"$f":"IF(#REF!=\"\",\"\",#REF!)","v":{"$error":"#REF!"}}]
[{"$nulls":32},{"$f":"#REF!","v":{"$error":"#REF!"}},{"$f":"IF(#REF!=\"\",\"\",#REF!)","v":{"$error":"#REF!"}}]
[{"$nulls":32},{"$f":"#REF!","v":{"$error":"#REF!"}},{"$f":"IF(#REF!=\"\",\"\",#REF!)","v":{"$error":"#REF!"}}]
[{"$nulls":32},{"$f":"#REF!","v":{"$error":"#REF!"}},{"$f":"IF(#REF!=\"\",\"\",#REF!)","v":{"$error":"#REF!"}}]
[{"$nulls":32},{"$f":"#REF!","v":{"$error":"#REF!"}},{"$f":"IF(#REF!=\"\",\"\",#REF!)","v":{"$error":"#REF!"}}]
[{"$nulls":32},{"$f":"#REF!","v":{"$error":"#REF!"}},{"$f":"IF(#REF!=\"\",\"\",#REF!)","v":{"$error":"#REF!"}}]

{"sheet":"対戦表3","index":9,"n_rows":245,"n_cols":34,"rows_kept":245}
{"$rows_empty":99}
[{"$nulls":32},{"$f":"#REF!","v":{"$error":"#REF!"}},{"$f":"IF(#REF!=\"\",\"\",#REF!)","v":{"$error":"#REF!"}}]
[{"$nulls":32},{"$f":"#REF!","v":{"$error":"#REF!"}},{"$f":"IF(#REF!=\"\",\"\",#REF!)","v":{"$error":"#REF!"}}]
[{"$nulls":32},{"$f":"#REF!","v":{"$error":"#REF!"}},{"$f":"IF(#REF!=\"\",\"\",#REF!)","v":{"$error":"#REF!"}}]
[{"$nulls":32},{"$f":"#REF!","v":{"$error":"#REF!"}},{"$f":"IF(#REF!=\"\",\"\",#REF!)","v":{"$error":"#REF!"}}]
[{"$nulls":32},{"$f":"#REF!","v":{"$error":"#REF!"}},{"$f":"IF(#REF!=\"\",\"\",#REF!)","v":{"$error":"#REF!"}}]
[{"$nulls":32},{"$f":"#REF!","v":{"$error":"#REF!"}},{"$f":"IF(#REF!=\"\",\"\",#REF!)","v":{"$error":"#REF!"}}]
[{"$nulls":32},{"$f":"#REF!","v":{"$error":"#REF!"}},{"$f":"IF(#REF!=\"\",\"\",#REF!)","v":{"$error":"#REF!"}}]
[{"$nulls":32},{"$f":"#REF!","v":{"$error":"#REF!"}},{"$f":"IF(#REF!=\"\",\"\",#REF!)","v":{"$error":"#REF!"}}]
[{"$nulls":32},{"$f":"#REF!","v":{"$error":"#REF!"}},{"$f":"IF(#REF!=\"\",\"\",#REF!)","v":{"$error":"#REF!"}}]
[{"$nulls":32},{"$f":"#REF!","v":{"$error":"#REF!"}},{"$f":"IF(#REF!=\"\",\"\",#REF!)","v":{"$error":"#REF!"}}]
[{"$nulls":32},{"$f":"#REF!","v":{"$error":"#REF!"}},{"$f":"IF(#REF!=\"\",\"\",#REF!)","v":{"$error":"#REF!"}}]
[{"$nulls":32},{"$f":"#REF!","v":{"$error":"#REF!"}},{"$f":"IF(#REF!=\"\",\"\",#REF!)","v":{"$error":"#REF!"}}]
[{"$nulls":32},{"$f":"#REF!","v":{"$error":"#REF!"}},{"$f":"IF(#REF!=\"\",\"\",#REF!)","v":{"$error":"#REF!"}}]
[{"$nulls":32},{"$f":"#REF!","v":{"$error":"#REF!"}},{"$f":"IF(#REF!=\"\",\"\",#REF!)","v":{"$error":"#REF!"}}]
[{"$nulls":32},{"$f":"#REF!","v":{"$error":"#REF!"}},{"$f":"IF(#REF!=\"\",\"\",#REF!)","v":{"$error":"#REF!"}}]
[{"$nulls":32},{"$f":"#REF!","v":{"$error":"#REF!"}},{"$f":"IF(#REF!=\"\",\"\",#REF!)","v":{"$error":"#REF!"}}]
[{"$nulls":32},{"$f":"#REF!","v":{"$error":"#REF!"}},{"$f":"IF(#REF!=\"\",\"\",#REF!)","v":{"$error":"#REF!"}}]
[{"$nulls":32},{"$f":"#REF!","v":{"$error":"#REF!"}},{"$f":"IF(#REF!=\"\",\"\",#REF!)","v":{"$error":"#REF!"}}]
[{"$nulls":32},{"$f":"#REF!","v":{"$error":"#REF!"}},{"$f":"IF(#REF!=\"\",\"\",#REF!)","v":{"$error":"#REF!"}}]
[{"$nulls":32},{"$f":"#REF!","v":{"$error":"#REF!"}},{"$f":"IF(#REF!=\"\",\"\",#REF!)","v":{"$error":"#REF!"}}]
[{"$nulls":32},{"$f":"#REF!","v":{"$error":"#REF!"}},{"$f":"IF(#REF!=\"\",\"\",#REF!)","v":{"$error":"#REF!"}}]
[{"$nulls":32},{"$f":"#REF!","v":{"$error":"#REF!"}},{"$f":"IF(#REF!=\"\",\"\",#REF!)","v":{"$error":"#REF!"}}]
[{"$nulls":32},{"$f":"#REF!","v":{"$error":"#REF!"}},{"$f":"IF(#REF!=\"\",\"\",#REF!)","v":{"$error":"#REF!"}}]
[{"$nulls":32},{"$f":"#REF!","v":{"$error":"#REF!"}},{"$f":"IF(#REF!=\"\",\"\",#REF!)","v":{"$error":"#REF!"}}]
[{"$nulls":32},{"$f":"#REF!","v":{"$error":"#REF!"}},{"$f":"IF(#REF!=\"\",\"\",#REF!)","v":{"$error":"#REF!"}}]
[{"$nulls":32},{"$f":"#REF!","v":{"$error":"#REF!"}},{"$f":"IF(#REF!=\"\",\"\",#REF!)","v":{"$error":"#REF!"}}]
[{"$nulls":32},{"$f":"#REF!","v":{"$error":"#REF!"}},{"$f":"IF(#REF!=\"\",\"\",#REF!)","v":{"$error":"#REF!"}}]
[{"$nulls":32},{"$f":"#REF!","v":{"$error":"#REF!"}},{"$f":"IF(#REF!=\"\",\"\",#REF!)","v":{"$error":"#REF!"}}]
[{"$nulls":32},{"$f":"#REF!","v":{"$error":"#REF!"}},{"$f":"IF(#REF!=\"\",\"\",#REF!)","v":{"$error":"#REF!"}}]
[{"$nulls":32},{"$f":"#REF!","v":{"$error":"#REF!"}},{"$f":"IF(#REF!=\"\",\"\",#REF!)","v":{"$error":"#REF!"}}]
[{"$nulls":32},{"$f":"#REF!","v":{"$error":"#REF!"}},{"$f":"IF(#REF!=\"\",\"\",#REF!)","v":{"$error":"#REF!"}}]
[{"$nulls":32},{"$f":"#REF!","v":{"$error":"#REF!"}},{"$f":"IF(#REF!=\"\",\"\",#REF!)","v":{"$error":"#REF!"}}]
[{"$nulls":32},{"$f":"#REF!","v":{"$error":"#REF!"}},{"$f":"IF(#REF!=\"\",\"\",#REF!)","v":{"$error":"#REF!"}}]
[{"$nulls":32},{"$f":"#REF!","v":{"$error":"#REF!"}},{"$f":"IF(#REF!=\"\",\"\",#REF!)","v":{"$error":"#REF!"}}]
[{"$nulls":32},{"$f":"#REF!","v":{"$error":"#REF!"}},{"$f":"IF(#REF!=\"\",\"\",#REF!)","v":{"$error":"#REF!"}}]
[{"$nulls":32},{"$f":"#REF!","v":{"$error":"#REF!"}},{"$f":"IF(#REF!=\"\",\"\",#REF!)","v":{"$error":"#REF!"}}]
[{"$nulls":32},{"$f":"#REF!","v":{"$error":"#REF!"}},{"$f":"IF(#REF!=\"\",\"\",#REF!)","v":{"$error":"#REF!"}}]
[{"$nulls":32},{"$f":"#REF!","v":{"$error":"#REF!"}},{"$f":"IF(#REF!=\"\",\"\",#REF!)","v":{"$error":"#REF!"}}]
[{"$nulls":32},{"$f":"#REF!","v":{"$error":"#REF!"}},{"$f":"IF(#REF!=\"\",\"\",#REF!)","v":{"$error":"#REF!"}}]
[{"$nulls":32},{"$f":"#REF!","v":{"$error":"#REF!"}},{"$f":"IF(#REF!=\"\",\"\",#REF!)","v":{"$error":"#REF!"}}]
[{"$nulls":32},{"$f":"#REF!","v":{"$error":"#REF!"}},{"$f":"IF(#REF!=\"\",\"\",#REF!)","v":{"$error":"#REF!"}}]
[{"$nulls":32},{"$f":"#REF!","v":{"$error":"#REF!"}},{"$f":"IF(#REF!=\"\",\"\",#REF!)","v":{"$error":"#REF!"}}]
[{"$nulls":32},{"$f":"#REF!","v":{"$error":"#REF!"}},{"$f":"IF(#REF!=\"\",\"\",#REF!)","v":{"$error":"#REF!"}}]
[{"$nulls":32},{"$f":"#REF!","v":{"$error":"#REF!"}},{"$f":"IF(#REF!=\"\",\"\",#REF!)","v":{"$error":"#REF!"}}]
[{"$nulls":32},{"$f":"#REF!","v":{"$error":"#REF!"}},{"$f":"IF(#REF!=\"\",\"\",#REF!)","v":{"$error":"#REF!"}}]
[{"$nulls":32},{"$f":"#REF!","v":{"$error":"#REF!"}},{"$f":"IF(#REF!=\"\",\"\",#REF!)","v":{"$error":"#REF!"}}]
[{"$nulls":32},{"$f":"#REF!","v":{"$error":"#REF!"}},{"$f":"IF(#REF!=\"\",\"\",#REF!)","v":{"$error":"#REF!"}}]
[{"$nulls":32},{"$f":"#REF!","v":{"$error":"#REF!"}},{"$f":"IF(#REF!=\"\",\"\",#REF!)","v":{"$error":"#REF!"}}]
[{"$nulls":32},{"$f":"#REF!","v":{"$error":"#REF!"}},{"$f":"IF(#REF!=\"\",\"\",#REF!)","v":{"$error":"#REF!"}}]
[{"$nulls":32},{"$f":"#REF!","v":{"$error":"#REF!"}},{"$f":"IF(#REF!=\"\",\"\",#REF!)","v":{"$error":"#REF!"}}]
[{"$nulls":32},{"$f":"#REF!","v":{"$error":"#REF!"}},{"$f":"IF(#REF!=\"\",\"\",#REF!)","v":{"$error":"#REF!"}}]
[{"$nulls":32},{"$f":"#REF!","v":{"$error":"#REF!"}},{"$f":"IF(#REF!=\"\",\"\",#REF!)","v":{"$error":"#REF!"}}]
[{"$nulls":32},{"$f":"#REF!","v":{"$error":"#REF!"}},{"$f":"IF(#REF!=\"\",\"\",#REF!)","v":{"$error":"#REF!"}}]
[{"$nulls":32},{"$f":"#REF!","v":{"$error":"#REF!"}},{"$f":"IF(#REF!=\"\",\"\",#REF!)","v":{"$error":"#REF!"}}]
[{"$nulls":32},{"$f":"#REF!","v":{"$error":"#REF!"}},{"$f":"IF(#REF!=\"\",\"\",#REF!)","v":{"$error":"#REF!"}}]
[{"$nulls":32},{"$f":"#REF!","v":{"$error":"#REF!"}},{"$f":"IF(#REF!=\"\",\"\",#REF!)","v":{"$error":"#REF!"}}]
[{"$nulls":32},{"$f":"#REF!","v":{"$error":"#REF!"}},{"$f":"IF(#REF!=\"\",\"\",#REF!)","v":{"$error":"#REF!"}}]
[{"$nulls":32},{"$f":"#REF!","v":{"$error":"#REF!"}},{"$f":"IF(#REF!=\"\",\"\",#REF!)","v":{"$error":"#REF!"}}]
[{"$nulls":32},{"$f":"#REF!","v":{"$error":"#REF!"}},{"$f":"IF(#REF!=\"\",\"\",#REF!)","v":{"$error":"#REF!"}}]
[{"$nulls":32},{"$f":"#REF!","v":{"$error":"#REF!"}},{"$f":"IF(#REF!=\"\",\"\",#REF!)","v":{"$error":"#REF!"}}]
[{"$nulls":32},{"$f":"#REF!","v":{"$error":"#REF!"}},{"$f":"IF(#REF!=\"\",\"\",#REF!)","v":{"$error":"#REF!"}}]
[{"$nulls":32},{"$f":"#REF!","v":{"$error":"#REF!"}},{"$f":"IF(#REF!=\"\",\"\",#REF!)","v":{"$error":"#REF!"}}]
[{"$nulls":32},{"$f":"#REF!","v":{"$error":"#REF!"}},{"$f":"IF(#REF!=\"\",\"\",#REF!)","v":{"$error":"#REF!"}}]
[{"$nulls":32},{"$f":"#REF!","v":{"$error":"#REF!"}},{"$f":"IF(#REF!=\"\",\"\",#REF!)","v":{"$error":"#REF!"}}]
[{"$nulls":32},{"$f":"#REF!","v":{"$error":"#REF!"}},{"$f":"IF(#REF!=\"\",\"\",#REF!)","v":{"$error":"#REF!"}}]
[{"$nulls":32},{"$f":"#REF!","v":{"$error":"#REF!"}},{"$f":"IF(#REF!=\"\",\"\",#REF!)","v":{"$error":"#REF!"}}]
[{"$nulls":32},{"$f":"#REF!","v":{"$error":"#REF!"}},{"$f":"IF(#REF!=\"\",\"\",#REF!)","v":{"$error":"#REF!"}}]
[{"$nulls":32},{"$f":"#REF!","v":{"$error":"#REF!"}},{"$f":"IF(#REF!=\"\",\"\",#REF!)","v":{"$error":"#REF!"}}]
[{"$nulls":32},{"$f":"#REF!","v":{"$error":"#REF!"}},{"$f":"IF(#REF!=\"\",\"\",#REF!)","v":{"$error":"#REF!"}}]
[{"$nulls":32},{"$f":"#REF!","v":{"$error":"#REF!"}},{"$f":"IF(#REF!=\"\",\"\",#REF!)","v":{"$error":"#REF!"}}]
[{"$nulls":32},{"$f":"#REF!","v":{"$error":"#REF!"}},{"$f":"IF(#REF!=\"\",\"\",#REF!)","v":{"$error":"#REF!"}}]
[{"$nulls":32},{"$f":"#REF!","v":{"$error":"#REF!"}},{"$f":"IF(#REF!=\"\",\"\",#REF!)","v":{"$error":"#REF!"}}]
[{"$nulls":32},{"$f":"#REF!","v":{"$error":"#REF!"}},{"$f":"IF(#REF!=\"\",\"\",#REF!)","v":{"$error":"#REF!"}}]
[{"$nulls":32},{"$f":"#REF!","v":{"$error":"#REF!"}},{"$f":"IF(#REF!=\"\",\"\",#REF!)","v":{"$error":"#REF!"}}]
[{"$nulls":32},{"$f":"#REF!","v":{"$error":"#REF!"}},{"$f":"IF(#REF!=\"\",\"\",#REF!)","v":{"$error":"#REF!"}}]
[{"$nulls":32},{"$f":"#REF!","v":{"$error":"#REF!"}},{"$f":"IF(#REF!=\"\",\"\",#REF!)","v":{"$error":"#REF!"}}]
[{"$nulls":32},{"$f":"#REF!","v":{"$error":"#REF!"}},{"$f":"IF(#REF!=\"\",\"\",#REF!)","v":{"$error":"#REF!"}}]
[{"$nulls":32},{"$f":"#REF!","v":{"$error":"#REF!"}},{"$f":"IF(#REF!=\"\",\"\",#REF!)","v":{"$error":"#REF!"}}]
[{"$nulls":32},{"$f":"#REF!","v":{"$error":"#REF!"}},{"$f":"IF(#REF!=\"\",\"\",#REF!)","v":{"$error":"#REF!"}}]
[{"$nulls":32},{"$f":"#REF!","v":{"$error":"#REF!"}},{"$f":"IF(#REF!=\"\",\"\",#REF!)","v":{"$error":"#REF!"}}]
[{"$nulls":32},{"$f":"#REF!","v":{"$error":"#REF!"}},{"$f":"IF(#REF!=\"\",\"\",#REF!)","v":{"$error":"#REF!"}}]
[{"$nulls":32},{"$f":"#REF!","v":{"$error":"#REF!"}},{"$f":"IF(#REF!=\"\",\"\",#REF!)","v":{"$error":"#REF!"}}]
[{"$nulls":32},{"$f":"#REF!","v":{"$error":"#REF!"}},{"$f":"IF(#REF!=\"\",\"\",#REF!)","v":{"$error":"#REF!"}}]
[{"$nulls":32},{"$f":"#REF!","v":{"$error":"#REF!"}},{"$f":"IF(#REF!=\"\",\"\",#REF!)","v":{"$error":"#REF!"}}]
[{"$nulls":32},{"$f":"#REF!","v":{"$error":"#REF!"}},{"$f":"IF(#REF!=\"\",\"\",#REF!)","v":{"$error":"#REF!"}}]
[{"$nulls":32},{"$f":"#REF!","v":{"$error":"#REF!"}},{"$f":"IF(#REF!=\"\",\"\",#REF!)","v":{"$error":"#REF!"}}]
[{"$nulls":32},{"$f":"#REF!","v":{"$error":"#REF!"}},{"$f":"IF(#REF!=\"\",\"\",#REF!)","v":{"$error":"#REF!"}}]
[{"$nulls":32},{"$f":"#REF!","v":{"$error":"#REF!"}},{"$f":"IF(#REF!=\"\",\"\",#REF!)","v":{"$error":"#REF!"}}]
[{"$nulls":32},{"$f":"#REF!","v":{"$error":"#REF!"}},{"$f":"IF(#REF!=\"\",\"\",#REF!)","v":{"$error":"#REF!"}}]
[{"$nulls":32},{"$f":"#REF!","v":{"$error":"#REF!"}},{"$f":"IF(#REF!=\"\",\"\",#REF!)","v":{"$error":"#REF!"}}]
[{"$nulls":32},{"$f":"#REF!","v":{"$error":"#REF!"}},{"$f":"IF(#REF!=\"\",\"\",#REF!)","v":{"$error":"#REF!"}}]
[{"$nulls":32},{"$f":"#REF!","v":{"$error":"#REF!"}},{"$f":"IF(#REF!=\"\",\"\",#REF!)","v":{"$error":"#REF!"}}]
[{"$nulls":32},{"$f":"#REF!","v":{"$error":"#REF!"}},{"$f":"IF(#REF!=\"\",\"\",#REF!)","v":{"$error":"#REF!"}}]
[{"$nulls":32},{"$f":"#REF!","v":{"$error":"#REF!"}},{"$f":"IF(#REF!=\"\",\"\",#REF!)","v":{"$error":"#REF!"}}]
[{"$nulls":32},{"$f":"#REF!","v":{"$error":"#REF!"}},{"$f":"IF(#REF!=\"\",\"\",#REF!)","v":{"$error":"#REF!"}}]
[{"$nulls":32},{"$f":"#REF!","v":{"$error":"#REF!"}},{"$f":"IF(#REF!=\"\",\"\",#REF!)","v":{"$error":"#REF!"}}]
[{"$nulls":32},{"$f":"#REF!","v":{"$error":"#REF!"}},{"$f":"IF(#REF!=\"\",\"\",#REF!)","v":{"$error":"#REF!"}}]
[{"$nulls":32},{"$f":"#REF!","v":{"$error":"#REF!"}},{"$f":"IF(#REF!=\"\",\"\",#REF!)","v":{"$error":"#REF!"}}]
[{"$nulls":32},{"$f":"#REF!","v":{"$error":"#REF!"}},{"$f":"IF(#REF!=\"\",\"\",#REF!)","v":{"$error":"#REF!"}}]
[{"$nulls":32},{"$f":"#REF!","v":{"$error":"#REF!"}},{"$f":"IF(#REF!=\"\",\"\",#REF!)","v":{"$error":"#REF!"}}]
[{"$nulls":32},{"$f":"#REF!","v":{"$error":"#REF!"}},{"$f":"IF(#REF!=\"\",\"\",#REF!)","v":{"$error":"#REF!"}}]
[{"$nulls":32},{"$f":"#REF!","v":{"$error":"#REF!"}},{"$f":"IF(#REF!=\"\",\"\",#REF!)","v":{"$error":"#REF!"}}]
[{"$nulls":32},{"$f":"#REF!","v":{"$error":"#REF!"}},{"$f":"IF(#REF!=\"\",\"\",#REF!)","v":{"$error":"#REF!"}}]
[{"$nulls":32},{"$f":"#REF!","v":{"$error":"#REF!"}},{"$f":"IF(#REF!=\"\",\"\",#REF!)","v":{"$error":"#REF!"}}]
[{"$nulls":32},{"$f":"#REF!","v":{"$error":"#REF!"}},{"$f":"IF(#REF!=\"\",\"\",#REF!)","v":{"$error":"#REF!"}}]
[{"$nulls":32},{"$f":"#REF!","v":{"$error":"#REF!"}},{"$f":"IF(#REF!=\"\",\"\",#REF!)","v":{"$error":"#REF!"}}]
[{"$nulls":32},{"$f":"#REF!","v":{"$error":"#REF!"}},{"$f":"IF(#REF!=\"\",\"\",#REF!)","v":{"$error":"#REF!"}}]
[{"$nulls":32},{"$f":"#REF!","v":{"$error":"#REF!"}},{"$f":"IF(#REF!=\"\",\"\",#REF!)","v":{"$error":"#REF!"}}]
[{"$nulls":32},{"$f":"#REF!","v":{"$error":"#REF!"}},{"$f":"IF(#REF!=\"\",\"\",#REF!)","v":{"$error":"#REF!"}}]
[{"$nulls":32},{"$f":"#REF!","v":{"$error":"#REF!"}},{"$f":"IF(#REF!=\"\",\"\",#REF!)","v":{"$error":"#REF!"}}]
[{"$nulls":32},{"$f":"#REF!","v":{"$error":"#REF!"}},{"$f":"IF(#REF!=\"\",\"\",#REF!)","v":{"$error":"#REF!"}}]
[{"$nulls":32},{"$f":"#REF!","v":{"$error":"#REF!"}},{"$f":"IF(#REF!=\"\",\"\",#REF!)","v":{"$error":"#REF!"}}]
[{"$nulls":32},{"$f":"#REF!","v":{"$error":"#REF!"}},{"$f":"IF(#REF!=\"\",\"\",#REF!)","v":{"$error":"#REF!"}}]
[{"$nulls":32},{"$f":"#REF!","v":{"$error":"#REF!"}},{"$f":"IF(#REF!=\"\",\"\",#REF!)","v":{"$error":"#REF!"}}]
[{"$nulls":32},{"$f":"#REF!","v":{"$error":"#REF!"}},{"$f":"IF(#REF!=\"\",\"\",#REF!)","v":{"$error":"#REF!"}}]
[{"$nulls":32},{"$f":"#REF!","v":{"$error":"#REF!"}},{"$f":"IF(#REF!=\"\",\"\",#REF!)","v":{"$error":"#REF!"}}]
[{"$nulls":32},{"$f":"#REF!","v":{"$error":"#REF!"}},{"$f":"IF(#REF!=\"\",\"\",#REF!)","v":{"$error":"#REF!"}}]
[{"$nulls":32},{"$f":"#REF!","v":{"$error":"#REF!"}},{"$f":"IF(#REF!=\"\",\"\",#REF!)","v":{"$error":"#REF!"}}]
[{"$nulls":32},{"$f":"#REF!","v":{"$error":"#REF!"}},{"$f":"IF(#REF!=\"\",\"\",#REF!)","v":{"$error":"#REF!"}}]
[{"$nulls":32},{"$f":"#REF!","v":{"$error":"#REF!"}},{"$f":"IF(#REF!=\"\",\"\",#REF!)","v":{"$error":"#REF!"}}]
[{"$nulls":32},{"$f":"#REF!","v":{"$error":"#REF!"}},{"$f":"IF(#REF!=\"\",\"\",#REF!)","v":{"$error":"#REF!"}}]
[{"$nulls":32},{"$f":"#REF!","v":{"$error":"#REF!"}},{"$f":"IF(#REF!=\"\",\"\",#REF!)","v":{"$error":"#REF!"}}]
[{"$nulls":32},{"$f":"#REF!","v":{"$error":"#REF!"}},{"$f":"IF(#REF!=\"\",\"\",#REF!)","v":{"$error":"#REF!"}}]
[{"$nulls":32},{"$f":"#REF!","v":{"$error":"#REF!"}},{"$f":"IF(#REF!=\"\",\"\",#REF!)","v":{"$error":"#REF!"}}]
[{"$nulls":32},{"$f":"#REF!","v":{"$error":"#REF!"}},{"$f":"IF(#REF!=\"\",\"\",#REF!)","v":{"$error":"#REF!"}}]
[{"$nulls":32},{"$f":"#REF!","v":{"$error":"#REF!"}},{"$f":"IF(#REF!=\"\",\"\",#REF!)","v":{"$error":"#REF!"}}]
[{"$nulls":32},{"$f":"#REF!","v":{"$error":"#REF!"}},{"$f":"IF(#REF!=\"\",\"\",#REF!)","v":{"$error":"#REF!"}}]
[{"$nulls":32},{"$f":"#REF!","v":{"$error":"#REF!"}},{"$f":"IF(#REF!=\"\",\"\",#REF!)","v":{"$error":"#REF!"}}]
[{"$nulls":32},{"$f":"#REF!","v":{"$error":"#REF!"}},{"$f":"IF(#REF!=\"\",\"\",#REF!)","v":{"$error":"#REF!"}}]
[{"$nulls":32},{"$f":"#REF!","v":{"$error":"#REF!"}},{"$f":"IF(#REF!=\"\",\"\",#REF!)","v":{"$error":"#REF!"}}]
[{"$nulls":32},{"$f":"#REF!","v":{"$error":"#REF!"}},{"$f":"IF(#REF!=\"\",\"\",#REF!)","v":{"$error":"#REF!"}}]
[{"$nulls":32},{"$f":"#REF!","v":{"$error":"#REF!"}},{"$f":"IF(#REF!=\"\",\"\",#REF!)","v":{"$error":"#REF!"}}]
[{"$nulls":32},{"$f":"#REF!","v":{"$error":"#REF!"}},{"$f":"IF(#REF!=\"\",\"\",#REF!)","v":{"$error":"#REF!"}}]
[{"$nulls":32},{"$f":"#REF!","v":{"$error":"#REF!"}},{"$f":"IF(#REF!=\"\",\"\",#REF!)","v":{"$error":"#REF!"}}]
[{"$nulls":32},{"$f":"#REF!","v":{"$error":"#REF!"}},{"$f":"IF(#REF!=\"\",\"\",#REF!)","v":{"$error":"#REF!"}}]
[{"$nulls":32},{"$f":"#REF!","v":{"$error":"#REF!"}},{"$f":"IF(#REF!=\"\",\"\",#REF!)","v":{"$error":"#REF!"}}]
[{"$nulls":32},{"$f":"#REF!","v":{"$error":"#REF!"}},{"$f":"IF(#REF!=\"\",\"\",#REF!)","v":{"$error":"#REF!"}}]
[{"$nulls":32},{"$f":"#REF!","v":{"$error":"#REF!"}},{"$f":"IF(#REF!=\"\",\"\",#REF!)","v":{"$error":"#REF!"}}]
[{"$nulls":32},{"$f":"#REF!","v":{"$error":"#REF!"}},{"$f":"IF(#REF!=\"\",\"\",#REF!)","v":{"$error":"#REF!"}}]
[{"$nulls":32},{"$f":"#REF!","v":{"$error":"#REF!"}},{"$f":"IF(#REF!=\"\",\"\",#REF!)","v":{"$error":"#REF!"}}]
[{"$nulls":32},{"$f":"#REF!","v":{"$error":"#REF!"}},{"$f":"IF(#REF!=\"\",\"\",#REF!)","v":{"$error":"#REF!"}}]
[{"$nulls":32},{"$f":"#REF!","v":{"$error":"#REF!"}},{"$f":"IF(#REF!=\"\",\"\",#REF!)","v":{"$error":"#REF!"}}]
[{"$nulls":32},{"$f":"#REF!","v":{"$error":"#REF!"}},{"$f":"IF(#REF!=\"\",\"\",#REF!)","v":{"$error":"#REF!"}}]
[{"$nulls":32},{"$f":"#REF!","v":{"$error":"#REF!"}},{"$f":"IF(#REF!=\"\",\"\",#REF!)","v":{"$error":"#REF!"}}]
[{"$nulls":32},{"$f":"#REF!","v":{"$error":"#REF!"}},{"$f":"IF(#REF!=\"\",\"\",#REF!)","v":{"$error":"#REF!"}}]
[{"$nulls":32},{"$f":"#REF!","v":{"$error":"#REF!"}},{"$f":"IF(#REF!=\"\",\"\",#REF!)","v":{"$error":"#REF!"}}]

{"sheet":"組合表","index":10,"n_rows":72,"n_cols":39,"rows_kept":72,"merged":[[2,32,2,33],[2,34,2,35],[2,36,2,37]]}
[{"$nulls":25},35]
[{"$nulls":25},69]
[1,2,3,4,5,6,7,8,9,10,11,12,13,14,15,16,17,18,19,20,21,22,23,24,25,{"$nulls":7},"Bート",null,"Cコート",null,"Dコート"]
[null,4,"A","A1A2","A3A4","A2A3","A1A4","A1A3","A2A4",{"$nulls":17},"A1A2",null,"A1A2","B1B2",null,null,{"$f":"LEFT(AC4,2)","v":"A1"},{"$f":"RIGHT(AC4,2)","v":"A2"},{"$f":"LEFT(AD4,2)","v":"B1"},{"$f":"RIGHT(AD4,2)","v":"B2"},{"$f":"LEFT(AE4,2)","v":""},{"$f":"RIGHT(AE4,2)","v":""},1]
[null,4,"B","B1B2","B3B4","B2B3","B1B4","B1B3","B2B4",{"$nulls":17},"B1B2",null,"C1C2","D1D2",null,null,{"$f":"LEFT(AC5,2)","v":"C1"},{"$f":"RIGHT(AC5,2)","v":"C2"},{"$f":"LEFT(AD5,2)","v":"D1"},{"$f":"RIGHT(AD5,2)","v":"D2"},{"$f":"LEFT(AE5,2)","v":""},{"$f":"RIGHT(AE5,2)","v":""},2]
[null,4,"C","C1C2","C3C4","C2C3","C1C4","C1C3","C2C4",{"$nulls":17},"C1C2",null,"K1K2","L1L2",null,null,"K1","K2","L1","L2","","",3]
[null,4,"D","D1D2","D3D4","D2D3","D1D4","D1D3","D2D4",{"$nulls":17},"D1D2",null,"M1M2","E1E2",null,null,"M1","M2","E1","E2","","",4]
[null,4,"K","K1K2","K3K4","K2K3","K1K4","K1K3","K2K4",{"$nulls":17},"K1K2",null,"F1F2","G1G2",null,null,"F1","F2","G1","G2","","",5]
[null,4,"L","L1L2","L3L4","L2L3","L1L4","L1L3","L2L4",{"$nulls":17},"L1L2",null,"H1H2","I1I2",null,null,"H1","H2","I1","I2","","",6]
[null,4,"M","M1M2","M3M4","M2M3","M1M4","M1M3","M2M4",{"$nulls":17},"M1M2",null,"J1J2","N1N2",null,null,"J1","J2","N1","N2","","",7]
[null,3,"E","E1E2","E2E3","E1E3",{"$nulls":20},"E1E2",null,"O1O2","P1P2",null,null,"O1","O2","P1","P2","","",8]
[null,3,"F","F1F2","F2F3","F1F3",{"$nulls":20},"F1F2",null,"A3A4","B3B4",null,null,"A3","A4","B3","B4","","",9]
[null,3,"G","G1G2","G2G3","G1G3",{"$nulls":20},"G1G2",null,"C3C4","D3D4",null,null,"C3","C4","D3","D4","","",10]
[null,3,"H","H1H2","H2H3","H1H3",{"$nulls":20},"H1H2",null,"K3K4","L3L4",null,null,"K3","K4","L3","L4","","",11]
[null,3,"I","I1I2","I2I3","I1I3",{"$nulls":20},"I1I2",null,"M3M4","E2E3",null,null,"M3","M4","E2","E3","","",12]
[null,3,"J","J1J2","J2J3","J1J3",{"$nulls":20},"J1J2",null,"F2F3","G2G3",null,null,"F2","F3","G2","G3","","",13]
[null,3,"N","N1N2","N2N3","N1N3",{"$nulls":20},"N1N2",null,"H2H3","I2I3",null,null,"H2","H3","I2","I3","","",14]
[null,3,"O","O1O2","O2O3","O1O3",{"$nulls":20},"O1O2",null,"J2J3","N2N3",null,null,"J2","J3","N2","N3","","",15]
[null,3,"P","P1P2","P2P3","P1P3",{"$nulls":20},"P1P2",null,"O2O3","P2P3",null,null,"O2","O3","P2","P3","","",16]
[{"$nulls":26},"A3A4",null,"A2A3","B2B3",null,null,"A2","A3","B2","B3","","",17]
[{"$nulls":26},"B3B4",null,"C2C3","D2D3",null,null,"C2","C3","D2","D3","","",18]
[{"$nulls":26},"C3C4",null,"K2K3","L2L3",null,null,"K2","K3","L2","L3","","",19]
[{"$nulls":26},"D3D4",null,"M2M3","E1E3",null,null,"M2","M3","E1","E3","","",20]
[{"$nulls":26},"K3K4",null,"F1F3","G1G3",null,null,"F1","F3","G1","G3","","",21]
[{"$nulls":26},"L3L4",null,"H1H3","I1I3",null,null,"H1","H3","I1","I3","","",22]
[{"$nulls":26},"M3M4",null,"J1J3","N1N3",null,null,"J1","J3","N1","N3","","",23]
[{"$nulls":3},1,2,3,4,5,6,7,8,9,10,11,12,13,14,15,16,17,18,19,20,"21",null,null,"E2E3",null,"O1O3","P1P3",null,null,"O1","O3","P1","P3","","",24]
["７チーム",null,"C",{"$f":"CONCATENATE(C28,1,C28,2)","v":"C1C2"},{"$f":"CONCATENATE(C28,3,C28,4)","v":"C3C4"},{"$f":"CONCATENATE(C28,5,C28,6)","v":"C5C6"},{"$f":"CONCATENATE(C28,1,C28,7)","v":"C1C7"},{"$f":"CONCATENATE(C28,2,C28,3)","v":"C2C3"},{"$f":"CONCATENATE(C28,4,C28,5)","v":"C4C5"},{"$f":"CONCATENATE(C28,6,C28,7)","v":"C6C7"},{"$f":"CONCATENATE(C28,1,C28,4)","v":"C1C4"},{"$f":"CONCATENATE(C28,2,C28,5)","v":"C2C5"},{"$f":"CONCATENATE(C28,3,C28,6)","v":"C3C6"},{"$f":"CONCATENATE(C28,4,C28,7)","v":"C4C7"},{"$f":"CONCATENATE(C28,1,C28,6)","v":"C1C6"},{"$f":"CONCATENATE(C28,5,C28,7)","v":"C5C7"},{"$f":"CONCATENATE(C28,1,C28,3)","v":"C1C3"},{"$f":"CONCATENATE(C28,2,C28,4)","v":"C2C4"},{"$f":"CONCATENATE(C28,3,C28,5)","v":"C3C5"},{"$f":"CONCATENATE(C28,4,C28,6)","v":"C4C6"},{"$f":"CONCATENATE(C28,2,C28,7)","v":"C2C7"},{"$f":"CONCATENATE(C28,1,C28,5)","v":"C1C5"},{"$f":"CONCATENATE(C28,2,C28,6)","v":"C2C6"},{"$f":"CONCATENATE(C28,3,C28,7)","v":"C3C7"},null,null,"F2F3",null,"A1A4","B1B4",null,null,"A1","A4","B1","B4","","",25]
["6チーム",null,"B",{"$f":"CONCATENATE(C29,1,C29,2)","v":"B1B2"},{"$f":"CONCATENATE(C29,3,C29,4)","v":"B3B4"},{"$f":"CONCATENATE(C29,5,C29,6)","v":"B5B6"},{"$f":"CONCATENATE(C29,1,C29,3)","v":"B1B3"},{"$f":"CONCATENATE(C29,2,C29,4)","v":"B2B4"},{"$f":"CONCATENATE(C29,3,C29,5)","v":"B3B5"},{"$f":"CONCATENATE(C29,4,C29,6)","v":"B4B6"},{"$f":"CONCATENATE(C29,1,C29,5)","v":"B1B5"},{"$f":"CONCATENATE(C29,2,C29,6)","v":"B2B6"},{"$f":"CONCATENATE(C29,1,C29,4)","v":"B1B4"},{"$f":"CONCATENATE(C29,2,C29,5)","v":"B2B5"},{"$f":"CONCATENATE(C29,3,C29,6)","v":"B3B6"},{"$f":"CONCATENATE(C29,4,C29,5)","v":"B4B5"},{"$f":"CONCATENATE(C29,2,C29,3)","v":"B2B3"},{"$f":"CONCATENATE(C29,1,C29,6)","v":"B1B6"},{"$nulls":8},"G2G3",null,"C1C4","D1D4",null,null,"C1","C4","D1","D4","","",26]
["5チーム",null,"N",{"$f":"CONCATENATE(C30,1,C30,2)","v":"N1N2"},{"$f":"CONCATENATE(C30,3,C30,4)","v":"N3N4"},{"$f":"CONCATENATE(C30,1,C30,5)","v":"N1N5"},{"$f":"CONCATENATE(C30,2,C30,3)","v":"N2N3"},{"$f":"CONCATENATE(C30,4,C30,5)","v":"N4N5"},{"$f":"CONCATENATE(C30,1,C30,4)","v":"N1N4"},{"$f":"CONCATENATE(C30,2,C30,5)","v":"N2N5"},{"$f":"CONCATENATE(C30,1,C30,3)","v":"N1N3"},{"$f":"CONCATENATE(C30,2,C30,4)","v":"N2N4"},{"$f":"CONCATENATE(C30,3,C30,5)","v":"N3N5"},{"$nulls":13},"H2H3",null,"K1K4","L1L4",null,null,"K1","K4","L1","L4","","",27]
["4チーム",null,"M",{"$f":"CONCATENATE(C31,1,C31,2)","v":"M1M2"},{"$f":"CONCATENATE(C31,3,C31,4)","v":"M3M4"},{"$f":"CONCATENATE(C31,2,C31,3)","v":"M2M3"},{"$f":"CONCATENATE(C31,1,C31,4)","v":"M1M4"},{"$f":"CONCATENATE(C31,1,C31,3)","v":"M1M3"},{"$f":"CONCATENATE(C31,2,C31,4)","v":"M2M4"},{"$nulls":17},"I2I3",null,"M1M4","A1A3",null,null,"M1","M4","A1","A3","","",28]
["3チーム",null,"P",{"$f":"CONCATENATE(C32,1,C32,2)","v":"P1P2"},{"$f":"CONCATENATE(C32,2,C32,3)","v":"P2P3"},{"$f":"CONCATENATE(C32,1,C32,3)","v":"P1P3"},{"$nulls":20},"J2J3",null,"B1B3","C1C3",null,null,"B1","B3","C1","C3","","",29]
[{"$nulls":26},"N2N3",null,"D1D3","K1K3",null,null,"D1","D3","K1","K3","","",30]
[{"$nulls":26},"O2O3",null,"L1L3","M1M3",null,null,"L1","L3","M1","M3","","",31]
[{"$nulls":26},"P2P3",null,"A2A4","B2B4",null,null,"A2","A4","B2","B4","","",32]
[{"$nulls":26},"A2A3",null,"C2C4","D2D4",null,null,"C2","C4","D2","D4","","",33]
[{"$nulls":26},"B2B3",null,"K2K4","L2L4",null,null,"K2","K4","L2","L4","","",34]
[{"$nulls":26},"C2C3",null,"M2M4",{"$nulls":3},{"$f":"LEFT(AC38,2)","v":"M2"},{"$f":"RIGHT(AC38,2)","v":"M4"},{"$f":"LEFT(AD38,2)","v":""},{"$f":"RIGHT(AD38,2)","v":""},{"$f":"LEFT(AE38,2)","v":""},{"$f":"RIGHT(AE38,2)","v":""},35]
[{"$nulls":26},"D2D3",{"$nulls":5},"","","","","","",36]
[{"$nulls":26},"K2K3",{"$nulls":5},"","","","","","",37]
[{"$nulls":26},"L2L3",{"$nulls":5},"","","","","","",38]
[{"$nulls":26},"M2M3",{"$nulls":5},"","","","","","",39]
[{"$nulls":26},"E1E3",{"$nulls":5},"","","","","","",40]
[{"$nulls":26},"F1F3"]
[{"$nulls":26},"G1G3"]
[{"$nulls":26},"H1H3"]
[{"$nulls":26},"I1I3"]
[{"$nulls":26},"J1J3"]
[{"$nulls":26},"N1N3"]
[{"$nulls":26},"O1O3"]
[{"$nulls":26},"P1P3"]
[{"$nulls":26},"A1A4"]
[{"$nulls":26},"B1B4"]
[{"$nulls":26},"C1C4"]
[{"$nulls":26},"D1D4"]
[{"$nulls":26},"K1K4"]
[{"$nulls":26},"L1L4"]
[{"$nulls":26},"M1M4"]
[{"$nulls":26},"A1A3"]
[{"$nulls":26},"B1B3"]
[{"$nulls":26},"C1C3"]
[{"$nulls":26},"D1D3"]
[{"$nulls":26},"K1K3"]
[{"$nulls":26},"L1L3"]
[{"$nulls":26},"M1M3"]
[{"$nulls":26},"A2A4"]
[{"$nulls":26},"B2B4"]
[{"$nulls":26},"C2C4"]
[{"$nulls":26},"D2D4"]
[{"$nulls":26},"K2K4"]
[{"$nulls":26},"L2L4"]
[{"$nulls":26},"M2M4"]