{"text_format":"3","workbook":"xlsx","n_sheets":11,"sheets":["チーム表","対戦表","リーグ戦表","トーナメント表","表彰状","DATA","DATA1","対戦表1","対戦表2","対戦表3","組合表"],"not_rendered":{"images":9,"macros":1,"defined_names":4},"read":"whole","date_system":"1900"}

{"sheet":"チーム表","index":0,"n_rows":58,"n_cols":7,"rows_kept":58,"merged":[[0,1,0,5],[1,1,1,5]]}
[null,"第２７回　いしかわスポーツ・レクリエーション交流大会\n「第１１回ふれあいドッジボール大会」"]
[null,"参　加　チ　ー　ム"]
[null,"番号","ﾌﾞﾛｯｸ","チ　ー　ム　名","代表者名","県　名"]
[null,1,"A1","下関福光サンダージュニア","中澤　美樹子","富　山"]
[null,2,"A2","NISHIファイヤースターズ","足滝　信雄","石　川"]
[null,3,"A3","小木クラブ","福田　陽三","石　川"]
{"$rows_left_out":53}
{"sheet":"対戦表","index":1,"n_rows":166,"n_cols":34,"rows_kept":166,"merged":[[0,0,0,20],[1,0,1,20],[38,5,38,10],[38,15,38,20],[38,25,38,30],[39,5,39,10],[39,15,39,20],[39,25,39,30],[40,5,40,10],[40,15,40,20],[40,25,40,30],[41,5,41,10],[41,15,41,20],[42,5,42,10],[42,15,42,20],[42,25,42,30],[43,5,43,10],[43,25,43,30],[44,5,44,10],[44,15,44,20],[44,25,44,30],[45,5,45,10],[45,15,45,20],[46,5,46,10],[46,15,46,20],[47,5,47,10],[47,15,47,20],[48,5,48,10],[48,15,48,20],[48,25,48,30]]}
[{"$f":"チーム表!$B$1","v":"第２７回　いしかわスポーツ・レクリエーション交流大会\n「第１１回ふれあいドッジボール大会」"},{"$nulls":28},"予選試合数",31]
["　試合スケジュール",{"$nulls":24},"最大試合数４０",{"$nulls":3},"注意：",null,null,"行挿入は行わないで下さい。"]
[null,"時間",null,null,"点","Ａコート",{"$nulls":3},"点","Ａコート",{"$nulls":3},"点","Ｂコート",{"$nulls":3},"点","Ｂコート"]
[1,"09:30:00",{"$f":"組合表!AG4","v":"A1"},{"$f":"CONCATENATE(C4,H4)","v":"A1A2"},11,{"$f":"VLOOKUP(C4,チーム表!C:D,2,FALSE)","v":"下関福光サンダージュニア"},"×",{"$f":"組合表!AH4","v":"A2"},{"$f":"CONCATENATE(H4,C4)","v":"A2A1"},4,{"$f":"VLOOKUP(H4,チーム表!C:D,2,FALSE)","v":"NISHIファイヤースターズ"},null,{"$f":"組合表!AI4","v":"B1"},{"$f":"CONCATENATE(M4,R4)","v":"B1B2"},8,{"$f":"VLOOKUP(M4,チーム表!C:D,2,FALSE)","v":"杉っ子ドッジファイターズ"},"×",{"$f":"組合表!AJ4","v":"B2"},{"$f":"CONCATENATE(R4,M4)","v":"B2B1"},4,{"$f":"VLOOKUP(R4,チーム表!C:D,2,FALSE)","v":"鵜川ミラクルフェニックス"}]
[2,"09:40:00",{"$f":"組合表!AG5","v":"C1"},{"$f":"CONCATENATE(C5,H5)","v":"C1C2"},3,{"$f":"VLOOKUP(C5,チーム表!C:D,2,FALSE)","v":"田上闘球DREAMS"},"×",{"$f":"組合表!AH5","v":"C2"},{"$f":"CONCATENATE(H5,C5)","v":"C2C1"},9,{"$f":"VLOOKUP(H5,チーム表!C:D,2,FALSE)","v":"千坂ドッジファイヤーズ"},null,{"$f":"組合表!AI5","v":"D1"},{"$f":"CONCATENATE(M5,R5)","v":"D1D2"},8,{"$f":"VLOOKUP(M5,チーム表!C:D,2,FALSE)","v":"大門ドッジボールクラブ"},"×",{"$f":"組合表!AJ5","v":"D2"},{"$f":"CONCATENATE(R5,M5)","v":"D2D1"},6,{"$f":"VLOOKUP(R5,チーム表!C:D,2,FALSE)","v":"鳳至ドッジボールクラブ"}]
[3,"09:50:00",{"$f":"組合表!AG6","v":"K1"},"K1K2",0,{"$f":"VLOOKUP(C6,チーム表!C:D,2,FALSE)","v":"松任の大魔陣Ladies"},"×",{"$f":"組合表!AH6","v":"K2"},"K2K1",7,{"$f":"VLOOKUP(H6,チーム表!C:D,2,FALSE)","v":"鞍月マミ～ズ"},null,"E1","E1E2",4,{"$f":"VLOOKUP(M6,チーム表!C:D,2,FALSE)","v":"鵜川フェニックスｷｯｽﾞ"},"×","E2","E2E1",5,{"$f":"VLOOKUP(R6,チーム表!C:D,2,FALSE)","v":"千坂ロータスルート"},{"$nulls":11},{"$f":"D4","v":"A1A2"},{"$f":"IF(E4=\"\",\"\",E4)","v":11}]
{"$rows_left_out":161}
{"sheet":"リーグ戦表","index":2,"n_rows":176,"n_cols":36,"rows_kept":176,"merged":[[4,0,5,0],[4,1,5,2],[4,3,5,5],[4,6,5,8],[4,9,5,11],[4,12,5,14],[4,15,5,17],[4,18,5,20],[4,21,5,23],[4,24,5,24],[4,25,5,25],[4,26,5,26],[4,27,5,27],[4,28,5,28],[4,29,5,29],[4,30,5,30],[4,31,5,31],[4,32,5,32],[6,0,7,0],[6,1,7,2],[6,3,7,5],[6,24,7,24],[6,25,7,25],[6,26,7,26],[6,27,7,27],[6,28,7,28],[6,29,7,29],[6,30,7,30],[6,31,7,31],[6,32,7,32],[8,0,9,0],[8,1,9,2],[8,6,9,8],[8,24,9,24],[8,25,9,25],[8,26,9,26],[8,27,9,27],[8,28,9,28],[8,29,9,29],[8,30,9,30],[8,31,9,31],[8,32,9,32],[10,0,11,0],[10,1,11,2],[10,9,11,11],[10,24,11,24],[10,25,11,25],[10,26,11,26],[10,27,11,27],[10,28,11,28],[10,29,11,29],[10,30,11,30],[10,31,11,31],[10,32,11,32],[12,0,13,0],[12,1,13,2],[12,12,13,14],[12,24,13,24],[12,25,13,25],[12,26,13,26],[12,27,13,27],[12,28,13,28],[12,29,13,29],[12,30,13,30],[12,31,13,31],[12,32,13,32],[16,0,17,0],[16,1,17,2],[16,3,17,5],[16,6,17,8],[16,9,17,11],[16,12,17,14],[16,15,17,17],[16,18,17,20],[16,21,17,23],[16,24,17,24],[16,25,17,25],[16,26,17,26],[16,27,17,27],[16,28,17,28],[16,29,17,29],[16,30,17,30],[16,31,17,31],[16,32,17,32],[18,0,19,0],[18,1,19,2],[18,3,19,5],[18,24,19,24],[18,25,19,25],[18,26,19,26],[18,27,19,27],[18,28,19,28],[18,29,19,29],[18,30,19,30],[18,31,19,31],[18,32,19,32],[20,0,21,0],[20,1,21,2],[20,6,21,8],[20,24,21,24],[20,25,21,25],[20,26,21,26],[20,27,21,27],[20,28,21,28],[20,29,21,29],[20,30,21,30],[20,31,21,31],[20,32,21,32],[22,0,23,0],[22,1,23,2],[22,9,23,11],[22,24,23,24],[22,25,23,25],[22,26,23,26],[22,27,23,27],[22,28,23,28],[22,29,23,29],[22,30,23,30],[22,31,23,31],[22,32,23,32],[24,0,25,0],[24,1,25,2],[24,12,25,14],[24,24,25,24],[24,25,25,25],[24,26,25,26],[24,27,25,27],[24,28,25,28],[24,29,25,29],[24,30,25,30],[24,31,25,31],[24,32,25,32],[28,0,29,0],[28,1,29,2],[28,3,29,5],[28,6,29,8],[28,9,29,11],[28,12,29,14],[28,15,29,17],[28,18,29,20],[28,21,29,23],[28,24,29,24],[28,25,29,25],[28,26,29,26],[28,27,29,27],[28,28,29,28],[28,29,29,29],[28,30,29,30],[28,31,29,31],[28,32,29,32],[30,0,31,0],[30,1,31,2],[30,3,31,5],[30,24,31,24],[30,25,31,25],[30,26,31,26],[30,27,31,27],[30,28,31,28],[30,29,31,29],[30,30,31,30],[30,31,31,31],[30,32,31,32],[32,0,33,0],[32,1,33,2],[32,6,33,8],[32,24,33,24],[32,25,33,25],[32,26,33,26],[32,27,33,27],[32,28,33,28],[32,29,33,29],[32,30,33,30],[32,31,33,31],[32,32,33,32],[34,0,35,0],[34,1,35,2],[34,9,35,11],[34,24,35,24],[34,25,35,25],[34,26,35,26],[34,27,35,27],[34,28,35,28],[34,29,35,29],[34,30,35,30],[34,31,35,31],[34,32,35,32],[34,35,35,35],[36,0,37,0],[36,1,37,2],[36,12,37,14],[36,24,37,24],[36,25,37,25],[36,26,37,26],[36,27,37,27],[36,28,37,28],[36,29,37,29],[36,30,37,30],[36,31,37,31],[36,32,37,32],[40,0,41,0],[40,1,41,2],[40,3,41,5],[40,6,41,8],[40,9,41,11],[40,12,41,14],[40,15,41,17],[40,18,41,20],[40,21,41,23],[40,24,41,24],[40,25,41,25],[40,26,41,26],[40,27,41,27],[40,28,41,28],[40,29,41,29],[40,30,41,30],[40,31,41,31],[40,32,41,32],[42,0,43,0],[42,1,43,2],[42,3,43,5],[42,24,43,24],[42,25,43,25],[42,26,43,26],[42,27,43,27],[42,28,43,28],[42,29,43,29],[42,30,43,30],[42,31,43,31],[42,32,43,32],[44,0,45,0],[44,1,45,2],[44,6,45,8],[44,24,45,24],[44,25,45,25],[44,26,45,26],[44,27,45,27],[44,28,45,28],[44,29,45,29],[44,30,45,30],[44,31,45,31],[44,32,45,32],[46,0,47,0],[46,1,47,2],[46,9,47,11],[46,24,47,24],[46,25,47,25],[46,26,47,26],[46,27,47,27],[46,28,47,28],[46,29,47,29],[46,30,47,30],[46,31,47,31],[46,32,47,32],[48,0,49,0],[48,1,49,2],[48,12,49,14],[48,24,49,24],[48,25,49,25],[48,26,49,26],[48,27,49,27],[48,28,49,28],[48,29,49,29],[48,30,49,30],[48,31,49,31],[48,32,49,32],[50,1,50,2],[52,0,53,0],[52,1,53,2],[52,3,53,5],[52,6,53,8],[52,9,53,11],[52,12,53,14],[52,15,53,17],[52,18,53,20],[52,21,53,23],[52,24,53,24],[52,25,53,25],[52,26,53,26],[52,27,53,27],[52,28,53,28],[52,29,53,29],[52,30,53,30],[52,31,53,31],[52,32,53,32],[54,0,55,0],[54,1,55,2],[54,3,55,5],[54,24,55,24],[54,25,55,25],[54,26,55,26],[54,27,55,27],[54,28,55,28],[54,29,55,29],[54,30,55,30],[54,31,55,31],[54,32,55,32],[56,0,57,0],[56,1,57,2],[56,6,57,8],[56,24,57,24],[56,25,57,25],[56,26,57,26],[56,27,57,27],[56,28,57,28],[56,29,57,29],[56,30,57,30],[56,31,57,31],[56,32,57,32],[58,0,59,0],[58,1,59,2],[58,9,59,11],[58,24,59,24],[58,25,59,25],[58,26,59,26],[58,27,59,27],[58,28,59,28],[58,29,59,29],[58,30,59,30],[58,31,59,31],[58,32,59,32],[62,0,63,0],[62,1,63,2],[62,3,63,5],[62,6,63,8],[62,9,63,11],[62,12,63,14],[62,15,63,17],[62,18,63,20],[62,21,63,23],[62,24,63,24],[62,25,63,25],[62,26,63,26],[62,27,63,27],[62,28,63,28],[62,29,63,29],[62,30,63,30],[62,31,63,31],[62,32,63,32],[64,0,65,0],[64,1,65,2],[64,3,65,5],[64,24,65,24],[64,25,65,25],[64,26,65,26],[64,27,65,27],[64,28,65,28],[64,29,65,29],[64,30,65,30],[64,31,65,31],[64,32,65,32],[66,0,67,0],[66,1,67,2],[66,6,67,8],[66,24,67,24],[66,25,67,25],[66,26,67,26],[66,27,67,27],[66,28,67,28],[66,29,67,29],[66,30,67,30],[66,31,67,31],[66,32,67,32],[68,0,69,0],[68,1,69,2],[68,9,69,11],[68,24,69,24],[68,25,69,25],[68,26,69,26],[68,27,69,27],[68,28,69,28],[68,29,69,29],[68,30,69,30],[68,31,69,31],[68,32,69,32],[72,0,73,0],[72,1,73,2],[72,3,73,5],[72,6,73,8],[72,9,73,11],[72,12,73,14],[72,15,73,17],[72,18,73,20],[72,21,73,23],[72,24,73,24],[72,25,73,25],[72,26,73,26],[72,27,73,27],[72,28,73,28],[72,29,73,29],[72,30,73,30],[72,31,73,31],[72,32,73,32],[74,0,75,0],[74,1,75,2],[74,3,75,5],[74,24,75,24],[74,25,75,25],[74,26,75,26],[74,27,75,27],[74,28,75,28],[74,29,75,29],[74,30,75,30],[74,31,75,31],[74,32,75,32],[76,0,77,0],[76,1,77,2],[76,6,77,8],[76,24,77,24],[76,25,77,25],[76,26,77,26],[76,27,77,27],[76,28,77,28],[76,29,77,29],[76,30,77,30],[76,31,77,31],[76,32,77,32],[78,0,79,0],[78,1,79,2],[78,9,79,11],[78,24,79,24],[78,25,79,25],[78,26,79,26],[78,27,79,27],[78,28,79,28],[78,29,79,29],[78,30,79,30],[78,31,79,31],[78,32,79,32],[82,0,83,0],[82,1,83,2],[82,3,83,5],[82,6,83,8],[82,9,83,11],[82,12,83,14],[82,15,83,17],[82,18,83,20],[82,21,83,23],[82,24,83,24],[82,25,83,25],[82,26,83,26],[82,27,83,27],[82,28,83,28],[82,29,83,29],[82,30,83,30],[82,31,83,31],[82,32,83,32],[84,0,85,0],[84,1,85,2],[84,3,85,5],[84,24,85,24],[84,25,85,25],[84,26,85,26],[84,27,85,27],[84,28,85,28],[84,29,85,29],[84,30,85,30],[84,31,85,31],[84,32,85,32],[86,0,87,0],[86,1,87,2],[86,6,87,8],[86,24,87,24],[86,25,87,25],[86,26,87,26],[86,27,87,27],[86,28,87,28],[86,29,87,29],[86,30,87,30],[86,31,87,31],[86,32,87,32],[88,0,89,0],[88,1,89,2],[88,9,89,11],[88,24,89,24],[88,25,89,25],[88,26,89,26],[88,27,89,27],[88,28,89,28],[88,29,89,29],[88,30,89,30],[88,31,89,31],[88,32,89,32],[92,0,93,0],[92,1,93,2],[92,3,93,5],[92,6,93,8],[92,9,93,11],[92,12,93,14],[92,15,93,17],[92,18,93,20],[92,21,93,23],[92,24,93,24],[92,25,93,25],[92,26,93,26],[92,27,93,27],[92,28,93,28],[92,29,93,29],[92,30,93,30],[92,31,93,31],[92,32,93,32],[94,0,95,0],[94,1,95,2],[94,3,95,5],[94,24,95,24],[94,25,95,25],[94,26,95,26],[94,27,95,27],[94,28,95,28],[94,29,95,29],[94,30,95,30],[94,31,95,31],[94,32,95,32],[96,0,97,0],[96,1,97,2],[96,6,97,8],[96,24,97,24],[96,25,97,25],[96,26,97,26],[96,27,97,27],[96,28,97,28],[96,29,97,29],[96,30,97,30],[96,31,97,31],[96,32,97,32],[98,0,99,0],[98,1,99,2],[98,9,99,11],[98,24,99,24],[98,25,99,25],[98,26,99,26],[98,27,99,27],[98,28,99,28],[98,29,99,29],[98,30,99,30],[98,31,99,31],[98,32,99,32],[102,0,103,0],[102,1,103,2],[102,3,103,5],[102,6,103,8],[102,9,103,11],[102,12,103,14],[102,15,103,17],[102,18,103,20],[102,21,103,23],[102,24,103,24],[102,25,103,25],[102,26,103,26],[102,27,103,27],[102,28,103,28],[102,29,103,29],[102,30,103,30],[102,31,103,31],[102,32,103,32],[104,0,105,0],[104,1,105,2],[104,3,105,5],[104,24,105,24],[104,25,105,25],[104,26,105,26],[104,27,105,27],[104,28,105,28],[104,29,105,29],[104,30,105,30],[104,31,105,31],[104,32,105,32],[106,0,107,0],[106,1,107,2],[106,6,107,8],[106,24,107,24],[106,25,107,25],[106,26,107,26],[106,27,107,27],[106,28,107,28],[106,29,107,29],[106,30,107,30],[106,31,107,31],[106,32,107,32],[108,0,109,0],[108,1,109,2],[108,9,109,11],[108,24,109,24],[108,25,109,25],[108,26,109,26],[108,27,109,27],[108,28,109,28],[108,29,109,29],[108,30,109,30],[108,31,109,31],[108,32,109,32],[112,0,113,0],[112,1,113,2],[112,3,113,5],[112,6,113,8],[112,9,113,11],[112,12,113,14],[112,15,113,17],[112,18,113,20],[112,21,113,23],[112,24,113,24],[112,25,113,25],[112,26,113,26],[112,27,113,27],[112,28,113,28],[112,29,113,29],[112,30,113,30],[112,31,113,31],[112,32,113,32],[114,0,115,0],[114,1,115,2],[114,3,115,5],[114,24,115,24],[114,25,115,25],[114,26,115,26],[114,27,115,27],[114,28,115,28],[114,29,115,29],[114,30,115,30],[114,31,115,31],[114,32,115,32],[116,0,117,0],[116,1,117,2],[116,6,117,8],[116,24,117,24],[116,25,117,25],[116,26,117,26],[116,27,117,27],[116,28,117,28],[116,29,117,29],[116,30,117,30],[116,31,117,31],[116,32,117,32],[118,0,119,0],[118,1,119,2],[118,9,119,11],[118,24,119,24],[118,25,119,25],[118,26,119,26],[118,27,119,27],[118,28,119,28],[118,29,119,29],[118,30,119,30],[118,31,119,31],[118,32,119,32],[120,0,121,0],[120,1,121,2],[120,12,121,14],[120,24,121,24],[120,25,121,25],[120,26,121,26],[120,27,121,27],[120,28,121,28],[120,29,121,29],[120,30,121,30],[120,31,121,31],[120,32,121,32],[124,0,125,0],[124,1,125,2],[124,3,125,5],[124,6,125,8],[124,9,125,11],[124,12,125,14],[124,15,125,17],[124,18,125,20],[124,21,125,23],[124,24,125,24],[124,25,125,25],[124,26,125,26],[124,27,125,27],[124,28,125,28],[124,29,125,29],[124,30,125,30],[124,31,125,31],[124,32,125,32],[126,0,127,0],[126,1,127,2],[126,3,127,5],[126,24,127,24],[126,25,127,25],[126,26,127,26],[126,27,127,27],[126,28,127,28],[126,29,127,29],[126,30,127,30],[126,31,127,31],[126,32,127,32],[128,0,129,0],[128,1,129,2],[128,6,129,8],[128,24,129,24],[128,25,129,25],[128,26,129,26],[128,27,129,27],[128,28,129,28],[128,29,129,29],[128,30,129,30],[128,31,129,31],[128,32,129,32],[130,0,131,0],[130,1,131,2],[130,9,131,11],[130,24,131,24],[130,25,131,25],[130,26,131,26],[130,27,131,27],[130,28,131,28],[130,29,131,29],[130,30,131,30],[130,31,131,31],[130,32,131,32],[132,0,133,0],[132,1,133,2],[132,12,133,14],[132,24,133,24],[132,25,133,25],[132,26,133,26],[132,27,133,27],[132,28,133,28],[132,29,133,29],[132,30,133,30],[132,31,133,31],[132,32,133,32],[136,0,137,0],[136,1,137,2],[136,3,137,5],[136,6,137,8],[136,9,137,11],[136,12,137,14],[136,15,137,17],[136,18,137,20],[136,21,137,23],[136,24,137,24],[136,25,137,25],[136,26,137,26],[136,27,137,27],[136,28,137,28],[136,29,137,29],[136,30,137,30],[136,31,137,31],[136,32,137,32],[138,0,139,0],[138,1,139,2],[138,3,139,5],[138,24,139,24],[138,25,139,25],[138,26,139,26],[138,27,139,27],[138,28,139,28],[138,29,139,29],[138,30,139,30],[138,31,139,31],[138,32,139,32],[140,0,141,0],[140,1,141,2],[140,6,141,8],[140,24,141,24],[140,25,141,25],[140,26,141,26],[140,27,141,27],[140,28,141,28],[140,29,141,29],[140,30,141,30],[140,31,141,31],[140,32,141,32],[142,0,143,0],[142,1,143,2],[142,9,143,11],[142,24,143,24],[142,25,143,25],[142,26,143,26],[142,27,143,27],[142,28,143,28],[142,29,143,29],[142,30,143,30],[142,31,143,31],[142,32,143,32],[144,0,145,0],[144,1,145,2],[144,12,145,14],[144,24,145,24],[144,25,145,25],[144,26,145,26],[144,27,145,27],[144,28,145,28],[144,29,145,29],[144,30,145,30],[144,31,145,31],[144,32,145,32],[146,1,146,2],[148,0,149,0],[148,1,149,2],[148,3,149,5],[148,6,149,8],[148,9,149,11],[148,12,149,14],[148,15,149,17],[148,18,149,20],[148,21,149,23],[148,24,149,24],[148,25,149,25],[148,26,149,26],[148,27,149,27],[148,28,149,28],[148,29,149,29],[148,30,149,30],[148,31,149,31],[148,32,149,32],[150,0,151,0],[150,1,151,2],[150,3,151,5],[150,24,151,24],[150,25,151,25],[150,26,151,26],[150,27,151,27],[150,28,151,28],[150,29,151,29],[150,30,151,30],[150,31,151,31],[150,32,151,32],[152,0,153,0],[152,1,153,2],[152,6,153,8],[152,24,153,24],[152,25,153,25],[152,26,153,26],[152,27,153,27],[152,28,153,28],[152,29,153,29],[152,30,153,30],[152,31,153,31],[152,32,153,32],[154,0,155,0],[154,1,155,2],[154,9,155,11],[154,24,155,24],[154,25,155,25],[154,26,155,26],[154,27,155,27],[154,28,155,28],[154,29,155,29],[154,30,155,30],[154,31,155,31],[154,32,155,32],[158,0,159,0],[158,1,159,2],[158,3,159,5],[158,6,159,8],[158,9,159,11],[158,12,159,14],[158,15,159,17],[158,18,159,20],[158,21,159,23],[158,24,159,24],[158,25,159,25],[158,26,159,26],[158,27,159,27],[158,28,159,28],[158,29,159,29],[158,30,159,30],[158,31,159,31],[158,32,159,32],[160,0,161,0],[160,1,161,2],[160,3,161,5],[160,24,161,24],[160,25,161,25],[160,26,161,26],[160,27,161,27],[160,28,161,28],[160,29,161,29],[160,30,161,30],[160,31,161,31],[160,32,161,32],[162,0,163,0],[162,1,163,2],[162,6,163,8],[162,24,163,24],[162,25,163,25],[162,26,163,26],[162,27,163,27],[162,28,163,28],[162,29,163,29],[162,30,163,30],[162,31,163,31],[162,32,163,32],[164,0,165,0],[164,1,165,2],[164,9,165,11],[164,24,165,24],[164,25,165,25],[164,26,165,26],[164,27,165,27],[164,28,165,28],[164,29,165,29],[164,30,165,30],[164,31,165,31],[164,32,165,32],[168,0,169,0],[168,1,169,2],[168,3,169,5],[168,6,169,8],[168,9,169,11],[168,12,169,14],[168,15,169,17],[168,18,169,20],[168,21,169,23],[168,24,169,24],[168,25,169,25],[168,26,169,26],[168,27,169,27],[168,28,169,28],[168,29,169,29],[168,30,169,30],[168,31,169,31],[168,32,169,32],[170,0,171,0],[170,1,171,2],[170,3,171,5],[170,24,171,24],[170,25,171,25],[170,26,171,26],[170,27,171,27],[170,28,171,28],[170,29,171,29],[170,30,171,30],[170,31,171,31],[170,32,171,32],[172,0,173,0],[172,1,173,2],[172,6,173,8],[172,24,173,24],[172,25,173,25],[172,26,173,26],[172,27,173,27],[172,28,173,28],[172,29,173,29],[172,30,173,30],[172,31,173,31],[172,32,173,32],[174,0,175,0],[174,1,175,2],[174,9,175,11],[174,24,175,24],[174,25,175,25],[174,26,175,26],[174,27,175,27],[174,28,175,28],[174,29,175,29],[174,30,175,30],[174,31,175,31],[174,32,175,32]]}
[null,{"$f":"チーム表!$B$1","v":"第２７回　いしかわスポーツ・レクリエーション交流大会\n「第１１回ふれあいドッジボール大会」"}]
[null,null,"リーグ戦表"]
[null,"小学生の部"]
[{"$nulls":4},{"$f":"CONCATENATE(A5,\"1\")","v":"A1"},null,null,{"$f":"CONCATENATE(A5,\"2\")","v":"A2"},null,null,{"$f":"CONCATENATE(A5,\"3\")","v":"A3"},null,null,{"$f":"CONCATENATE(A5,\"4\")","v":"A4"}]
["A","チーム名",null,{"$f":"B7","v":"下関福光サンダージュニア"},null,null,{"$f":"B9","v":"NISHIファイヤースターズ"},null,null,{"$f":"B11","v":"小木クラブ"},null,null,{"$f":"B13","v":"松任の大魔陣"},{"$nulls":11},"勝","負","分","点","内野","順位決定点","相手内野","順位","kaku"]
[]
{"$rows_left_out":171}
{"sheet":"トーナメント表","index":3,"n_rows":137,"n_cols":23,"rows_kept":137,"merged":[[4,0,5,0],[4,1,5,9],[8,0,9,0],[8,1,9,9],[9,19,12,19],[10,20,12,26],[12,0,13,0],[12,1,13,9],[16,0,17,0],[16,1,17,9],[19,9,20,17],[21,18,22,19],[23,9,24,17],[31,0,32,0],[31,1,32,9],[33,19,36,19],[34,20,35,25],[35,0,36,0],[35,1,36,9],[37,11,38,12],[39,0,40,0],[39,1,40,9],[42,19,42,20],[53,0,54,0],[53,1,54,9],[57,0,58,0],[57,1,58,9],[61,0,62,0],[61,1,62,9],[62,19,65,19],[63,20,65,26],[65,0,66,0],[65,1,66,9],[69,0,70,0],[69,1,70,9],[73,0,74,0],[73,1,74,9],[76,9,77,17],[77,21,80,21],[80,9,81,17],[86,0,87,0],[86,1,87,9],[90,0,91,0],[90,1,91,9],[91,18,94,18],[92,19,94,26],[94,0,95,0],[94,1,95,9],[98,0,99,0],[98,1,99,9],[105,0,106,0],[105,1,106,9],[109,0,110,0],[109,1,110,9],[113,0,114,0],[113,1,114,9],[114,19,117,19],[115,20,117,26],[117,0,118,0],[117,1,118,9],[121,0,122,0],[121,1,122,9],[125,0,126,0],[125,1,126,9],[130,7,131,8],[130,9,131,14],[135,7,136,8],[135,9,136,14]]}
[null,"決勝トーナメント　小学生の部"]
[]
[null,null,"決勝戦は１セットマッチとする"]
[null,"A1"]
["A1位",{"$f":"VLOOKUP(B4,リーグ戦表!AH:AI,2,0)","v":"下関福光サンダージュニア"},{"$nulls":8},10]
[]
{"$rows_left_out":132}
{"sheet":"表彰状","index":4,"n_rows":0,"n_cols":0,"rows_kept":0}

{"sheet":"DATA","index":5,"n_rows":40,"n_cols":38,"rows_kept":40,"merged":[[4,0,5,0],[4,1,5,2],[4,3,5,5],[4,6,5,8],[4,9,5,11],[4,12,5,14],[4,15,5,17],[4,18,5,20],[4,21,5,23],[4,24,5,24],[4,25,5,25],[4,26,5,26],[4,27,5,27],[4,28,5,28],[4,29,5,29],[4,30,5,30],[4,31,5,31],[4,32,5,32],[6,0,7,0],[6,1,7,2],[6,3,7,5],[6,24,7,24],[6,25,7,25],[6,26,7,26],[6,27,7,27],[6,28,7,28],[6,29,7,29],[6,30,7,30],[6,31,7,31],[6,32,7,32],[8,0,9,0],[8,1,9,2],[8,6,9,8],[8,24,9,24],[8,25,9,25],[8,26,9,26],[8,27,9,27],[8,28,9,28],[8,29,9,29],[8,30,9,30],[8,31,9,31],[8,32,9,32],[10,0,11,0],[10,1,11,2],[10,9,11,11],[10,24,11,24],[10,25,11,25],[10,26,11,26],[10,27,11,27],[10,28,11,28],[10,29,11,29],[10,30,11,30],[10,31,11,31],[10,32,11,32],[12,0,13,0],[12,1,13,2],[12,12,13,14],[12,24,13,24],[12,25,13,25],[12,26,13,26],[12,27,13,27],[12,28,13,28],[12,29,13,29],[12,30,13,30],[12,31,13,31],[12,32,13,32],[14,0,15,0],[14,1,15,2],[14,15,15,17],[14,24,15,24],[14,25,15,25],[14,26,15,26],[14,27,15,27],[14,28,15,28],[14,29,15,29],[14,30,15,30],[14,31,15,31],[14,32,15,32],[16,0,17,0],[16,1,17,2],[16,18,17,20],[16,24,17,24],[16,25,17,25],[16,26,17,26],[16,27,17,27],[16,28,17,28],[16,29,17,29],[16,30,17,30],[16,31,17,31],[16,32,17,32],[18,0,19,0],[18,1,19,2],[18,21,19,23],[18,24,19,24],[18,25,19,25],[18,26,19,26],[18,27,19,27],[18,28,19,28],[18,29,19,29],[18,30,19,30],[18,31,19,31],[18,32,19,32],[23,0,24,0],[23,1,24,2],[23,3,24,5],[23,6,24,8],[23,9,24,11],[23,12,24,14],[23,15,24,17],[23,18,24,20],[23,21,24,23],[23,24,24,24],[23,25,24,25],[23,26,24,26],[23,27,24,27],[23,28,24,28],[23,29,24,29],[23,30,24,30],[23,31,24,31],[23,32,24,32],[25,0,26,0],[25,1,26,2],[25,3,26,5],[25,24,26,24],[25,25,26,25],[25,26,26,26],[25,27,26,27],[25,28,26,28],[25,29,26,29],[25,30,26,30],[25,31,26,31],[25,32,26,32],[27,0,28,0],[27,1,28,2],[27,6,28,8],[27,24,28,24],[27,25,28,25],[27,26,28,26],[27,27,28,27],[27,28,28,28],[27,29,28,29],[27,30,28,30],[27,31,28,31],[27,32,28,32],[29,0,30,0],[29,1,30,2],[29,9,30,11],[29,24,30,24],[29,25,30,25],[29,26,30,26],[29,27,30,27],[29,28,30,28],[29,29,30,29],[29,30,30,30],[29,31,30,31],[29,32,30,32],[31,0,32,0],[31,1,32,2],[31,12,32,14],[31,24,32,24],[31,25,32,25],[31,26,32,26],[31,27,32,27],[31,28,32,28],[31,29,32,29],[31,30,32,30],[31,31,32,31],[31,32,32,32],[33,0,34,0],[33,1,34,2],[33,15,34,17],[33,24,34,24],[33,25,34,25],[33,26,34,26],[33,27,34,27],[33,28,34,28],[33,29,34,29],[33,30,34,30],[33,31,34,31],[33,32,34,32],[35,0,36,0],[35,1,36,2],[35,18,36,20],[35,24,36,24],[35,25,36,25],[35,26,36,26],[35,27,36,27],[35,28,36,28],[35,29,36,29],[35,30,36,30],[35,31,36,31],[35,32,36,32]]}
[]
[]
[]
[{"$nulls":4},{"$f":"CONCATENATE(A5,\"1\")","v":"1"},null,null,{"$f":"CONCATENATE(A5,\"2\")","v":"2"},null,null,{"$f":"CONCATENATE(A5,\"3\")","v":"3"},null,null,{"$f":"CONCATENATE(A5,\"4\")","v":"4"},null,null,{"$f":"CONCATENATE(A5,\"5\")","v":"5"},null,null,{"$f":"CONCATENATE(A5,\"6\")","v":"6"},null,null,{"$f":"CONCATENATE(A5,\"7\")","v":"7"}]
[null,"チーム名",null,{"$f":"B7","v":{"$error":"#N/A"}},null,null,{"$f":"B9","v":{"$error":"#N/A"}},null,null,{"$f":"B11","v":{"$error":"#N/A"}},null,null,{"$f":"B13","v":{"$error":"#N/A"}},null,null,{"$f":"B15","v":{"$error":"#N/A"}},null,null,{"$f":"B17","v":{"$error":"#N/A"}},null,null,{"$f":"B19","v":{"$error":"#N/A"}},null,null,"勝","負","分","点","内野","順位決定点","相手内野","順位","kaku"]
[]
{"$rows_left_out":35}
{"sheet":"DATA1","index":6,"n_rows":0,"n_cols":0,"rows_kept":0}

{"sheet":"対戦表1","index":7,"n_rows":85,"n_cols":34,"rows_kept":85}
{"$rows_empty":74}
[{"$nulls":32},{"$f":"#REF!","v":{"$error":"#REF!"}},{"$f":"IF(#REF!=\"\",\"\",#REF!)","v":{"$error":"#REF!"}}]
[{"$nulls":32},{"$f":"#REF!","v":{"$error":"#REF!"}},{"$f":"IF(#REF!=\"\",\"\",#REF!)","v":{"$error":"#REF!"}}]
[{"$nulls":32},{"$f":"#REF!","v":{"$error":"#REF!"}},{"$f":"IF(#REF!=\"\",\"\",#REF!)","v":{"$error":"#REF!"}}]
[{"$nulls":32},{"$f":"#REF!","v":{"$error":"#REF!"}},{"$f":"IF(#REF!=\"\",\"\",#REF!)","v":{"$error":"#REF!"}}]
[{"$nulls":32},{"$f":"#REF!","v":{"$error":"#REF!"}},{"$f":"IF(#REF!=\"\",\"\",#REF!)","v":{"$error":"#REF!"}}]
{"$rows_left_out":7}
{"sheet":"対戦表2","index":8,"n_rows":165,"n_cols":34,"rows_kept":165}
[{"$nulls":10},{"$f":"チーム表!$B$1","v":"第２７回　いしかわスポーツ・レクリエーション交流大会\n「第１１回ふれあいドッジボール大会」"}]
[]
["　試合スケジュール"]
[]
[null,"時間",null,null,"点","Ａコート",{"$nulls":3},"点","Ａコート",{"$nulls":3},"点","Ｂコート",{"$nulls":3},"点","Ｂコート"]
[1,null,{"$f":"組合表!AG4","v":"A1"},{"$f":"CONCATENATE(C6,H6)","v":"A1A2"},null,{"$f":"VLOOKUP(C6,チーム表!C:D,2,FALSE)","v":"下関福光サンダージュニア"},"×",{"$f":"組合表!AH4","v":"A2"},{"$f":"CONCATENATE(H6,C6)","v":"A2A1"},null,{"$f":"VLOOKUP(H6,チーム表!C:D,2,FALSE)","v":"NISHIファイヤースターズ"},null,{"$f":"組合表!AI4","v":"B1"},{"$f":"CONCATENATE(M6,R6)","v":"B1B2"},null,{"$f":"VLOOKUP(M6,チーム表!C:D,2,FALSE)","v":"杉っ子ドッジファイターズ"},"×",{"$f":"組合表!AJ4","v":"B2"},{"$f":"CONCATENATE(R6,M6)","v":"B2B1"},null,{"$f":"VLOOKUP(R6,チーム表!C:D,2,FALSE)","v":"鵜川ミラクルフェニックス"},{"$nulls":11},{"$f":"D6","v":"A1A2"},{"$f":"IF(E6=\"\",\"\",E6)","v":""}]
{"$rows_left_out":96}
{"sheet":"対戦表3","index":9,"n_rows":245,"n_cols":34,"rows_kept":245}
{"$rows_empty":99}
[{"$nulls":32},{"$f":"#REF!","v":{"$error":"#REF!"}},{"$f":"IF(#REF!=\"\",\"\",#REF!)","v":{"$error":"#REF!"}}]
[{"$nulls":32},{"$f":"#REF!","v":{"$error":"#REF!"}},{"$f":"IF(#REF!=\"\",\"\",#REF!)","v":{"$error":"#REF!"}}]
[{"$nulls":32},{"$f":"#REF!","v":{"$error":"#REF!"}},{"$f":"IF(#REF!=\"\",\"\",#REF!)","v":{"$error":"#REF!"}}]
[{"$nulls":32},{"$f":"#REF!","v":{"$error":"#REF!"}},{"$f":"IF(#REF!=\"\",\"\",#REF!)","v":{"$error":"#REF!"}}]
[{"$nulls":32},{"$f":"#REF!","v":{"$error":"#REF!"}},{"$f":"IF(#REF!=\"\",\"\",#REF!)","v":{"$error":"#REF!"}}]
{"$rows_left_out":142}
{"sheet":"組合表","index":10,"n_rows":72,"n_cols":39,"rows_kept":72,"merged":[[2,32,2,33],[2,34,2,35],[2,36,2,37]]}
[{"$nulls":25},35]
[{"$nulls":25},69]
[1,2,3,4,5,6,7,8,9,10,11,12,13,14,15,16,17,18,19,20,21,22,23,24,25,{"$nulls":7},"Bート",null,"Cコート",null,"Dコート"]
[null,4,"A","A1A2","A3A4","A2A3","A1A4","A1A3","A2A4",{"$nulls":17},"A1A2",null,"A1A2","B1B2",null,null,{"$f":"LEFT(AC4,2)","v":"A1"},{"$f":"RIGHT(AC4,2)","v":"A2"},{"$f":"LEFT(AD4,2)","v":"B1"},{"$f":"RIGHT(AD4,2)","v":"B2"},{"$f":"LEFT(AE4,2)","v":""},{"$f":"RIGHT(AE4,2)","v":""},1]
[null,4,"B","B1B2","B3B4","B2B3","B1B4","B1B3","B2B4",{"$nulls":17},"B1B2",null,"C1C2","D1D2",null,null,{"$f":"LEFT(AC5,2)","v":"C1"},{"$f":"RIGHT(AC5,2)","v":"C2"},{"$f":"LEFT(AD5,2)","v":"D1"},{"$f":"RIGHT(AD5,2)","v":"D2"},{"$f":"LEFT(AE5,2)","v":""},{"$f":"RIGHT(AE5,2)","v":""},2]
[null,4,"C","C1C2","C3C4","C2C3","C1C4","C1C3","C2C4",{"$nulls":17},"C1C2",null,"K1K2","L1L2",null,null,"K1","K2","L1","L2","","",3]
{"$rows_left_out":66}